jmeter-dev mailing list archives

Site index · List index
Message view « Date » · « Thread »
Top « Date » · « Thread »
From Apache Jenkins Server <jenk...@builds.apache.org>
Subject Build failed in Jenkins: JMeter » JMeter Ubuntu #128
Date Wed, 30 Dec 2020 15:11:46 GMT
See <https://ci-builds.apache.org/job/JMeter/job/JMeter%20Ubuntu/128/display/redirect?page=changes>

Changes:

[Felix Schumacher] Markup changes

[Felix Schumacher] Clarify ramp-up period

[Felix Schumacher] Markup changes - add narrow non breaking space before percent signs

[Felix Schumacher] Markup changes - use a definition list


------------------------------------------
[...truncated 190.97 KB...]
Starting standalone test @ Wed Dec 30 15:11:07 UTC 2020 (1609341067289)
Waiting for possible Shutdown/StopTestNow/HeapDump/ThreadDump message on port 4445
summary =      1 in 00:00:02 =    0.6/s Avg:     5 Min:     5 Max:     5 Err:     0 (0.00%)
Tidying up ...    @ Wed Dec 30 15:11:09 UTC 2020 (1609341069493)
... end of run
No errors present in the logfile <https://ci-builds.apache.org/job/JMeter/job/JMeter%20Ubuntu/ws/bin/Bug55375.log>
(the file is empty)

> Task :src:components:test
          0.3sec,    7 completed,   0 failed,   0 skipped, org.apache.jmeter.visualizers.backend.graphite.PickleGraphiteMetricsSenderSpec
          0.0sec,    5 completed,   0 failed,   0 skipped, org.apache.jmeter.visualizers.backend.graphite.TextGraphiteMetricsSenderSpec
WARNING  24.9sec,  505 completed,   0 failed,   4 skipped, Gradle
Test Run :src:components:test

> Task :src:components:check
> Task :src:components:testJar UP-TO-DATE
> Task :src:protocol:http:compileTestJava UP-TO-DATE

> Task :src:dist-check:batchBug56243
Creating summariser <summary>
Created the tree successfully using <https://ci-builds.apache.org/job/JMeter/job/JMeter%20Ubuntu/ws/bin/testfiles/Bug56243.jmx>
Starting standalone test @ Wed Dec 30 15:11:12 UTC 2020 (1609341072723)
Waiting for possible Shutdown/StopTestNow/HeapDump/ThreadDump message on port 4445

> Task :src:protocol:http:compileTestGroovy
> Task :src:protocol:http:testClasses
> Task :src:protocol:http:testJar UP-TO-DATE
> Task :src:protocol:http:spotbugsTest SKIPPED

> Task :src:dist-check:batchBug56243
summary =      9 in 00:00:00 =   58.4/s Avg:     1 Min:     0 Max:     7 Err:     0 (0.00%)
Tidying up ...    @ Wed Dec 30 15:11:13 UTC 2020 (1609341073395)
... end of run
No errors present in the logfile <https://ci-builds.apache.org/job/JMeter/job/JMeter%20Ubuntu/ws/bin/Bug56243.log>
(the file is empty)

> Task :src:dist-check:compileTestJava UP-TO-DATE
> Task :src:dist-check:compileTestGroovy
> Task :src:dist-check:testClasses
> Task :src:dist-check:spotbugsTest SKIPPED

> Task :src:protocol:http:test

Gradle Test Executor 20 STANDARD_OUT
    Setting JMeterHome: <https://ci-builds.apache.org/job/JMeter/job/JMeter%20Ubuntu/ws/src/protocol/http/../../../.>
    Initializing Properties: ../../.././bin/jmeter.properties
    JMeterVersion=5.4.1-SNAPSHOT 2def62e
    java.version=1.8.0_252
    java.vm.name=OpenJDK 64-Bit Server VM
    java.vendor=Oracle Corporation
    java.home=/usr/local/asfpackages/java/openjdk-8u252-b09/jre
    file.encoding=ISO-8859-1
    default encoding=ISO-8859-1
    user.home=/home/jenkins
    user.dir=<https://ci-builds.apache.org/job/JMeter/job/JMeter%20Ubuntu/ws/src/protocol/http>
    user.language=en
    user.region=null
    user.country=US
    user.variant=
    Locale=en_US
    java.class.version=52.0
    java.awt.headless=true
    os.name=Linux
    os.version=4.15.0-118-generic
    os.arch=amd64
          0.3sec,    1 completed,   0 failed,   0 skipped, org.apache.jmeter.resources.ResourceKeyUsageTestHttp

ParseCurlCommandActionTest > testCreateCookieManager(Path) STANDARD_ERROR
    Dec 30, 2020 3:11:19 PM org.apache.tika.config.InitializableProblemHandler$3 handleInitializableProblem
    WARNING: org.xerial's sqlite-jdbc is not loaded.
    Please provide the jar on your classpath to parse sqlite files.
    See tika-parsers/pom.xml for the correct version.
          1.3sec,    4 completed,   0 failed,   0 skipped, org.apache.jmeter.protocol.http.sampler.TestHTTPHC4Impl

> Task :src:dist-check:batchBug56811
Creating summariser <summary>
Created the tree successfully using <https://ci-builds.apache.org/job/JMeter/job/JMeter%20Ubuntu/ws/bin/testfiles/Bug56811.jmx>
Starting standalone test @ Wed Dec 30 15:11:18 UTC 2020 (1609341078961)
Waiting for possible Shutdown/StopTestNow/HeapDump/ThreadDump message on port 4445
summary =      9 in 00:00:00 =   18.8/s Avg:     4 Min:     0 Max:     7 Err:     3 (33.33%)
Tidying up ...    @ Wed Dec 30 15:11:20 UTC 2020 (1609341080101)
... end of run
No errors present in the logfile <https://ci-builds.apache.org/job/JMeter/job/JMeter%20Ubuntu/ws/bin/Bug56811.log>
(the file is empty)

> Task :src:protocol:http:test
          1.8sec,   10 completed,   0 failed,   0 skipped, org.apache.jmeter.protocol.http.proxy.TestHttpRequestHdr
          1.6sec,   22 completed,   0 failed,   0 skipped, org.apache.jmeter.gui.action.ParseCurlCommandActionTest
          0.0sec,    2 completed,   0 failed,   0 skipped, org.apache.jmeter.testelement.TestHeaderManager
          2.1sec, org.apache.jmeter.protocol.http.control.TestCacheManagerUrlConnection
> testPrivateCache()
          2.1sec, org.apache.jmeter.protocol.http.control.TestCacheManagerUrlConnection
> testCacheHttpClientBug51932()
          2.1sec, org.apache.jmeter.protocol.http.control.TestCacheManagerHC4
> testCacheHttpClientBug51932()
          0.3sec,    7 completed,   0 failed,   0 skipped, org.apache.jmeter.protocol.http.proxy.TestProxyControl
          0.0sec,   17 completed,   0 failed,   0 skipped, org.apache.jmeter.protocol.http.modifier.TestURLRewritingModifier
          0.6sec,   18 completed,   0 failed,   0 skipped, org.apache.jmeter.protocol.http.modifier.TestAnchorModifier
          0.0sec,    2 completed,   0 failed,   0 skipped, org.apache.jmeter.protocol.http.sampler.TestHttpWebdav
          2.9sec, org.apache.jmeter.protocol.http.control.TestCacheManagerUrlConnection
> testExpiresBug59962()
          3.1sec, org.apache.jmeter.protocol.http.control.TestCacheManagerUrlConnection
> testExpires()
          0.4sec,    8 completed,   0 failed,   0 skipped, org.apache.jmeter.protocol.http.sampler.PostWriterTest
          0.1sec,    1 completed,   0 failed,   0 skipped, org.apache.jmeter.protocol.http.sampler.PackageTest
          2.3sec, org.apache.jmeter.protocol.http.control.TestCacheManagerHC4
> testPrivateCacheExpireNoMaxAge()
          2.4sec, org.apache.jmeter.protocol.http.control.TestCacheManagerHC4
> testExpiresBug59962()
          2.5sec, org.apache.jmeter.protocol.http.control.TestCacheManagerHC4
> testExpires()
          2.7sec, org.apache.jmeter.protocol.http.control.TestCacheManagerUrlConnection
> testPrivateCacheExpireNoMaxAge()
          0.9sec,    1 completed,   0 failed,   0 skipped, org.apache.jmeter.protocol.http.sampler.TestSerializedHTTPSampler
          0.0sec,   18 completed,   0 failed,   0 skipped, org.apache.jmeter.protocol.http.sampler.TestHTTPSamplers
          0.0sec,    2 completed,   0 failed,   0 skipped, org.apache.jmeter.protocol.http.sampler.PutWriterTest

> Task :src:dist-check:batchBug62239
Creating summariser <summary>
Created the tree successfully using <https://ci-builds.apache.org/job/JMeter/job/JMeter%20Ubuntu/ws/bin/testfiles/Bug62239.jmx>
Starting standalone test @ Wed Dec 30 15:11:22 UTC 2020 (1609341082624)
Waiting for possible Shutdown/StopTestNow/HeapDump/ThreadDump message on port 4445
summary =    108 in 00:00:00 =  310.3/s Avg:     0 Min:     0 Max:     1 Err:     0 (0.00%)
Tidying up ...    @ Wed Dec 30 15:11:23 UTC 2020 (1609341083121)
... end of run
No errors present in the logfile <https://ci-builds.apache.org/job/JMeter/job/JMeter%20Ubuntu/ws/bin/Bug62239.log>
(the file is empty)

> Task :src:protocol:http:test
          1.5sec,    8 completed,   0 failed,   0 skipped, org.apache.jmeter.protocol.http.sampler.TestDecompression
          4.4sec, org.apache.jmeter.protocol.http.control.TestCacheManagerUrlConnection
> testPrivateCacheNoMaxAgeNoExpire()
          4.3sec, org.apache.jmeter.protocol.http.control.TestCacheManagerHC4
> testNoCacheControlNoMaxAgeNoExpire()
          4.7sec, org.apache.jmeter.protocol.http.control.TestCacheManagerUrlConnection
> testNoCacheControlNoMaxAgeNoExpire()
          6.1sec,   25 completed,   0 failed,   0 skipped, org.apache.jmeter.protocol.http.control.TestCacheManagerUrlConnection
          0.7sec,   16 completed,   0 failed,   0 skipped, org.apache.jmeter.protocol.http.sampler.ParallelResourcesAndIpSource
          4.9sec, org.apache.jmeter.protocol.http.control.TestCacheManagerHC4
> testPrivateCacheNoMaxAgeNoExpire()
          7.1sec,   26 completed,   0 failed,   0 skipped, org.apache.jmeter.protocol.http.control.TestCacheManagerHC4

> Task :src:dist-check:batchFTP_TESTS
Creating summariser <summary>
Created the tree successfully using <https://ci-builds.apache.org/job/JMeter/job/JMeter%20Ubuntu/ws/bin/testfiles/FTP_TESTS.jmx>
Starting standalone test @ Wed Dec 30 15:11:25 UTC 2020 (1609341085314)
Waiting for possible Shutdown/StopTestNow/HeapDump/ThreadDump message on port 4445
summary =      6 in 00:00:03 =    2.2/s Avg:   263 Min:    11 Max:  1342 Err:     0 (0.00%)
Tidying up ...    @ Wed Dec 30 15:11:28 UTC 2020 (1609341088830)
... end of run
WARNING: the task was configured to ignore errors in the output log
Logfile contents (errors during the test, see <https://ci-builds.apache.org/job/JMeter/job/JMeter%20Ubuntu/ws/bin/FTP_TESTS.log)>:
2020-12-30 15:11:28,747 WARN o.a.f.l.n.FtpLoggingFilter: EXCEPTION :
org.apache.mina.core.write.WriteToClosedSessionException: null
	at org.apache.mina.core.polling.AbstractPollingIoProcessor$Processor.clearWriteRequestQueue(AbstractPollingIoProcessor.java:1210)
~[mina-core-2.0.19.jar:?]
	at org.apache.mina.core.polling.AbstractPollingIoProcessor$Processor.removeNow(AbstractPollingIoProcessor.java:1162)
~[mina-core-2.0.19.jar:?]
	at org.apache.mina.core.polling.AbstractPollingIoProcessor$Processor.removeSessions(AbstractPollingIoProcessor.java:864)
~[mina-core-2.0.19.jar:?]
	at org.apache.mina.core.polling.AbstractPollingIoProcessor$Processor.run(AbstractPollingIoProcessor.java:694)
~[mina-core-2.0.19.jar:?]
	at org.apache.mina.util.NamePreservingRunnable.run(NamePreservingRunnable.java:64) ~[mina-core-2.0.19.jar:?]
	at java.util.concurrent.ThreadPoolExecutor.runWorker(ThreadPoolExecutor.java:1149) ~[?:1.8.0_252]
	at java.util.concurrent.ThreadPoolExecutor$Worker.run(ThreadPoolExecutor.java:624) ~[?:1.8.0_252]
	at java.lang.Thread.run(Thread.java:748) [?:1.8.0_252]
2020-12-30 15:11:28,760 WARN o.a.f.i.DefaultFtpHandler: Client closed connection before all
replies could be sent, last reply was WriteRequest: HeapBuffer[pos=0 lim=14 cap=14: 32 32
31 20 47 6F 6F 64 62 79 65 2E 0D 0A]

> Task :src:dist-check:batchHTMLParserTestFile_2
Creating summariser <summary>
Created the tree successfully using <https://ci-builds.apache.org/job/JMeter/job/JMeter%20Ubuntu/ws/bin/testfiles/HTMLParserTestFile_2.jmx>
Starting standalone test @ Wed Dec 30 15:11:30 UTC 2020 (1609341090724)
Waiting for possible Shutdown/StopTestNow/HeapDump/ThreadDump message on port 4445
summary +      1 in 00:00:00 =    3.6/s Avg:   173 Min:   173 Max:   173 Err:     0 (0.00%)
Active: 1 Started: 1 Finished: 0
summary =      1 in 00:00:00 =    3.6/s Avg:   173 Min:   173 Max:   173 Err:     0 (0.00%)
Tidying up ...    @ Wed Dec 30 15:11:31 UTC 2020 (1609341091480)
... end of run
No errors present in the logfile <https://ci-builds.apache.org/job/JMeter/job/JMeter%20Ubuntu/ws/bin/HTMLParserTestFile_2.log>
(the file is empty)

> Task :src:dist-check:batchHttp4ImplDigestAuth SKIPPED

> Task :src:protocol:http:test
          6.1sec, org.apache.jmeter.protocol.http.control.DnsManagerTest
> badDnsInCustomResolverShouldFailHttpSampler(String, WireMockServer)[1], [1]
HttpClient4
WARNING   6.1sec,    2 completed,   0 failed,   1 skipped, org.apache.jmeter.protocol.http.control.DnsManagerTest
          0.2sec,    6 completed,   0 failed,   0 skipped, org.apache.jmeter.protocol.http.control.TestAuthManager
          0.0sec,    1 completed,   0 failed,   0 skipped, org.apache.jmeter.protocol.http.control.TestAuthorization
          0.1sec,    4 completed,   0 failed,   0 skipped, org.apache.jmeter.protocol.http.control.TestCookieManagerThreadIteration
          0.0sec,    1 completed,   0 failed,   0 skipped, org.apache.jmeter.protocol.http.control.gui.TestHttpTestSampleGui
          0.2sec,   33 completed,   0 failed,   0 skipped, org.apache.jmeter.protocol.http.control.TestHC4CookieManager
          0.1sec,    5 completed,   0 failed,   0 skipped, org.apache.jmeter.protocol.http.control.TestCacheManagerThreadIteration
          0.0sec,    2 completed,   0 failed,   0 skipped, org.apache.jmeter.protocol.http.control.TestAuthManagerThreadIteration
          0.0sec,    5 completed,   0 failed,   0 skipped, org.apache.jmeter.protocol.http.util.TestHTTPFileArgs
          0.0sec,   20 completed,   0 failed,   0 skipped, org.apache.jmeter.protocol.http.util.TestGraphQLRequestParamUtils
          0.0sec,    3 completed,   0 failed,   0 skipped, org.apache.jmeter.protocol.http.util.TestHTTPArgument
          0.0sec,    6 completed,   0 failed,   0 skipped, org.apache.jmeter.protocol.http.util.accesslog.TestLogFilter
          0.0sec,    4 completed,   0 failed,   0 skipped, org.apache.jmeter.protocol.http.util.accesslog.TestTCLogParser
          0.0sec,    3 completed,   0 failed,   0 skipped, org.apache.jmeter.protocol.http.util.accesslog.TestSessionFilter
          0.0sec,    3 completed,   0 failed,   0 skipped, org.apache.jmeter.protocol.http.util.TestHTTPFileArg
          0.3sec,    4 completed,   0 failed,   0 skipped, org.apache.jmeter.protocol.http.parser.TestCssParser
          0.0sec,    6 completed,   0 failed,   0 skipped, org.apache.jmeter.protocol.http.parser.TestHtmlParsingUtils
          0.0sec,    2 completed,   0 failed,   0 skipped, org.apache.jmeter.protocol.http.parser.TestBaseParser
          0.0sec,    3 completed,   0 failed,   0 skipped, org.apache.jmeter.protocol.http.config.MultipartUrlConfigTest
          0.0sec,    2 completed,   0 failed,   0 skipped, org.apache.jmeter.protocol.http.config.UrlConfigTest
          0.0sec,    7 completed,   0 failed,   0 skipped, org.apache.jmeter.protocol.http.visualizers.RequestViewHTTPTest
          0.1sec,   64 completed,   0 failed,   0 skipped, org.apache.jmeter.curl.BasicCurlParserTest

TestHTTPSamplersAgainstHttpMirrorServer > testPostRequest_BodyFromParameterValues -1 STANDARD_OUT

    >>>>>>>>>>>>>>>>>>>> expected:
    mytitlemydescription
    ==================== actual:

    <<<<<<<<<<<<<<<<<<<<
    URL=http://localhost:8182/test/somescript.jsp
FAILURE   0.0sec, org.apache.jmeter.protocol.http.sampler.TestHTTPSamplersAgainstHttpMirrorServer
> testPostRequest_BodyFromParameterValues -1
    junit.framework.AssertionFailedError: arrays have different length, expected is 20, actual
is 0
        at junit.framework.Assert.fail(Assert.java:57)
        at junit.framework.TestCase.fail(TestCase.java:223)
        at org.apache.jmeter.protocol.http.sampler.TestHTTPSamplersAgainstHttpMirrorServer.checkArraysHaveSameContent(TestHTTPSamplersAgainstHttpMirrorServer.java:1301)
        at org.apache.jmeter.protocol.http.sampler.TestHTTPSamplersAgainstHttpMirrorServer.checkPostRequestBody(TestHTTPSamplersAgainstHttpMirrorServer.java:971)
        at org.apache.jmeter.protocol.http.sampler.TestHTTPSamplersAgainstHttpMirrorServer.testPostRequest_BodyFromParameterValues(TestHTTPSamplersAgainstHttpMirrorServer.java:524)
        at org.apache.jmeter.protocol.http.sampler.TestHTTPSamplersAgainstHttpMirrorServer.testPostRequest_BodyFromParameterValues(TestHTTPSamplersAgainstHttpMirrorServer.java:165)

FAILURE   0.3sec,   53 completed,   1 failed,   0 skipped, org.apache.jmeter.protocol.http.sampler.TestHTTPSamplersAgainstHttpMirrorServer
WARNING   0.0sec,    2 completed,   0 failed,   2 skipped, org.apache.jmeter.protocol.http.sampler.SamplingNamingTest
          0.9sec,    9 completed,   0 failed,   0 skipped, org.apache.jmeter.protocol.http.control.TestHTTPMirrorThread
          0.2sec,   50 completed,   0 failed,   0 skipped, org.apache.jmeter.protocol.http.parser.TestBug60842HtmlParser
          0.7sec,  103 completed,   0 failed,   0 skipped, org.apache.jmeter.protocol.http.parser.TestHTMLParser
          0.0sec,    7 completed,   0 failed,   0 skipped, org.apache.jmeter.protocol.http.visualizers.RequestViewHTTPTest
          0.4sec,   11 completed,   0 failed,   0 skipped, org.apache.jmeter.protocol.http.control.DNSCacheManagerSpec
          0.2sec,   58 completed,   0 failed,   0 skipped, org.apache.jmeter.protocol.http.util.HTTPUtilsSpec
FAILURE  21.9sec,  667 completed,   1 failed,   3 skipped,
Gradle Test Run :src:protocol:http:test

667 tests completed, 1 failed, 3 skipped

> Task :src:protocol:http:test FAILED

> Task :src:dist-check:batchHttp4ImplPreemptiveBasicAuth
Creating summariser <summary>
Created the tree successfully using <https://ci-builds.apache.org/job/JMeter/job/JMeter%20Ubuntu/ws/bin/testfiles/Http4ImplPreemptiveBasicAuth.jmx>
Starting standalone test @ Wed Dec 30 15:11:33 UTC 2020 (1609341093560)
Waiting for possible Shutdown/StopTestNow/HeapDump/ThreadDump message on port 4445
summary =     12 in 00:00:10 =    1.3/s Avg:   462 Min:   169 Max:  1002 Err:     0 (0.00%)
Tidying up ...    @ Wed Dec 30 15:11:43 UTC 2020 (1609341103874)
... end of run
No errors present in the logfile <https://ci-builds.apache.org/job/JMeter/job/JMeter%20Ubuntu/ws/bin/Http4ImplPreemptiveBasicAuth.log>
(the file is empty)
checksum-dependency elapsed time: 129728ms, configurations processed: 272
    SHA-512 computation time: 17197ms (goes in parallel, it might exceed wall-clock time),
files processed: 28, processed: 8MiB, skipped: 3077MiB
    PGP signature resolution time: 5452ms (wall-clock), resolution requests: 162, signatures
resolved: 250
    PGP key resolution time: 96050ms (wall-clock), resolution requests: 162, download time:
0ms (goes in parallel, it might exceed wall-clock time), keys downloaded: 0
        PGP signature verification time: 155511ms (goes in parallel, it might exceed wall-clock
time), files processed: 525, processed: 570MiB, skipped: 2490MiB

FAILURE: Build failed with an exception.

* What went wrong:
Execution failed for task ':src:protocol:http:test'.
> There were failing tests. See the report at: file:///home/jenkins/workspace/JMeter/JMeter%20Ubuntu/src/protocol/http/build/reports/tests/test/index.html

* Try:
Run with --stacktrace option to get the stack trace. Run with --info or --debug option to
get more log output. Run with --scan to get full insights.

* Get more help at https://help.gradle.org

Deprecated Gradle features were used in this build, making it incompatible with Gradle 7.0.
Use '--warning-mode all' to show the individual deprecation warnings.
See https://docs.gradle.org/6.7/userguide/command_line_interface.html#sec:command_line_warnings

BUILD FAILED in 3m 11s
246 actionable tasks: 107 executed, 139 up-to-date
Build step 'Invoke Gradle script' changed build result to FAILURE
Build step 'Invoke Gradle script' marked build as failure

Mime
View raw message