jmeter-dev mailing list archives

Site index · List index
Message view « Date » · « Thread »
Top « Date » · « Thread »
From Apache Jenkins Server <jenk...@builds.apache.org>
Subject Build failed in Jenkins: JMeter » JMeter Ubuntu #110
Date Sat, 12 Dec 2020 16:56:06 GMT
See <https://ci-builds.apache.org/job/JMeter/job/JMeter%20Ubuntu/110/display/redirect?page=changes>

Changes:

[Philippe Mouawad] Updated dnsjava to 3.3.1 (from 2.1.9)

[Philippe Mouawad] Updated dnsjava to 3.3.1 (from 2.1.9)


------------------------------------------
[...truncated 226.55 KB...]
	at org.apache.jmeter.util.JSR223TestElement.processFileOrScript(JSR223TestElement.java:217)
[ApacheJMeter_core.jar:5.4.1-SNAPSHOT]
	at org.apache.jmeter.protocol.java.sampler.JSR223Sampler.sample(JSR223Sampler.java:72) [ApacheJMeter_java.jar:5.4.1-SNAPSHOT]
	at org.apache.jmeter.threads.JMeterThread.doSampling(JMeterThread.java:635) [ApacheJMeter_core.jar:5.4.1-SNAPSHOT]
	at org.apache.jmeter.threads.JMeterThread.executeSamplePackage(JMeterThread.java:558) [ApacheJMeter_core.jar:5.4.1-SNAPSHOT]
	at org.apache.jmeter.threads.JMeterThread.processSampler(JMeterThread.java:489) [ApacheJMeter_core.jar:5.4.1-SNAPSHOT]
	at org.apache.jmeter.threads.JMeterThread.run(JMeterThread.java:256) [ApacheJMeter_core.jar:5.4.1-SNAPSHOT]
	at java.lang.Thread.run(Thread.java:748) [?:1.8.0_252]
Caused by: java.io.IOException: Failed to bind to server socket: tcp://localhost:61616 due
to: java.net.BindException: Address already in use (Bind failed)
	at org.apache.activemq.util.IOExceptionSupport.create(IOExceptionSupport.java:34) ~[activemq-client-5.16.0.jar:5.16.0]
	at org.apache.activemq.transport.tcp.TcpTransportServer.bind(TcpTransportServer.java:146)
~[activemq-client-5.16.0.jar:5.16.0]
	at org.apache.activemq.transport.tcp.TcpTransportFactory.doBind(TcpTransportFactory.java:62)
~[activemq-client-5.16.0.jar:5.16.0]
	at org.apache.activemq.transport.TransportFactorySupport.bind(TransportFactorySupport.java:40)
~[activemq-broker-5.16.0.jar:5.16.0]
	at org.apache.activemq.broker.TransportConnector.createTransportServer(TransportConnector.java:333)
~[activemq-broker-5.16.0.jar:5.16.0]
	at org.apache.activemq.broker.TransportConnector.getServer(TransportConnector.java:143) ~[activemq-broker-5.16.0.jar:5.16.0]
	at org.apache.activemq.broker.TransportConnector.start(TransportConnector.java:210) ~[activemq-broker-5.16.0.jar:5.16.0]
	at org.apache.activemq.broker.BrokerService.startTransportConnector(BrokerService.java:2764)
~[activemq-broker-5.16.0.jar:5.16.0]
	at org.apache.activemq.broker.BrokerService.startAllConnectors(BrokerService.java:2657) ~[activemq-broker-5.16.0.jar:5.16.0]
	at org.apache.activemq.broker.BrokerService.doStartBroker(BrokerService.java:779) ~[activemq-broker-5.16.0.jar:5.16.0]
	at org.apache.activemq.broker.BrokerService.startBroker(BrokerService.java:741) ~[activemq-broker-5.16.0.jar:5.16.0]
	at org.apache.activemq.broker.BrokerService.start(BrokerService.java:644) ~[activemq-broker-5.16.0.jar:5.16.0]
	at org.apache.activemq.xbean.XBeanBrokerService.afterPropertiesSet(XBeanBrokerService.java:73)
~[activemq-spring-5.16.0.jar:5.16.0]
	at sun.reflect.NativeMethodAccessorImpl.invoke0(Native Method) ~[?:1.8.0_252]
	at sun.reflect.NativeMethodAccessorImpl.invoke(NativeMethodAccessorImpl.java:62) ~[?:1.8.0_252]
	at sun.reflect.DelegatingMethodAccessorImpl.invoke(DelegatingMethodAccessorImpl.java:43)
~[?:1.8.0_252]
	at java.lang.reflect.Method.invoke(Method.java:498) ~[?:1.8.0_252]
	at org.springframework.beans.factory.support.AbstractAutowireCapableBeanFactory.invokeCustomInitMethod(AbstractAutowireCapableBeanFactory.java:1763)
~[spring-beans-4.3.17.RELEASE.jar:4.3.17.RELEASE]
	at org.springframework.beans.factory.support.AbstractAutowireCapableBeanFactory.invokeInitMethods(AbstractAutowireCapableBeanFactory.java:1700)
~[spring-beans-4.3.17.RELEASE.jar:4.3.17.RELEASE]
	at org.springframework.beans.factory.support.AbstractAutowireCapableBeanFactory.initializeBean(AbstractAutowireCapableBeanFactory.java:1630)
~[spring-beans-4.3.17.RELEASE.jar:4.3.17.RELEASE]
	... 31 more
Caused by: java.net.BindException: Address already in use (Bind failed)
	at java.net.PlainSocketImpl.socketBind(Native Method) ~[?:1.8.0_252]
	at java.net.AbstractPlainSocketImpl.bind(AbstractPlainSocketImpl.java:387) ~[?:1.8.0_252]
	at java.net.ServerSocket.bind(ServerSocket.java:390) ~[?:1.8.0_252]
	at java.net.ServerSocket.<init>(ServerSocket.java:252) ~[?:1.8.0_252]
	at javax.net.DefaultServerSocketFactory.createServerSocket(ServerSocketFactory.java:231)
~[?:1.8.0_252]
	at org.apache.activemq.transport.tcp.TcpTransportServer.bind(TcpTransportServer.java:143)
~[activemq-client-5.16.0.jar:5.16.0]
	at org.apache.activemq.transport.tcp.TcpTransportFactory.doBind(TcpTransportFactory.java:62)
~[activemq-client-5.16.0.jar:5.16.0]
	at org.apache.activemq.transport.TransportFactorySupport.bind(TransportFactorySupport.java:40)
~[activemq-broker-5.16.0.jar:5.16.0]
	at org.apache.activemq.broker.TransportConnector.createTransportServer(TransportConnector.java:333)
~[activemq-broker-5.16.0.jar:5.16.0]
	at org.apache.activemq.broker.TransportConnector.getServer(TransportConnector.java:143) ~[activemq-broker-5.16.0.jar:5.16.0]
	at org.apache.activemq.broker.TransportConnector.start(TransportConnector.java:210) ~[activemq-broker-5.16.0.jar:5.16.0]
	at org.apache.activemq.broker.BrokerService.startTransportConnector(BrokerService.java:2764)
~[activemq-broker-5.16.0.jar:5.16.0]
	at org.apache.activemq.broker.BrokerService.startAllConnectors(BrokerService.java:2657) ~[activemq-broker-5.16.0.jar:5.16.0]
	at org.apache.activemq.broker.BrokerService.doStartBroker(BrokerService.java:779) ~[activemq-broker-5.16.0.jar:5.16.0]
	at org.apache.activemq.broker.BrokerService.startBroker(BrokerService.java:741) ~[activemq-broker-5.16.0.jar:5.16.0]
	at org.apache.activemq.broker.BrokerService.start(BrokerService.java:644) ~[activemq-broker-5.16.0.jar:5.16.0]
	at org.apache.activemq.xbean.XBeanBrokerService.afterPropertiesSet(XBeanBrokerService.java:73)
~[activemq-spring-5.16.0.jar:5.16.0]
	at sun.reflect.NativeMethodAccessorImpl.invoke0(Native Method) ~[?:1.8.0_252]
	at sun.reflect.NativeMethodAccessorImpl.invoke(NativeMethodAccessorImpl.java:62) ~[?:1.8.0_252]
	at sun.reflect.DelegatingMethodAccessorImpl.invoke(DelegatingMethodAccessorImpl.java:43)
~[?:1.8.0_252]
	at java.lang.reflect.Method.invoke(Method.java:498) ~[?:1.8.0_252]
	at org.springframework.beans.factory.support.AbstractAutowireCapableBeanFactory.invokeCustomInitMethod(AbstractAutowireCapableBeanFactory.java:1763)
~[spring-beans-4.3.17.RELEASE.jar:4.3.17.RELEASE]
	at org.springframework.beans.factory.support.AbstractAutowireCapableBeanFactory.invokeInitMethods(AbstractAutowireCapableBeanFactory.java:1700)
~[spring-beans-4.3.17.RELEASE.jar:4.3.17.RELEASE]
	at org.springframework.beans.factory.support.AbstractAutowireCapableBeanFactory.initializeBean(AbstractAutowireCapableBeanFactory.java:1630)
~[spring-beans-4.3.17.RELEASE.jar:4.3.17.RELEASE]
	... 31 more
2020-12-12 16:55:29,809 ERROR o.a.j.p.j.s.J.BSS_startActiveMQ: Error configuring ActiveMQ
org.springframework.beans.factory.BeanCreationException: Error creating bean with name 'org.apache.activemq.xbean.XBeanBrokerService#0'
defined in URL [file:<https://ci-builds.apache.org/job/JMeter/job/JMeter%20Ubuntu/ws/bin/testfiles/activemq.xml]>:
Invocation of init method failed; nested exception is java.io.IOException: Failed to bind
to server socket: tcp://localhost:61616 due to: java.net.BindException: Address already in
use (Bind failed)
	at org.springframework.beans.factory.support.AbstractAutowireCapableBeanFactory.initializeBean(AbstractAutowireCapableBeanFactory.java:1634)
~[spring-beans-4.3.17.RELEASE.jar:4.3.17.RELEASE]
	at org.springframework.beans.factory.support.AbstractAutowireCapableBeanFactory.doCreateBean(AbstractAutowireCapableBeanFactory.java:555)
~[spring-beans-4.3.17.RELEASE.jar:4.3.17.RELEASE]
	at org.springframework.beans.factory.support.AbstractAutowireCapableBeanFactory.createBean(AbstractAutowireCapableBeanFactory.java:483)
~[spring-beans-4.3.17.RELEASE.jar:4.3.17.RELEASE]
	at org.springframework.beans.factory.support.AbstractBeanFactory$1.getObject(AbstractBeanFactory.java:312)
~[spring-beans-4.3.17.RELEASE.jar:4.3.17.RELEASE]
	at org.springframework.beans.factory.support.DefaultSingletonBeanRegistry.getSingleton(DefaultSingletonBeanRegistry.java:230)
~[spring-beans-4.3.17.RELEASE.jar:4.3.17.RELEASE]
	at org.springframework.beans.factory.support.AbstractBeanFactory.doGetBean(AbstractBeanFactory.java:308)
~[spring-beans-4.3.17.RELEASE.jar:4.3.17.RELEASE]
	at org.springframework.beans.factory.support.AbstractBeanFactory.getBean(AbstractBeanFactory.java:197)
~[spring-beans-4.3.17.RELEASE.jar:4.3.17.RELEASE]
	at org.springframework.beans.factory.support.DefaultListableBeanFactory.preInstantiateSingletons(DefaultListableBeanFactory.java:761)
~[spring-beans-4.3.17.RELEASE.jar:4.3.17.RELEASE]
	at org.springframework.context.support.AbstractApplicationContext.finishBeanFactoryInitialization(AbstractApplicationContext.java:867)
~[spring-context-4.3.17.RELEASE.jar:4.3.17.RELEASE]
	at org.springframework.context.support.AbstractApplicationContext.refresh(AbstractApplicationContext.java:543)
~[spring-context-4.3.17.RELEASE.jar:4.3.17.RELEASE]
	at org.apache.xbean.spring.context.ResourceXmlApplicationContext.<init>(ResourceXmlApplicationContext.java:64)
~[xbean-spring-4.17.jar:4.17]
	at org.apache.xbean.spring.context.ResourceXmlApplicationContext.<init>(ResourceXmlApplicationContext.java:52)
~[xbean-spring-4.17.jar:4.17]
	at org.apache.activemq.xbean.XBeanBrokerFactory$1.<init>(XBeanBrokerFactory.java:104)
~[activemq-spring-5.16.0.jar:5.16.0]
	at org.apache.activemq.xbean.XBeanBrokerFactory.createApplicationContext(XBeanBrokerFactory.java:104)
~[activemq-spring-5.16.0.jar:5.16.0]
	at org.apache.activemq.xbean.XBeanBrokerFactory.createBroker(XBeanBrokerFactory.java:67)
~[activemq-spring-5.16.0.jar:5.16.0]
	at org.apache.activemq.broker.BrokerFactory.createBroker(BrokerFactory.java:71) ~[activemq-broker-5.16.0.jar:5.16.0]
	at org.apache.activemq.broker.BrokerFactory.createBroker(BrokerFactory.java:98) ~[activemq-broker-5.16.0.jar:5.16.0]
	at org.apache.activemq.broker.BrokerFactory$createBroker.call(Unknown Source) ~[?:?]
	at org.codehaus.groovy.runtime.callsite.CallSiteArray.defaultCall(CallSiteArray.java:47)
[groovy-3.0.5.jar:3.0.5]
	at org.codehaus.groovy.runtime.callsite.AbstractCallSite.call(AbstractCallSite.java:125)
[groovy-3.0.5.jar:3.0.5]
	at org.codehaus.groovy.runtime.callsite.AbstractCallSite.call(AbstractCallSite.java:148)
[groovy-3.0.5.jar:3.0.5]
	at Script1.run(Script1.groovy:15) [script:?]
	at org.codehaus.groovy.jsr223.GroovyScriptEngineImpl.eval(GroovyScriptEngineImpl.java:317)
[groovy-jsr223-3.0.5.jar:3.0.5]
	at org.codehaus.groovy.jsr223.GroovyCompiledScript.eval(GroovyCompiledScript.java:71) [groovy-jsr223-3.0.5.jar:3.0.5]
	at javax.script.CompiledScript.eval(CompiledScript.java:92) [?:1.8.0_252]
	at org.apache.jmeter.util.JSR223TestElement.processFileOrScript(JSR223TestElement.java:217)
[ApacheJMeter_core.jar:5.4.1-SNAPSHOT]
	at org.apache.jmeter.protocol.java.sampler.JSR223Sampler.sample(JSR223Sampler.java:72) [ApacheJMeter_java.jar:5.4.1-SNAPSHOT]
	at org.apache.jmeter.threads.JMeterThread.doSampling(JMeterThread.java:635) [ApacheJMeter_core.jar:5.4.1-SNAPSHOT]
	at org.apache.jmeter.threads.JMeterThread.executeSamplePackage(JMeterThread.java:558) [ApacheJMeter_core.jar:5.4.1-SNAPSHOT]
	at org.apache.jmeter.threads.JMeterThread.processSampler(JMeterThread.java:489) [ApacheJMeter_core.jar:5.4.1-SNAPSHOT]
	at org.apache.jmeter.threads.JMeterThread.run(JMeterThread.java:256) [ApacheJMeter_core.jar:5.4.1-SNAPSHOT]
	at java.lang.Thread.run(Thread.java:748) [?:1.8.0_252]
Caused by: java.io.IOException: Failed to bind to server socket: tcp://localhost:61616 due
to: java.net.BindException: Address already in use (Bind failed)
	at org.apache.activemq.util.IOExceptionSupport.create(IOExceptionSupport.java:34) ~[activemq-client-5.16.0.jar:5.16.0]
	at org.apache.activemq.transport.tcp.TcpTransportServer.bind(TcpTransportServer.java:146)
~[activemq-client-5.16.0.jar:5.16.0]
	at org.apache.activemq.transport.tcp.TcpTransportFactory.doBind(TcpTransportFactory.java:62)
~[activemq-client-5.16.0.jar:5.16.0]
	at org.apache.activemq.transport.TransportFactorySupport.bind(TransportFactorySupport.java:40)
~[activemq-broker-5.16.0.jar:5.16.0]
	at org.apache.activemq.broker.TransportConnector.createTransportServer(TransportConnector.java:333)
~[activemq-broker-5.16.0.jar:5.16.0]
	at org.apache.activemq.broker.TransportConnector.getServer(TransportConnector.java:143) ~[activemq-broker-5.16.0.jar:5.16.0]
	at org.apache.activemq.broker.TransportConnector.start(TransportConnector.java:210) ~[activemq-broker-5.16.0.jar:5.16.0]
	at org.apache.activemq.broker.BrokerService.startTransportConnector(BrokerService.java:2764)
~[activemq-broker-5.16.0.jar:5.16.0]
	at org.apache.activemq.broker.BrokerService.startAllConnectors(BrokerService.java:2657) ~[activemq-broker-5.16.0.jar:5.16.0]
	at org.apache.activemq.broker.BrokerService.doStartBroker(BrokerService.java:779) ~[activemq-broker-5.16.0.jar:5.16.0]
	at org.apache.activemq.broker.BrokerService.startBroker(BrokerService.java:741) ~[activemq-broker-5.16.0.jar:5.16.0]
	at org.apache.activemq.broker.BrokerService.start(BrokerService.java:644) ~[activemq-broker-5.16.0.jar:5.16.0]
	at org.apache.activemq.xbean.XBeanBrokerService.afterPropertiesSet(XBeanBrokerService.java:73)
~[activemq-spring-5.16.0.jar:5.16.0]
	at sun.reflect.NativeMethodAccessorImpl.invoke0(Native Method) ~[?:1.8.0_252]
	at sun.reflect.NativeMethodAccessorImpl.invoke(NativeMethodAccessorImpl.java:62) ~[?:1.8.0_252]
	at sun.reflect.DelegatingMethodAccessorImpl.invoke(DelegatingMethodAccessorImpl.java:43)
~[?:1.8.0_252]
	at java.lang.reflect.Method.invoke(Method.java:498) ~[?:1.8.0_252]
	at org.springframework.beans.factory.support.AbstractAutowireCapableBeanFactory.invokeCustomInitMethod(AbstractAutowireCapableBeanFactory.java:1763)
~[spring-beans-4.3.17.RELEASE.jar:4.3.17.RELEASE]
	at org.springframework.beans.factory.support.AbstractAutowireCapableBeanFactory.invokeInitMethods(AbstractAutowireCapableBeanFactory.java:1700)
~[spring-beans-4.3.17.RELEASE.jar:4.3.17.RELEASE]
	at org.springframework.beans.factory.support.AbstractAutowireCapableBeanFactory.initializeBean(AbstractAutowireCapableBeanFactory.java:1630)
~[spring-beans-4.3.17.RELEASE.jar:4.3.17.RELEASE]
	... 31 more
Caused by: java.net.BindException: Address already in use (Bind failed)
	at java.net.PlainSocketImpl.socketBind(Native Method) ~[?:1.8.0_252]
	at java.net.AbstractPlainSocketImpl.bind(AbstractPlainSocketImpl.java:387) ~[?:1.8.0_252]
	at java.net.ServerSocket.bind(ServerSocket.java:390) ~[?:1.8.0_252]
	at java.net.ServerSocket.<init>(ServerSocket.java:252) ~[?:1.8.0_252]
	at javax.net.DefaultServerSocketFactory.createServerSocket(ServerSocketFactory.java:231)
~[?:1.8.0_252]
	at org.apache.activemq.transport.tcp.TcpTransportServer.bind(TcpTransportServer.java:143)
~[activemq-client-5.16.0.jar:5.16.0]
	at org.apache.activemq.transport.tcp.TcpTransportFactory.doBind(TcpTransportFactory.java:62)
~[activemq-client-5.16.0.jar:5.16.0]
	at org.apache.activemq.transport.TransportFactorySupport.bind(TransportFactorySupport.java:40)
~[activemq-broker-5.16.0.jar:5.16.0]
	at org.apache.activemq.broker.TransportConnector.createTransportServer(TransportConnector.java:333)
~[activemq-broker-5.16.0.jar:5.16.0]
	at org.apache.activemq.broker.TransportConnector.getServer(TransportConnector.java:143) ~[activemq-broker-5.16.0.jar:5.16.0]
	at org.apache.activemq.broker.TransportConnector.start(TransportConnector.java:210) ~[activemq-broker-5.16.0.jar:5.16.0]
	at org.apache.activemq.broker.BrokerService.startTransportConnector(BrokerService.java:2764)
~[activemq-broker-5.16.0.jar:5.16.0]
	at org.apache.activemq.broker.BrokerService.startAllConnectors(BrokerService.java:2657) ~[activemq-broker-5.16.0.jar:5.16.0]
	at org.apache.activemq.broker.BrokerService.doStartBroker(BrokerService.java:779) ~[activemq-broker-5.16.0.jar:5.16.0]
	at org.apache.activemq.broker.BrokerService.startBroker(BrokerService.java:741) ~[activemq-broker-5.16.0.jar:5.16.0]
	at org.apache.activemq.broker.BrokerService.start(BrokerService.java:644) ~[activemq-broker-5.16.0.jar:5.16.0]
	at org.apache.activemq.xbean.XBeanBrokerService.afterPropertiesSet(XBeanBrokerService.java:73)
~[activemq-spring-5.16.0.jar:5.16.0]
	at sun.reflect.NativeMethodAccessorImpl.invoke0(Native Method) ~[?:1.8.0_252]
	at sun.reflect.NativeMethodAccessorImpl.invoke(NativeMethodAccessorImpl.java:62) ~[?:1.8.0_252]
	at sun.reflect.DelegatingMethodAccessorImpl.invoke(DelegatingMethodAccessorImpl.java:43)
~[?:1.8.0_252]
	at java.lang.reflect.Method.invoke(Method.java:498) ~[?:1.8.0_252]
	at org.springframework.beans.factory.support.AbstractAutowireCapableBeanFactory.invokeCustomInitMethod(AbstractAutowireCapableBeanFactory.java:1763)
~[spring-beans-4.3.17.RELEASE.jar:4.3.17.RELEASE]
	at org.springframework.beans.factory.support.AbstractAutowireCapableBeanFactory.invokeInitMethods(AbstractAutowireCapableBeanFactory.java:1700)
~[spring-beans-4.3.17.RELEASE.jar:4.3.17.RELEASE]
	at org.springframework.beans.factory.support.AbstractAutowireCapableBeanFactory.initializeBean(AbstractAutowireCapableBeanFactory.java:1630)
~[spring-beans-4.3.17.RELEASE.jar:4.3.17.RELEASE]
	... 31 more
2020-12-12 16:56:03,874 ERROR o.a.j.JMeter: Uncaught exception in thread Thread[Thread-9,5,main]
java.lang.NullPointerException: Cannot invoke method stop() on null object
	at org.codehaus.groovy.runtime.NullObject.invokeMethod(NullObject.java:91) ~[groovy-3.0.5.jar:3.0.5]
	at org.codehaus.groovy.runtime.callsite.PogoMetaClassSite.call(PogoMetaClassSite.java:44)
~[groovy-3.0.5.jar:3.0.5]
	at org.codehaus.groovy.runtime.callsite.CallSiteArray.defaultCall(CallSiteArray.java:47)
~[groovy-3.0.5.jar:3.0.5]
	at org.codehaus.groovy.runtime.callsite.NullCallSite.call(NullCallSite.java:34) ~[groovy-3.0.5.jar:3.0.5]
	at org.codehaus.groovy.runtime.callsite.CallSiteArray.defaultCall(CallSiteArray.java:47)
~[groovy-3.0.5.jar:3.0.5]
	at org.codehaus.groovy.runtime.callsite.AbstractCallSite.call(AbstractCallSite.java:125)
~[groovy-3.0.5.jar:3.0.5]
	at org.codehaus.groovy.runtime.callsite.AbstractCallSite.call(AbstractCallSite.java:130)
~[groovy-3.0.5.jar:3.0.5]
	at Script4$_run_closure1.doCall(Script4.groovy:12) ~[?:?]
	at Script4$_run_closure1.doCall(Script4.groovy) ~[?:?]
	at sun.reflect.NativeMethodAccessorImpl.invoke0(Native Method) ~[?:1.8.0_252]
	at sun.reflect.NativeMethodAccessorImpl.invoke(NativeMethodAccessorImpl.java:62) ~[?:1.8.0_252]
	at sun.reflect.DelegatingMethodAccessorImpl.invoke(DelegatingMethodAccessorImpl.java:43)
~[?:1.8.0_252]
	at java.lang.reflect.Method.invoke(Method.java:498) ~[?:1.8.0_252]
	at org.codehaus.groovy.reflection.CachedMethod.invoke(CachedMethod.java:107) ~[groovy-3.0.5.jar:3.0.5]
	at groovy.lang.MetaMethod.doMethodInvoke(MetaMethod.java:323) ~[groovy-3.0.5.jar:3.0.5]
	at org.codehaus.groovy.runtime.metaclass.ClosureMetaClass.invokeMethod(ClosureMetaClass.java:263)
~[groovy-3.0.5.jar:3.0.5]
	at groovy.lang.MetaClassImpl.invokeMethod(MetaClassImpl.java:1026) ~[groovy-3.0.5.jar:3.0.5]
	at groovy.lang.Closure.call(Closure.java:412) ~[groovy-3.0.5.jar:3.0.5]
	at groovy.lang.Closure.call(Closure.java:406) ~[groovy-3.0.5.jar:3.0.5]
	at groovy.lang.Closure.run(Closure.java:493) ~[groovy-3.0.5.jar:3.0.5]
	at java.lang.Thread.run(Thread.java:748) [?:1.8.0_252]

> Task :src:dist-check:batchJMS_TESTS FAILED
checksum-dependency elapsed time: 13405ms, configurations processed: 272 (add -PchecksumTimingsPrint
to print detailed timings)

Build jmeter FAILURE reason:                                
    Execution failed for task ':src:dist-check:batchJMS_TESTS':
        Failures detected while testing <https://ci-builds.apache.org/job/JMeter/job/JMeter%20Ubuntu/ws/bin/testfiles/JMS_TESTS.jmx>:
[errors in JMS_TESTS.log]
            at org.apache.jmeter.buildtools.batchtest.BatchTest.exec(BatchTest.kt:184)
            at org.gradle.internal.reflect.JavaMethod.invoke(JavaMethod.java:104)
            at org.gradle.api.internal.project.taskfactory.StandardTaskAction.doExecute(StandardTaskAction.java:58)
            at org.gradle.api.internal.project.taskfactory.StandardTaskAction.execute(StandardTaskAction.java:51)
            at org.gradle.api.internal.project.taskfactory.StandardTaskAction.execute(StandardTaskAction.java:29)
            at org.gradle.api.internal.tasks.execution.ExecuteActionsTaskExecuter$3.run(ExecuteActionsTaskExecuter.java:555)
            at org.gradle.internal.operations.DefaultBuildOperationRunner$1.execute(DefaultBuildOperationRunner.java:29)
            at org.gradle.internal.operations.DefaultBuildOperationRunner$1.execute(DefaultBuildOperationRunner.java:26)
            at org.gradle.internal.operations.DefaultBuildOperationRunner$3.execute(DefaultBuildOperationRunner.java:75)
            at org.gradle.internal.operations.DefaultBuildOperationRunner$3.execute(DefaultBuildOperationRunner.java:68)
            at org.gradle.internal.operations.DefaultBuildOperationRunner.execute(DefaultBuildOperationRunner.java:153)
            at org.gradle.internal.operations.DefaultBuildOperationRunner.execute(DefaultBuildOperationRunner.java:68)
            at org.gradle.internal.operations.DefaultBuildOperationRunner.run(DefaultBuildOperationRunner.java:56)
            at org.gradle.internal.operations.DefaultBuildOperationExecutor.lambda$run$1(DefaultBuildOperationExecutor.java:71)
            at org.gradle.internal.operations.UnmanagedBuildOperationWrapper.runWithUnmanagedSupport(UnmanagedBuildOperationWrapper.java:45)
            at org.gradle.internal.operations.DefaultBuildOperationExecutor.run(DefaultBuildOperationExecutor.java:71)
            at org.gradle.api.internal.tasks.execution.ExecuteActionsTaskExecuter.executeAction(ExecuteActionsTaskExecuter.java:540)
            at org.gradle.api.internal.tasks.execution.ExecuteActionsTaskExecuter.executeActions(ExecuteActionsTaskExecuter.java:523)
            at org.gradle.api.internal.tasks.execution.ExecuteActionsTaskExecuter.access$300(ExecuteActionsTaskExecuter.java:108)
            at org.gradle.api.internal.tasks.execution.ExecuteActionsTaskExecuter$TaskExecution.executeWithPreviousOutputFiles(ExecuteActionsTaskExecuter.java:271)
            at org.gradle.api.internal.tasks.execution.ExecuteActionsTaskExecuter$TaskExecution.execute(ExecuteActionsTaskExecuter.java:260)
            at org.gradle.internal.execution.steps.ExecuteStep.lambda$execute$1(ExecuteStep.java:34)
            at org.gradle.internal.execution.steps.ExecuteStep.execute(ExecuteStep.java:34)
            at org.gradle.internal.execution.steps.ExecuteStep.execute(ExecuteStep.java:26)
            at org.gradle.internal.execution.steps.CleanupOutputsStep.execute(CleanupOutputsStep.java:67)
            at org.gradle.internal.execution.steps.CleanupOutputsStep.execute(CleanupOutputsStep.java:36)
            at org.gradle.internal.execution.steps.ResolveInputChangesStep.execute(ResolveInputChangesStep.java:49)
            at org.gradle.internal.execution.steps.ResolveInputChangesStep.execute(ResolveInputChangesStep.java:34)
            at org.gradle.internal.execution.steps.CancelExecutionStep.execute(CancelExecutionStep.java:43)
            at org.gradle.internal.execution.steps.TimeoutStep.executeWithoutTimeout(TimeoutStep.java:73)
            at org.gradle.internal.execution.steps.TimeoutStep.execute(TimeoutStep.java:54)
            at org.gradle.internal.execution.steps.CreateOutputsStep.execute(CreateOutputsStep.java:44)
            at org.gradle.internal.execution.steps.SnapshotOutputsStep.execute(SnapshotOutputsStep.java:54)
            at org.gradle.internal.execution.steps.SnapshotOutputsStep.execute(SnapshotOutputsStep.java:38)
            at org.gradle.internal.execution.steps.BroadcastChangingOutputsStep.execute(BroadcastChangingOutputsStep.java:42)
            at org.gradle.internal.execution.steps.CacheStep.executeWithoutCache(CacheStep.java:159)
            at org.gradle.internal.execution.steps.CacheStep.execute(CacheStep.java:72)
            at org.gradle.internal.execution.steps.CacheStep.execute(CacheStep.java:43)
            at org.gradle.internal.execution.steps.StoreExecutionStateStep.execute(StoreExecutionStateStep.java:44)
            at org.gradle.internal.execution.steps.StoreExecutionStateStep.execute(StoreExecutionStateStep.java:33)
            at org.gradle.internal.execution.steps.RecordOutputsStep.execute(RecordOutputsStep.java:38)
            at org.gradle.internal.execution.steps.RecordOutputsStep.execute(RecordOutputsStep.java:24)
            at org.gradle.internal.execution.steps.SkipUpToDateStep.executeBecause(SkipUpToDateStep.java:92)
            at org.gradle.internal.execution.steps.SkipUpToDateStep.lambda$execute$0(SkipUpToDateStep.java:85)
            at org.gradle.internal.execution.steps.SkipUpToDateStep.execute(SkipUpToDateStep.java:55)
            at org.gradle.internal.execution.steps.SkipUpToDateStep.execute(SkipUpToDateStep.java:39)
            at org.gradle.internal.execution.steps.ResolveChangesStep.execute(ResolveChangesStep.java:76)
            at org.gradle.internal.execution.steps.ResolveChangesStep.execute(ResolveChangesStep.java:37)
            at org.gradle.internal.execution.steps.legacy.MarkSnapshottingInputsFinishedStep.execute(MarkSnapshottingInputsFinishedStep.java:36)
            at org.gradle.internal.execution.steps.legacy.MarkSnapshottingInputsFinishedStep.execute(MarkSnapshottingInputsFinishedStep.java:26)
            at org.gradle.internal.execution.steps.ResolveCachingStateStep.execute(ResolveCachingStateStep.java:94)
            at org.gradle.internal.execution.steps.ResolveCachingStateStep.execute(ResolveCachingStateStep.java:49)
            at org.gradle.internal.execution.steps.CaptureStateBeforeExecutionStep.execute(CaptureStateBeforeExecutionStep.java:79)
            at org.gradle.internal.execution.steps.CaptureStateBeforeExecutionStep.execute(CaptureStateBeforeExecutionStep.java:53)
            at org.gradle.internal.execution.steps.ValidateStep.execute(ValidateStep.java:74)
            at org.gradle.internal.execution.steps.SkipEmptyWorkStep.lambda$execute$2(SkipEmptyWorkStep.java:78)
            at org.gradle.internal.execution.steps.SkipEmptyWorkStep.execute(SkipEmptyWorkStep.java:78)
            at org.gradle.internal.execution.steps.SkipEmptyWorkStep.execute(SkipEmptyWorkStep.java:34)
            at org.gradle.internal.execution.steps.legacy.MarkSnapshottingInputsStartedStep.execute(MarkSnapshottingInputsStartedStep.java:39)
            at org.gradle.internal.execution.steps.LoadExecutionStateStep.execute(LoadExecutionStateStep.java:40)
            at org.gradle.internal.execution.steps.LoadExecutionStateStep.execute(LoadExecutionStateStep.java:28)


FAILURE: Build failed with an exception.

* What went wrong:
Execution failed for task ':src:dist-check:batchJMS_TESTS'.
> Failures detected while testing <https://ci-builds.apache.org/job/JMeter/job/JMeter%20Ubuntu/ws/bin/testfiles/JMS_TESTS.jmx>:
[errors in JMS_TESTS.log]

* Try:
Run with --stacktrace option to get the stack trace. Run with --info or --debug option to
get more log output. Run with --scan to get full insights.

* Get more help at https://help.gradle.org

Deprecated Gradle features were used in this build, making it incompatible with Gradle 7.0.
Use '--warning-mode all' to show the individual deprecation warnings.
See https://docs.gradle.org/6.7/userguide/command_line_interface.html#sec:command_line_warnings

BUILD FAILED in 2m 19s
248 actionable tasks: 114 executed, 134 up-to-date
Build step 'Invoke Gradle script' changed build result to FAILURE
Build step 'Invoke Gradle script' marked build as failure

Mime
View raw message