jmeter-dev mailing list archives

Site index · List index
Message view « Date » · « Thread »
Top « Date » · « Thread »
From Apache Jenkins Server <jenk...@builds.apache.org>
Subject Build failed in Jenkins: JMeter » JMeter-trunk #173
Date Thu, 17 Dec 2020 20:31:41 GMT
See <https://ci-builds.apache.org/job/JMeter/job/JMeter-trunk/173/display/redirect?page=changes>

Changes:

[Philippe Mouawad] Bug 65004 - HTTP(S) Test Script recorder computes wrong HTTP Request


------------------------------------------
[...truncated 66.60 KB...]
> Task :src:testkit-wiremock:autostyleKotlinGradleCheck
> Task :src:bshclient:autostyleCheck
> Task :src:examples:autostyleKotlinGradleCheck
> Task :src:generator:autostyleMarkdownCheck NO-SOURCE
> Task :src:generator:autostyleCheck
> Task :src:jorphan:autostyleKotlinGradleCheck
> Task :src:testkit-wiremock:autostyleMarkdownCheck NO-SOURCE
> Task :src:examples:autostyleMarkdownCheck NO-SOURCE
> Task :src:functions:autostyleKotlinGradleCheck
> Task :src:examples:autostyleCheck
> Task :src:testkit-wiremock:autostyleCheck
> Task :src:functions:autostyleMarkdownCheck NO-SOURCE
> Task :src:functions:autostyleCheck
> Task :src:jorphan:autostyleMarkdownCheck NO-SOURCE
> Task :src:jorphan:autostyleCheck
> Task :src:generator:checkstyleMain UP-TO-DATE
> Task :src:bshclient:checkstyleMain UP-TO-DATE
> Task :src:examples:checkstyleMain UP-TO-DATE
> Task :src:generator:checkstyleTest NO-SOURCE
> Task :src:generator:processTestResources NO-SOURCE
> Task :src:bshclient:checkstyleTest NO-SOURCE
> Task :src:examples:checkstyleTest NO-SOURCE
> Task :src:launcher:autostyleKotlinGradleCheck
> Task :src:testkit:checkstyleMain UP-TO-DATE
> Task :src:testkit-wiremock:checkstyleMain UP-TO-DATE
> Task :src:testkit:checkstyleTest NO-SOURCE
> Task :src:launcher:autostyleMarkdownCheck NO-SOURCE
> Task :src:launcher:autostyleCheck
> Task :src:testkit:checkstyleTestFixtures NO-SOURCE
> Task :src:functions:checkstyleMain UP-TO-DATE
> Task :src:testkit-wiremock:checkstyleTest NO-SOURCE
> Task :src:examples:processResources UP-TO-DATE
> Task :src:examples:processTestResources NO-SOURCE
> Task :src:jorphan:checkstyleMain UP-TO-DATE
> Task :src:testkit-wiremock:checkstyleTestFixtures NO-SOURCE
> Task :src:functions:checkstyleTest UP-TO-DATE
> Task :src:bshclient:compileJava UP-TO-DATE
> Task :src:bshclient:processResources NO-SOURCE
> Task :src:bshclient:classes UP-TO-DATE
> Task :src:jorphan:checkstyleTest UP-TO-DATE
> Task :src:launcher:checkstyleMain UP-TO-DATE
> Task :src:launcher:checkstyleTest NO-SOURCE
> Task :src:bshclient:spotbugsMain UP-TO-DATE
> Task :src:testkit-wiremock:spotbugsMain UP-TO-DATE
> Task :src:bshclient:compileTestJava NO-SOURCE
> Task :src:bshclient:processTestResources NO-SOURCE
> Task :src:bshclient:testClasses UP-TO-DATE
> Task :src:testkit-wiremock:compileTestJava NO-SOURCE
> Task :src:bshclient:spotbugsTest NO-SOURCE
> Task :src:testkit:spotbugsMain UP-TO-DATE
> Task :src:launcher:spotbugsMain UP-TO-DATE
> Task :src:testkit-wiremock:processTestResources NO-SOURCE
> Task :src:testkit-wiremock:testClasses UP-TO-DATE
> Task :src:jorphan:spotbugsMain UP-TO-DATE
> Task :src:testkit:compileTestJava NO-SOURCE
> Task :src:bshclient:test NO-SOURCE
> Task :src:launcher:compileTestJava NO-SOURCE
> Task :src:components:autostyleJavaCheck
> Task :src:bshclient:check
> Task :src:testkit-wiremock:spotbugsTest NO-SOURCE
> Task :src:launcher:processTestResources NO-SOURCE
> Task :src:testkit:processTestResources NO-SOURCE
> Task :src:launcher:testClasses UP-TO-DATE
> Task :src:testkit-wiremock:spotbugsTestFixtures NO-SOURCE
> Task :src:bshclient:jar UP-TO-DATE
> Task :src:testkit:testClasses UP-TO-DATE
> Task :src:launcher:spotbugsTest NO-SOURCE
> Task :src:testkit-wiremock:test NO-SOURCE
> Task :src:launcher:test NO-SOURCE
> Task :src:bshclient:assemble UP-TO-DATE
> Task :src:testkit-wiremock:check
> Task :src:testkit:spotbugsTest NO-SOURCE
> Task :src:testkit-wiremock:assemble UP-TO-DATE
> Task :src:launcher:check
> Task :src:launcher:assemble UP-TO-DATE
> Task :src:testkit:spotbugsTestFixtures NO-SOURCE
> Task :src:jorphan:spotbugsTest UP-TO-DATE
> Task :src:config:autostyleKotlinGradleCheck
> Task :src:config:autostyleMarkdownCheck NO-SOURCE
> Task :src:config:autostyleCheck
> Task :src:testkit:test NO-SOURCE
> Task :src:config:checkstyleMain NO-SOURCE
> Task :src:testkit:check
> Task :src:testkit:assemble UP-TO-DATE
> Task :src:config:checkstyleTest NO-SOURCE
> Task :src:release:autostyleKotlinGradleCheck
> Task :src:config:compileJava NO-SOURCE
> Task :src:release:autostyleMarkdownCheck NO-SOURCE
> Task :src:release:autostyleCheck
> Task :src:config:processResources NO-SOURCE
> Task :src:config:classes UP-TO-DATE
> Task :src:release:checkstyleMain NO-SOURCE
> Task :src:config:spotbugsMain NO-SOURCE
> Task :src:config:compileTestJava NO-SOURCE
> Task :src:config:processTestResources NO-SOURCE
> Task :src:config:testClasses UP-TO-DATE
> Task :src:release:checkstyleTest NO-SOURCE
> Task :src:protocol:autostyleKotlinGradleCheck
> Task :src:autostyleKotlinGradleCheck
> Task :src:bom:autostyleKotlinGradleCheck
> Task :src:release:compileJava NO-SOURCE
> Task :src:config:spotbugsTest NO-SOURCE
> Task :src:bom:autostyleMarkdownCheck NO-SOURCE
> Task :src:bom:autostyleCheck
> Task :src:release:processResources NO-SOURCE
> Task :src:release:classes UP-TO-DATE
> Task :src:protocol:autostyleMarkdownCheck NO-SOURCE
> Task :src:autostyleMarkdownCheck NO-SOURCE
> Task :src:bom:check
> Task :src:config:test NO-SOURCE
> Task :src:config:check
> Task :src:bom:assemble UP-TO-DATE
> Task :src:autostyleCheck
> Task :src:protocol:autostyleCheck
> Task :src:check
> Task :src:release:spotbugsMain NO-SOURCE
> Task :src:protocol:checkstyleMain NO-SOURCE
> Task :src:protocol:checkstyleTest NO-SOURCE
> Task :src:licenses:autostyleKotlinGradleCheck
> Task :src:protocol:compileJava NO-SOURCE
> Task :src:protocol:processResources NO-SOURCE
> Task :src:protocol:classes UP-TO-DATE
> Task :src:dist-check:autostyleKotlinGradleCheck
> Task :src:protocol:spotbugsMain NO-SOURCE
> Task :src:licenses:autostyleMarkdownCheck NO-SOURCE
> Task :src:assemble UP-TO-DATE
> Task :src:dist-check:autostyleMarkdownCheck NO-SOURCE
> Task :src:licenses:autostyleCheck
> Task :src:release:compileTestJava NO-SOURCE
> Task :src:protocol:compileTestJava NO-SOURCE
> Task :src:dist-check:autostyleCheck
> Task :src:release:processTestResources NO-SOURCE
> Task :src:licenses:checkstyleMain NO-SOURCE
> Task :src:release:testClasses UP-TO-DATE
> Task :src:dist-check:checkstyleMain NO-SOURCE
> Task :src:protocol:processTestResources NO-SOURCE
> Task :src:licenses:checkstyleTest NO-SOURCE
> Task :src:release:spotbugsTest NO-SOURCE
> Task :src:protocol:testClasses UP-TO-DATE
> Task :src:release:test NO-SOURCE
> Task :src:release:check
> Task :src:protocol:spotbugsTest NO-SOURCE
> Task :src:protocol:test NO-SOURCE
> Task :src:protocol:check
> Task :src:licenses:compileJava NO-SOURCE
> Task :src:release:jar UP-TO-DATE
> Task :src:licenses:processResources NO-SOURCE
> Task :src:release:assemble UP-TO-DATE
> Task :src:licenses:classes UP-TO-DATE
> Task :src:protocol:jar UP-TO-DATE
> Task :src:protocol:assemble UP-TO-DATE
> Task :src:licenses:spotbugsMain NO-SOURCE
> Task :src:dist-check:checkstyleTest UP-TO-DATE
> Task :src:licenses:compileTestJava NO-SOURCE
> Task :src:dist-check:processResources NO-SOURCE
> Task :src:licenses:processTestResources NO-SOURCE
> Task :src:licenses:testClasses UP-TO-DATE
> Task :src:licenses:spotbugsTest NO-SOURCE
> Task :src:dist-check:processTestResources UP-TO-DATE
> Task :src:licenses:test NO-SOURCE
> Task :src:licenses:check
> Task :src:licenses:gatherSourceLicenses UP-TO-DATE
> Task :src:components:autostyleKotlinGradleCheck
> Task :src:licenses:renderLicenseForSource UP-TO-DATE
> Task :src:components:autostyleMarkdownCheck NO-SOURCE
> Task :src:components:autostyleCheck
> Task :src:components:checkstyleMain UP-TO-DATE
> Task :src:components:checkstyleTest UP-TO-DATE
> Task :src:dist-check:populateLibs
> Task :src:components:processResources UP-TO-DATE
> Task :src:components:processTestResources UP-TO-DATE
> Task :src:dist:autostyleKotlinGradleCheck
> Task :src:dist:autostyleMarkdownCheck NO-SOURCE
> Task :src:dist:autostyleCheck
> Task :src:dist:checkstyleMain NO-SOURCE
> Task :src:dist:checkstyleTest NO-SOURCE
> Task :src:dist:processResources NO-SOURCE
> Task :src:dist:processTestResources NO-SOURCE
> Task :src:dist:preparePropertiesbuildPrintableDoc UP-TO-DATE
> Task :autostyleKotlinGradleCheck
> Task :autostyleMarkdownCheck
> Task :autostyleCheck
> Task :checkstyleMain NO-SOURCE
> Task :checkstyleTest NO-SOURCE
> Task :src:core:compileJava
> Task :src:protocol:http:autostyleJavaCheck FAILED
> Task :src:core:compileGroovy NO-SOURCE
> Task :src:licenses:renderLicenseForSourceCopySpec
> Task :gitProps
> Task :src:dist:buildPrintableDoc

> Task :src:jorphan:test

ObjectTableSorterTest > toggleSortOrder_0_0_0() STANDARD_ERROR
    SLF4J: Failed to load class "org.slf4j.impl.StaticLoggerBinder".
    SLF4J: Defaulting to no-operation (NOP) logger implementation
    SLF4J: See http://www.slf4j.org/codes.html#StaticLoggerBinder for further details.
          0.2sec,   26 completed,   0 failed,   0 skipped, org.apache.jorphan.gui.ObjectTableSorterTest
          0.0sec,    6 completed,   0 failed,   0 skipped, org.apache.jorphan.gui.ObjectTableModelTest
          2.1sec, org.apache.jorphan.exec.TestKeyToolUtils > testDNSNameBasedCert()
          6.3sec,    3 completed,   0 failed,   0 skipped, org.apache.jorphan.exec.TestKeyToolUtils
          0.0sec,    5 completed,   0 failed,   0 skipped, org.apache.jorphan.collections.PackageTest
          0.0sec,    4 completed,   0 failed,   0 skipped, org.apache.jorphan.reflect.TestClassTools
WARNING   0.0sec,   10 completed,   0 failed,   2 skipped, org.apache.jorphan.math.TestStatCalculator
          0.0sec,    8 completed,   0 failed,   0 skipped, org.apache.jorphan.util.TestConverter
          0.1sec,   50 completed,   0 failed,   0 skipped, org.apache.jorphan.util.TestJorphanUtils
          0.1sec,   37 completed,   0 failed,   0 skipped, org.apache.commons.cli.avalon.ClutilTestCase
          0.2sec,    5 completed,   0 failed,   0 skipped, org.apache.jorphan.gui.MinMaxLongRendererTest
          0.4sec,   16 completed,   0 failed,   0 skipped, org.apache.jorphan.io.TextFileSpec
          0.2sec,   58 completed,   0 failed,   0 skipped, org.apache.jorphan.util.ConverterSpec
WARNING  10.2sec,  228 completed,   0 failed,   2 skipped, Gradle
Test Run :src:jorphan:test
checksum-dependency elapsed time: 8780ms, configurations processed: 141 (add -PchecksumTimingsPrint
to print detailed timings)

FAILURE: Build failed with an exception.

* What went wrong:
Execution failed for task ':src:protocol:http:autostyleJavaCheck'.
> The following files have format violations:
    src/protocol/http/src/main/java/org/apache/jmeter/protocol/http/proxy/DefaultSamplerCreator.java
      @@ -288,7 +288,7 @@
            */
           public static boolean isPotentialJson(final String postData) throws IOException
{
               boolean valid = true;
      -��������try{�\n
      +��������try{\n
                   OBJECT_MAPPER.readTree(postData);
               } catch(JsonProcessingException e){
                   valid = false;
  Run './gradlew autostyleApply' to fix the violations.

* Try:
Run with --stacktrace option to get the stack trace. Run with --info or --debug option to
get more log output. Run with --scan to get full insights.

* Get more help at https://help.gradle.org

Deprecated Gradle features were used in this build, making it incompatible with Gradle 7.0.
Use '--warning-mode all' to show the individual deprecation warnings.
See https://docs.gradle.org/6.7/userguide/command_line_interface.html#sec:command_line_warnings

BUILD FAILED in 34s
176 actionable tasks: 83 executed, 93 up-to-date

See the profiling report at: file://<https://ci-builds.apache.org/job/JMeter/job/JMeter-trunk/ws/build/reports/profile/profile-2020-12-17-20-31-07.html>
A fine-grained performance profile is available: use the --scan option.
Build step 'Invoke Gradle script' changed build result to FAILURE
Build step 'Invoke Gradle script' marked build as failure
Xvfb stopping
Archiving artifacts
Recording test results

Mime
View raw message