jmeter-dev mailing list archives

Site index · List index
Message view « Date » · « Thread »
Top « Date » · « Thread »
From Apache Jenkins Server <jenk...@builds.apache.org>
Subject Build failed in Jenkins: JMeter » JMeter Ubuntu #157
Date Thu, 11 Mar 2021 20:54:08 GMT
See <https://ci-builds.apache.org/job/JMeter/job/JMeter%20Ubuntu/157/display/redirect?page=changes>

Changes:

[Felix Schumacher] OS Process Sampler - Cannot "Add from Clipboard" Command parameters

[Felix Schumacher] HTTP Sampler/Files upload tab - add missing buttons

[Felix Schumacher] Fix a few typos

[Felix Schumacher] line too long


------------------------------------------
[...truncated 172.10 KB...]
    Thread[/127.0.0.1:60380 to /127.0.0.1:35517 workers Thread 3,5,main], stackTrace:sun.nio.ch.EPollArrayWrapper#epollWait
    sun.nio.ch.EPollArrayWrapper#poll at line:269
    sun.nio.ch.EPollSelectorImpl#doSelect at line:93
    sun.nio.ch.SelectorImpl#lockAndDoSelect at line:86
    sun.nio.ch.SelectorImpl#select at line:97
    sun.nio.ch.SelectorImpl#select at line:101
    org.gradle.internal.remote.internal.inet.SocketConnection$SocketInputStream#read at line:185
    com.esotericsoftware.kryo.io.Input#fill at line:146
    com.esotericsoftware.kryo.io.Input#require at line:178
    com.esotericsoftware.kryo.io.Input#readByte at line:295
    org.gradle.internal.serialize.kryo.KryoBackedDecoder#readByte at line:82
    org.gradle.internal.remote.internal.hub.InterHubMessageSerializer$MessageReader#read at
line:64
    org.gradle.internal.remote.internal.hub.InterHubMessageSerializer$MessageReader#read at
line:52
    org.gradle.internal.remote.internal.inet.SocketConnection#receive at line:81
    org.gradle.internal.remote.internal.hub.MessageHub$ConnectionReceive#run at line:270
    org.gradle.internal.concurrent.ExecutorPolicy$CatchAndRecordFailures#onExecute at line:64
    org.gradle.internal.concurrent.ManagedExecutorImpl$1#run at line:48
    java.util.concurrent.ThreadPoolExecutor#runWorker at line:1149
    java.util.concurrent.ThreadPoolExecutor$Worker#run at line:624
    org.gradle.internal.concurrent.ThreadFactoryImpl$ManagedThreadRunnable#run at line:56
    java.lang.Thread#run at line:748

          3.9sec,   18 completed,   0 failed,   0 skipped, org.apache.jmeter.samplers.TestSampleResult
          0.0sec,    5 completed,   0 failed,   0 skipped, org.apache.jmeter.listeners.TestResultAction
          0.0sec,   11 completed,   0 failed,   0 skipped, org.apache.jmeter.save.TestCSVSaveService
          0.0sec,    6 completed,   0 failed,   0 skipped, org.apache.jmeter.testelement.property.AbstractPropertyTest
          0.0sec,    2 completed,   0 failed,   0 skipped, org.apache.jmeter.testelement.property.MapPropertyTest
          0.0sec,   11 completed,   0 failed,   0 skipped, org.apache.jmeter.testelement.property.PackageTest
          0.0sec,    5 completed,   0 failed,   0 skipped, org.apache.jmeter.testelement.TestNumberProperty
          0.0sec,    2 completed,   0 failed,   0 skipped, org.apache.jmeter.testelement.PackageTest
          0.1sec,    1 completed,   0 failed,   0 skipped, org.apache.jmeter.gui.logging.TestGuiLogEventAppender

> Task :src:functions:test

Gradle Test Executor 17 STANDARD_OUT
    Setting JMeterHome: <https://ci-builds.apache.org/job/JMeter/job/JMeter%20Ubuntu/ws/src/functions/../../.>
    Initializing Properties: ../.././bin/jmeter.properties
    JMeterVersion=5.5-SNAPSHOT 8400bc8
    java.version=1.8.0_281
    java.vm.name=Java HotSpot(TM) 64-Bit Server VM
    java.vendor=Oracle Corporation
    java.home=/usr/local/asfpackages/java/oraclejdk-1.8.0-281/jre
    file.encoding=ISO-8859-1
    default encoding=ISO-8859-1
    user.home=/home/jenkins
    user.dir=<https://ci-builds.apache.org/job/JMeter/job/JMeter%20Ubuntu/ws/src/functions>
    user.language=en
    user.region=null
    user.country=US
    user.variant=
    Locale=en_US
    java.class.version=52.0
    java.awt.headless=true
    os.name=Linux
    os.version=4.15.0-136-generic
    os.arch=amd64
          0.2sec,    1 completed,   0 failed,   0 skipped, org.apache.jmeter.resources.ResourceKeyUsageTestFunctions
          0.7sec,    6 completed,   0 failed,   0 skipped, org.apache.jmeter.functions.CSVReadFunctionTest
          0.0sec,    3 completed,   0 failed,   0 skipped, org.apache.jmeter.functions.TestSetProperty
          0.0sec,    3 completed,   0 failed,   0 skipped, org.apache.jmeter.functions.TestUrlEncodeDecode
          0.1sec,    8 completed,   0 failed,   0 skipped, org.apache.jmeter.functions.TestDateTimeConvertFunction
          0.2sec,    5 completed,   0 failed,   0 skipped, org.apache.jmeter.functions.TestJavascriptFunctionWithRhino
          0.1sec,   15 completed,   0 failed,   0 skipped, org.apache.jmeter.functions.TestStringtoFile
          0.0sec,    9 completed,   0 failed,   0 skipped, org.apache.jmeter.functions.TestDigestFunction
          0.5sec,    7 completed,   0 failed,   0 skipped, org.apache.jmeter.functions.TestFileRowColContainer
          0.0sec,    6 completed,   0 failed,   0 skipped, org.apache.jmeter.functions.TestEscapeOroRegexpChars
WARNING   0.8sec,    6 completed,   0 failed,   5 skipped, org.apache.jmeter.functions.XPathConcurrencyTest
          0.0sec,    1 completed,   0 failed,   0 skipped, org.apache.jmeter.functions.SumFunctionTest
          0.0sec,   18 completed,   0 failed,   0 skipped, org.apache.jmeter.functions.TestSimpleFunctions
          0.0sec,    2 completed,   0 failed,   0 skipped, org.apache.jmeter.functions.RandomFunctionTest
          1.1sec,    7 completed,   0 failed,   0 skipped, org.apache.jmeter.functions.TestGroovyFunction
          0.0sec,    5 completed,   0 failed,   0 skipped, org.apache.jmeter.functions.TestFileToString
          0.1sec,    6 completed,   0 failed,   0 skipped, org.apache.jmeter.functions.TestJexl2Function
          0.0sec,    1 completed,   0 failed,   0 skipped, org.apache.jmeter.functions.SplitFunctionTest
          0.0sec,    4 completed,   0 failed,   0 skipped, org.apache.jmeter.functions.TestRandomFromMultipleVars
          0.0sec,    2 completed,   0 failed,   0 skipped, org.apache.jmeter.functions.TestSamplerNameFunction
          0.3sec,   12 completed,   0 failed,   0 skipped, org.apache.jmeter.functions.TestTimeShiftFunction
          0.0sec,   15 completed,   0 failed,   0 skipped, org.apache.jmeter.functions.TestTimeFunction
          0.3sec,    5 completed,   0 failed,   0 skipped, org.apache.jmeter.functions.TestJavascriptFunction
          0.0sec,   14 completed,   0 failed,   0 skipped, org.apache.jmeter.functions.TestTimeRandomDateFunction
          0.0sec,    8 completed,   0 failed,   0 skipped, org.apache.jmeter.functions.TestChangeCase
          0.0sec,    1 completed,   0 failed,   0 skipped, org.apache.jmeter.functions.VariableTest
          0.0sec,    5 completed,   0 failed,   0 skipped, org.apache.jmeter.functions.StringFromFileFunctionTest
          0.0sec,    5 completed,   0 failed,   0 skipped, org.apache.jmeter.functions.TestMachineIPName
          0.0sec,    2 completed,   0 failed,   0 skipped, org.apache.jmeter.functions.EvalFunctionTest
          0.0sec,    5 completed,   0 failed,   0 skipped, org.apache.jmeter.functions.TestIsPropDefined
          0.0sec,   22 completed,   0 failed,   0 skipped, org.apache.jmeter.functions.TestRegexFunction
          0.1sec,    6 completed,   0 failed,   0 skipped, org.apache.jmeter.functions.TestJexl3Function
          0.0sec,    6 completed,   0 failed,   0 skipped, org.apache.jmeter.functions.TestIsVarDefined
          0.4sec,   10 completed,   0 failed,   0 skipped, org.apache.jmeter.functions.PackageTest
          0.1sec,   22 completed,   0 failed,   0 skipped, org.apache.jmeter.functions.ChangeCaseSpec
          0.2sec,    2 completed,   0 failed,   0 skipped, org.apache.jmeter.functions.IterationCounterSpec
WARNING   0.0sec,    0 completed,   0 failed,   0 skipped, org.apache.jmeter.functions.gui.FunctionHelperSpec
WARNING  10.7sec,  255 completed,   0 failed,   5 skipped, Gradle
Test Run :src:functions:test

> Task :src:functions:check

> Task :src:components:test
          1.8sec,    4 completed,   0 failed,   0 skipped, org.apache.jmeter.visualizers.backend.influxdb.HttpMetricsSenderTest
          0.1sec,    8 completed,   0 failed,   0 skipped, org.apache.jmeter.visualizers.TestRenderAsJson
          0.0sec,    3 completed,   0 failed,   0 skipped, org.apache.jmeter.control.TestRandomController
          0.0sec,    1 completed,   0 failed,   0 skipped, org.apache.jmeter.control.TestGenericController
WARNING   0.6sec,    8 completed,   0 failed,   1 skipped, org.apache.jmeter.control.TestIfController
          0.0sec,    6 completed,   0 failed,   0 skipped, org.apache.jmeter.control.TestInterleaveControl
          0.0sec,    4 completed,   0 failed,   0 skipped, org.apache.jmeter.control.TestOnceOnlyController
          0.0sec,    1 completed,   0 failed,   0 skipped, org.apache.jmeter.control.TestTransactionController
          0.0sec,    4 completed,   0 failed,   0 skipped, org.apache.jmeter.control.TestLoopController
          0.0sec,   12 completed,   0 failed,   0 skipped, org.apache.jmeter.control.TestWhileController
          0.1sec,    9 completed,   0 failed,   0 skipped, org.apache.jmeter.extractor.TestJSONPostProcessor
          0.0sec,    4 completed,   0 failed,   0 skipped, org.apache.jmeter.extractor.TestBoundaryExtractor
          1.0sec,    6 completed,   0 failed,   0 skipped, org.apache.jmeter.extractor.TestXPathExtractor
          0.0sec,   25 completed,   0 failed,   0 skipped, org.apache.jmeter.extractor.TestRegexExtractor
          0.1sec,   14 completed,   0 failed,   0 skipped, org.apache.jmeter.extractor.TestHtmlExtractorJodd

> Task :src:core:test
          1.6sec,    2 completed,   0 failed,   0 skipped, org.apache.jmeter.gui.util.JSyntaxTextAreaTest
          0.0sec,   17 completed,   0 failed,   0 skipped, org.apache.jmeter.threads.TestUnmodifiableJMeterVariables
          0.0sec,    3 completed,   0 failed,   0 skipped, org.apache.jmeter.threads.TestJMeterThread
          0.0sec,    1 completed,   0 failed,   0 skipped, org.apache.jmeter.threads.TestTestCompiler
          0.0sec,    1 completed,   0 failed,   0 skipped, org.apache.jmeter.threads.TestJMeterContextService
          0.0sec,    4 completed,   0 failed,   0 skipped, org.apache.jorphan.TestXMLBuffer
          0.0sec,    6 completed,   0 failed,   0 skipped, org.apache.jorphan.reflect.TestFunctor

PackageTest > checkI18n fr: messages STANDARD_OUT
    Ignoring missing junit_failure_default_code=0001 in org/apache/jmeter/resources/messages_fr.properties
    Ignoring missing aggregate_report_90=90% in org/apache/jmeter/resources/messages_fr.properties
    Ignoring missing junit_error_default_code=9999 in org/apache/jmeter/resources/messages_fr.properties
    Ignoring missing junit_success_default_code=1000 in org/apache/jmeter/resources/messages_fr.properties
          0.1sec,   13 completed,   0 failed,   0 skipped, org.apache.jmeter.resources.PackageTest
          0.0sec,    4 completed,   0 failed,   0 skipped, org.apache.jmeter.util.SecurityProviderLoaderTest
          0.0sec,    4 completed,   0 failed,   0 skipped, org.apache.jmeter.samplers.TestDataStrippingSampleSender
          0.1sec,    4 completed,   0 failed,   0 skipped, org.apache.jmeter.engine.util.FunctionParserSpec
          0.0sec,    5 completed,   0 failed,   0 skipped, org.apache.jmeter.report.processor.Top5ErrorsSummaryDataSpec
          0.1sec,    4 completed,   0 failed,   0 skipped, org.apache.jmeter.report.processor.ListResultDataSpec
          0.0sec,    1 completed,   0 failed,   0 skipped, org.apache.jmeter.report.processor.ApdexSummaryConsumerSpec
          0.0sec,    3 completed,   0 failed,   0 skipped, org.apache.jmeter.report.processor.FieldSampleComparatorSpec
          0.1sec,    2 completed,   0 failed,   0 skipped, org.apache.jmeter.report.processor.graph.impl.ResponseTimePercentilesOverTimeGraphConsumerSpec
          0.3sec,    4 completed,   0 failed,   0 skipped, org.apache.jmeter.report.processor.Top5ErrorsBySamplerConsumerSpec
          0.1sec,   14 completed,   0 failed,   0 skipped, org.apache.jmeter.report.core.ConvertersSpec
          0.0sec,    6 completed,   0 failed,   0 skipped, org.apache.jmeter.report.core.SampleMetadataParserSpec
          0.0sec,    3 completed,   0 failed,   0 skipped, org.apache.jmeter.util.keystore.JmeterKeyStoreSpec
WARNING   0.0sec,    1 completed,   0 failed,   1 skipped, org.apache.jmeter.gui.HtmlReportGUISpec
          0.1sec,   23 completed,   0 failed,   0 skipped, org.apache.jmeter.services.FileServerSpec
WARNING  23.1sec,  279 completed,   0 failed,   1 skipped, Gradle
Test Run :src:core:test

> Task :src:core:check

> Task :src:dist-check:batchBug50898
Creating summariser <summary>
Created the tree successfully using <https://ci-builds.apache.org/job/JMeter/job/JMeter%20Ubuntu/ws/bin/testfiles/Bug50898.jmx>
Starting standalone test @ Thu Mar 11 20:53:58 UTC 2021 (1615496038935)
Waiting for possible Shutdown/StopTestNow/HeapDump/ThreadDump message on port 4445
summary =      2 in 00:00:00 =   15.0/s Avg:     6 Min:     6 Max:     6 Err:     0 (0.00%)
Tidying up ...    @ Thu Mar 11 20:53:59 UTC 2021 (1615496039736)
... end of run
No errors present in the logfile <https://ci-builds.apache.org/job/JMeter/job/JMeter%20Ubuntu/ws/bin/Bug50898.log>
(the file is empty)

> Task :src:components:test
          0.2sec,   14 completed,   0 failed,   0 skipped, org.apache.jmeter.extractor.TestHtmlExtractorJSoup
          0.7sec,    7 completed,   0 failed,   0 skipped, org.apache.jmeter.extractor.TestXPath2Extractor
          0.6sec,    7 completed,   0 failed,   0 skipped, org.apache.jmeter.gui.action.template.TestTemplateManager
          0.0sec,    1 completed,   0 failed,   0 skipped, org.apache.jmeter.gui.action.TestSave
          0.0sec,    6 completed,   0 failed,   0 skipped, org.apache.jmeter.assertions.SizeAssertionTest
          0.2sec,    9 completed,   0 failed,   0 skipped, org.apache.jmeter.assertions.XMLSchemaAssertionTest
          0.0sec,   25 completed,   0 failed,   0 skipped, org.apache.jmeter.assertions.TestJSONPathAssertion
          0.1sec,   10 completed,   0 failed,   0 skipped, org.apache.jmeter.assertions.ResponseAssertionTest
          0.3sec,    7 completed,   0 failed,   0 skipped, org.apache.jmeter.assertions.jmespath.gui.JMESPathAssertionGuiTest
          0.0sec,    4 completed,   0 failed,   0 skipped, org.apache.jmeter.assertions.XmlAssertionTest
          0.0sec,    4 completed,   0 failed,   0 skipped, org.apache.jmeter.assertions.DurationAssertionTest
          0.2sec,   29 completed,   0 failed,   0 skipped, org.apache.jmeter.assertions.XPathAssertionTest
          0.6sec,    6 completed,   0 failed,   0 skipped, org.apache.jmeter.assertions.SMIMEAssertionTest
          0.1sec,   14 completed,   0 failed,   0 skipped, org.apache.jmeter.assertions.XPath2AssertionTest
          0.1sec,    7 completed,   0 failed,   0 skipped, org.apache.jmeter.assertions.gui.TestJSONPathAssertionGui
          0.0sec,    9 completed,   0 failed,   0 skipped, org.apache.jmeter.visualizers.TestSampleCompareTo
          0.2sec,   10 completed,   0 failed,   0 skipped, org.apache.jmeter.extractor.json.jmespath.TestJMESPathExtractor$SourceVarOrResponse
          0.0sec,   10 completed,   0 failed,   0 skipped, org.apache.jmeter.extractor.json.jmespath.TestJMESPathExtractor$MatchNumberMoreThanZeroOn1ExtractedValue
          0.0sec,    6 completed,   0 failed,   0 skipped, org.apache.jmeter.extractor.json.jmespath.TestJMESPathExtractor$MultipleMatchesOnAllExtractedValues
          0.0sec,    6 completed,   0 failed,   0 skipped, org.apache.jmeter.extractor.json.jmespath.TestJMESPathExtractor$OneMatchOnAllExtractedValues
          0.2sec,   32 completed,   0 failed,   0 skipped, org.apache.jmeter.extractor.json.jmespath.TestJMESPathExtractor
          0.0sec,   27 completed,   0 failed,   0 skipped, org.apache.jmeter.assertions.jmespath.TestJMESPathAssertion$TestAssertion
          0.0sec,   27 completed,   0 failed,   0 skipped, org.apache.jmeter.assertions.jmespath.TestJMESPathAssertion
          0.1sec,    6 completed,   0 failed,   0 skipped, org.apache.jmeter.timers.UniformRandomTimerSpec
          0.2sec,    5 completed,   0 failed,   0 skipped, org.apache.jmeter.visualizers.backend.graphite.TextGraphiteMetricsSenderSpec
          0.1sec,    7 completed,   0 failed,   0 skipped, org.apache.jmeter.visualizers.backend.graphite.PickleGraphiteMetricsSenderSpec
          0.1sec,    3 completed,   0 failed,   0 skipped, org.apache.jmeter.visualizers.backend.influxdb.InfluxdbBackendListenerClientSpec
          0.1sec,    6 completed,   0 failed,   0 skipped, org.apache.jmeter.visualizers.backend.influxdb.InfluxDBRawBackendListenerClientSpec
          0.0sec,    4 completed,   0 failed,   0 skipped, org.apache.jmeter.control.RandomOrderControllerSpec
          0.0sec,    8 completed,   0 failed,   0 skipped, org.apache.jmeter.control.ThroughputControllerSpec
WARNING   0.0sec,    5 completed,   0 failed,   1 skipped, org.apache.jmeter.control.RunTimeSpec

> Task :src:dist-check:batchBug52968
Creating summariser <summary>
Created the tree successfully using <https://ci-builds.apache.org/job/JMeter/job/JMeter%20Ubuntu/ws/bin/testfiles/Bug52968.jmx>
Starting standalone test @ Thu Mar 11 20:54:01 UTC 2021 (1615496041778)
Waiting for possible Shutdown/StopTestNow/HeapDump/ThreadDump message on port 4445
summary +      1 in 00:00:00 =    9.6/s Avg:     8 Min:     8 Max:     8 Err:     0 (0.00%)
Active: 1 Started: 1 Finished: 0
summary +     29 in 00:00:00 =   63.5/s Avg:     6 Min:     5 Max:     8 Err:     9 (31.03%)
Active: 0 Started: 10 Finished: 10
summary =     30 in 00:00:01 =   53.5/s Avg:     6 Min:     5 Max:     8 Err:     9 (30.00%)
Tidying up ...    @ Thu Mar 11 20:54:02 UTC 2021 (1615496042850)
... end of run
No errors present in the logfile <https://ci-builds.apache.org/job/JMeter/job/JMeter%20Ubuntu/ws/bin/Bug52968.log>
(the file is empty)

> Task :src:components:test FAILED
          0.1sec,   43 completed,   0 failed,   0 skipped, org.apache.jmeter.extractor.BoundaryExtractorSpec
WARNING   0.4sec,    9 completed,   0 failed,   1 skipped, org.apache.jmeter.extractor.json.render.RenderAsJsonRendererSpec
WARNING   0.1sec,    9 completed,   0 failed,   1 skipped, org.apache.jmeter.extractor.json.render.RenderAsJmesPathRendererSpec
          0.0sec,    4 completed,   0 failed,   0 skipped, org.apache.jmeter.extractor.JoddExtractorSpec
          0.0sec,    7 completed,   0 failed,   0 skipped, org.apache.jmeter.assertions.MD5HexAssertionSpec
          0.1sec,    7 completed,   0 failed,   0 skipped, org.apache.jmeter.assertions.CompareAssertionSpec
          0.1sec,    5 completed,   0 failed,   0 skipped, org.apache.jmeter.assertions.gui.AssertionGuiSpec
FAILURE  20.4sec,  505 completed,   1 failed,   4 skipped,
Gradle Test Run :src:components:test

505 tests completed, 1 failed, 4 skipped

> Task :src:dist-check:batchBug54685
Creating summariser <summary>
Created the tree successfully using <https://ci-builds.apache.org/job/JMeter/job/JMeter%20Ubuntu/ws/bin/testfiles/Bug54685.jmx>
Starting standalone test @ Thu Mar 11 20:54:04 UTC 2021 (1615496044898)
Waiting for possible Shutdown/StopTestNow/HeapDump/ThreadDump message on port 4445
summary +      1 in 00:00:00 =   10.8/s Avg:     8 Min:     8 Max:     8 Err:     0 (0.00%)
Active: 1 Started: 1 Finished: 0
summary =      1 in 00:00:00 =   10.4/s Avg:     8 Min:     8 Max:     8 Err:     0 (0.00%)
Tidying up ...    @ Thu Mar 11 20:54:05 UTC 2021 (1615496045476)
... end of run
No errors present in the logfile <https://ci-builds.apache.org/job/JMeter/job/JMeter%20Ubuntu/ws/bin/Bug54685.log>
(the file is empty)
checksum-dependency elapsed time: 28956ms, configurations processed: 259
    SHA-512 computation time: 2679ms (goes in parallel, it might exceed wall-clock time),
files processed: 27, processed: 9MiB, skipped: 2898MiB
    PGP signature resolution time: 1875ms (wall-clock), resolution requests: 154, signatures
resolved: 248
    PGP key resolution time: 19547ms (wall-clock), resolution requests: 154, download time:
0ms (goes in parallel, it might exceed wall-clock time), keys downloaded: 0
        PGP signature verification time: 49369ms (goes in parallel, it might exceed wall-clock
time), files processed: 469, processed: 496MiB, skipped: 2369MiB

FAILURE: Build failed with an exception.

* What went wrong:
Execution failed for task ':src:components:test'.
> There were failing tests. See the report at: file:///home/jenkins/workspace/JMeter/JMeter%20Ubuntu/src/components/build/reports/tests/test/index.html

* Try:
Run with --stacktrace option to get the stack trace. Run with --info or --debug option to
get more log output. Run with --scan to get full insights.

* Get more help at https://help.gradle.org

Deprecated Gradle features were used in this build, making it incompatible with Gradle 7.0.
Use '--warning-mode all' to show the individual deprecation warnings.
See https://docs.gradle.org/6.8.1/userguide/command_line_interface.html#sec:command_line_warnings

BUILD FAILED in 1m 31s
232 actionable tasks: 133 executed, 99 up-to-date
Build step 'Invoke Gradle script' changed build result to FAILURE
Build step 'Invoke Gradle script' marked build as failure

Mime
View raw message