jmeter-dev mailing list archives

Site index · List index
Message view « Date » · « Thread »
Top « Date » · « Thread »
From Apache Jenkins Server <jenk...@builds.apache.org>
Subject Build failed in Jenkins: JMeter » JMeter-trunk #226
Date Mon, 08 Mar 2021 18:31:24 GMT
See <https://ci-builds.apache.org/job/JMeter/job/JMeter-trunk/226/display/redirect?page=changes>

Changes:

[Felix Schumacher] Remove Exception declaration


------------------------------------------
[...truncated 309.35 KB...]
Remote engines have been started:[asf940.gq1.ygridcore.net:35253]
Waiting for possible Shutdown/StopTestNow/HeapDump/ThreadDump message on port 4445
summary +     55 in 00:00:05 =   10.5/s Avg:     4 Min:     1 Max:     8 Err:     8 (14.55%)
Active: 1 Started: 3 Finished: 2
summary +     77 in 00:00:01 =   53.7/s Avg:     4 Min:     1 Max:    71 Err:     8 (10.39%)
Active: 0 Started: 11 Finished: 11
summary =    132 in 00:00:07 =   19.7/s Avg:     4 Min:     1 Max:    71 Err:    16 (12.12%)
Tidying up remote @ Mon Mar 08 18:29:33 UTC 2021 (1615228173673)

[server] Finished the test on host asf940.gq1.ygridcore.net:35253 @ Mon Mar 08 18:29:33 UTC
2021 (1615228173673) - exit requested.

> Task :src:dist-check:batchServerBatchTestLocal
... end of run
No errors present in the logfile <https://ci-builds.apache.org/job/JMeter/job/JMeter-trunk/ws/bin/BatchTestLocal.log>
(the file is empty)
No errors present in the logfile <https://ci-builds.apache.org/job/JMeter/job/JMeter-trunk/ws/bin/BatchTestLocalServer.log>
(the file is empty)

> Task :src:dist-check:batchSlowCharsFeatureHttpClient4 SKIPPED
> Task :src:dist-check:batchSlowCharsFeatureJava SKIPPED
> Task :src:dist-check:batchTCP_TESTS SKIPPED

> Task :src:dist-check:batchTEST_HTTPHttpClient4
Creating summariser <summary>
Created the tree successfully using <https://ci-builds.apache.org/job/JMeter/job/JMeter-trunk/ws/bin/testfiles/TEST_HTTP.jmx>
Starting standalone test @ Mon Mar 08 18:29:41 UTC 2021 (1615228181961)
Waiting for possible Shutdown/StopTestNow/HeapDump/ThreadDump message on port 4445
summary =     22 in 00:00:02 =    9.8/s Avg:    64 Min:     1 Max:  1192 Err:     0 (0.00%)
Tidying up ...    @ Mon Mar 08 18:29:44 UTC 2021 (1615228184684)
... end of run
No errors present in the logfile <https://ci-builds.apache.org/job/JMeter/job/JMeter-trunk/ws/bin/TEST_HTTP.log>
(the file is empty)

> Task :src:dist-check:batchTEST_HTTPJava
Creating summariser <summary>
Created the tree successfully using <https://ci-builds.apache.org/job/JMeter/job/JMeter-trunk/ws/bin/testfiles/TEST_HTTP.jmx>
Starting standalone test @ Mon Mar 08 18:29:49 UTC 2021 (1615228189104)
Waiting for possible Shutdown/StopTestNow/HeapDump/ThreadDump message on port 4445
summary =     20 in 00:00:02 =    9.5/s Avg:    74 Min:     1 Max:  1288 Err:     0 (0.00%)
Tidying up ...    @ Mon Mar 08 18:29:51 UTC 2021 (1615228191698)
... end of run
WARNING: the task was configured to ignore errors in the output log
Logfile contents (errors during the test, see <https://ci-builds.apache.org/job/JMeter/job/JMeter-trunk/ws/bin/TEST_HTTP.log)>:
2021-03-08 18:29:51,456 ERROR o.a.j.p.h.s.HTTPJavaImpl: readResponse: java.net.ProtocolException:
Server redirected too many  times (20)
2021-03-08 18:29:51,460 ERROR o.a.j.p.h.s.HTTPJavaImpl: Cause: java.net.ProtocolException:
Server redirected too many  times (20)
2021-03-08 18:29:51,461 ERROR o.a.j.p.h.c.HttpMirrorThread: Invalid request received:''

> Task :src:dist-check:batchTEST_HTTPS
Creating summariser <summary>
Created the tree successfully using <https://ci-builds.apache.org/job/JMeter/job/JMeter-trunk/ws/bin/testfiles/TEST_HTTPS.jmx>
Starting standalone test @ Mon Mar 08 18:29:57 UTC 2021 (1615228197578)
Waiting for possible Shutdown/StopTestNow/HeapDump/ThreadDump message on port 4445
summary +      2 in 00:00:02 =    0.9/s Avg:   974 Min:   855 Max:  1094 Err:     0 (0.00%)
Active: 1 Started: 1 Finished: 0
summary =      2 in 00:00:02 =    0.9/s Avg:   974 Min:   855 Max:  1094 Err:     0 (0.00%)
Tidying up ...    @ Mon Mar 08 18:30:00 UTC 2021 (1615228200503)
... end of run
No errors present in the logfile <https://ci-builds.apache.org/job/JMeter/job/JMeter-trunk/ws/bin/TEST_HTTPS.log>
(the file is empty)

> Task :src:dist-check:batchTestCookieManager
Creating summariser <summary>
Created the tree successfully using <https://ci-builds.apache.org/job/JMeter/job/JMeter-trunk/ws/bin/testfiles/TestCookieManager.jmx>
Starting standalone test @ Mon Mar 08 18:30:03 UTC 2021 (1615228203415)
Waiting for possible Shutdown/StopTestNow/HeapDump/ThreadDump message on port 4445
summary =     10 in 00:00:03 =    3.8/s Avg:   207 Min:     1 Max:  1355 Err:     0 (0.00%)
Tidying up ...    @ Mon Mar 08 18:30:07 UTC 2021 (1615228207276)
... end of run
No errors present in the logfile <https://ci-builds.apache.org/job/JMeter/job/JMeter-trunk/ws/bin/TestCookieManager.log>
(the file is empty)

> Task :src:dist-check:batchTestHeaderManagerHttpClient4
Creating summariser <summary>
Created the tree successfully using <https://ci-builds.apache.org/job/JMeter/job/JMeter-trunk/ws/bin/testfiles/TestHeaderManager.jmx>
Starting standalone test @ Mon Mar 08 18:30:11 UTC 2021 (1615228211939)
Waiting for possible Shutdown/StopTestNow/HeapDump/ThreadDump message on port 4445
summary =      3 in 00:00:01 =    5.2/s Avg:    18 Min:     2 Max:    50 Err:     0 (0.00%)
Tidying up ...    @ Mon Mar 08 18:30:13 UTC 2021 (1615228213277)
... end of run
No errors present in the logfile <https://ci-builds.apache.org/job/JMeter/job/JMeter-trunk/ws/bin/TestHeaderManager.log>
(the file is empty)

> Task :src:dist-check:batchTestHeaderManagerJava
Creating summariser <summary>
Created the tree successfully using <https://ci-builds.apache.org/job/JMeter/job/JMeter-trunk/ws/bin/testfiles/TestHeaderManager.jmx>
Starting standalone test @ Mon Mar 08 18:30:16 UTC 2021 (1615228216531)
Waiting for possible Shutdown/StopTestNow/HeapDump/ThreadDump message on port 4445
summary =      3 in 00:00:00 =   11.4/s Avg:     6 Min:     1 Max:    17 Err:     0 (0.00%)
Tidying up ...    @ Mon Mar 08 18:30:17 UTC 2021 (1615228217328)
... end of run
No errors present in the logfile <https://ci-builds.apache.org/job/JMeter/job/JMeter-trunk/ws/bin/TestHeaderManager.log>
(the file is empty)

> Task :src:dist-check:batchTestKeepAlive SKIPPED
> Task :src:dist-check:batchTestRedirectionPolicies SKIPPED

> Task :src:dist-check:batchTestResultStatusAction
Creating summariser <summary>
Created the tree successfully using <https://ci-builds.apache.org/job/JMeter/job/JMeter-trunk/ws/bin/testfiles/TestResultStatusAction.jmx>
Starting standalone test @ Mon Mar 08 18:30:19 UTC 2021 (1615228219708)
Waiting for possible Shutdown/StopTestNow/HeapDump/ThreadDump message on port 4445
summary =    135 in 00:00:01 =   90.5/s Avg:     2 Min:     0 Max:   235 Err:    18 (13.33%)
Tidying up ...    @ Mon Mar 08 18:30:21 UTC 2021 (1615228221992)
... end of run
No errors present in the logfile <https://ci-builds.apache.org/job/JMeter/job/JMeter-trunk/ws/bin/TestResultStatusAction.log>
(the file is empty)

> Task :src:dist-check:batchTestSchedulerWithTimer
Creating summariser <summary>
Created the tree successfully using <https://ci-builds.apache.org/job/JMeter/job/JMeter-trunk/ws/bin/testfiles/TestSchedulerWithTimer.jmx>
Starting standalone test @ Mon Mar 08 18:30:25 UTC 2021 (1615228225548)
Waiting for possible Shutdown/StopTestNow/HeapDump/ThreadDump message on port 4445
summary +      1 in 00:00:02 =    0.4/s Avg:  2272 Min:  2272 Max:  2272 Err:     0 (0.00%)
Active: 1 Started: 1 Finished: 0
summary +      4 in 00:00:08 =    0.5/s Avg:   485 Min:     2 Max:  1923 Err:     1 (25.00%)
Active: 0 Started: 1 Finished: 1
summary =      5 in 00:00:10 =    0.5/s Avg:   843 Min:     2 Max:  2272 Err:     1 (20.00%)
Tidying up ...    @ Mon Mar 08 18:30:37 UTC 2021 (1615228237579)
... end of run
ERROR: unexpected output for TestSchedulerWithTimer.csv:
  - expected 57 bytes, <https://ci-builds.apache.org/job/JMeter/job/JMeter-trunk/ws/bin/testfiles/TestSchedulerWithTimer.csv>
  + actual 58 bytes, <https://ci-builds.apache.org/job/JMeter/job/JMeter-trunk/ws/bin/TestSchedulerWithTimer.csv>
@@ -1 +1 @@
-JSRCheckDuration,200,tearDown Thread Group 1-1,text,true
+JSRCheckDuration,200,tearDown Thread Group 1-1,text,false
ERROR: unexpected output for TestSchedulerWithTimer.xml:
  - expected 143 bytes, <https://ci-builds.apache.org/job/JMeter/job/JMeter-trunk/ws/bin/testfiles/TestSchedulerWithTimer.xml>
  + actual 144 bytes, <https://ci-builds.apache.org/job/JMeter/job/JMeter-trunk/ws/bin/TestSchedulerWithTimer.xml>
@@ -1,5 +1,5 @@
 <?xml version="1.0" encoding="UTF-8"?>
 <testResults version="1.2">
-<sample s="true" lb="JSRCheckDuration" rc="200" dt="text"/>
+<sample s="false" lb="JSRCheckDuration" rc="200" dt="text"/>
 
 </testResults>
Logfile contents (errors during the test, see <https://ci-builds.apache.org/job/JMeter/job/JMeter-trunk/ws/bin/TestSchedulerWithTimer.log)>:
2021-03-08 18:30:37,442 WARN o.a.j.p.j.s.J.JSRCheckDuration: Duration 7537 exceeded expected
duration of 6000

> Task :src:dist-check:batchTestSchedulerWithTimer FAILED
checksum-dependency elapsed time: 136501ms, configurations processed: 374
    SHA-512 computation time: 1649ms (goes in parallel, it might exceed wall-clock time),
files processed: 46, processed: 14MiB, skipped: 3378MiB
    PGP signature resolution time: 2936ms (wall-clock), resolution requests: 224, signatures
resolved: 265
    PGP key resolution time: 112350ms (wall-clock), resolution requests: 224, download time:
0ms (goes in parallel, it might exceed wall-clock time), keys downloaded: 0
        PGP signature verification time: 194568ms (goes in parallel, it might exceed wall-clock
time), files processed: 781, processed: 680MiB, skipped: 2665MiB

Build jmeter FAILURE reason:                                
    Execution failed for task ':src:dist-check:batchTestSchedulerWithTimer':
        Failures detected while testing <https://ci-builds.apache.org/job/JMeter/job/JMeter-trunk/ws/bin/testfiles/TestSchedulerWithTimer.jmx>:
[unexpected output TestSchedulerWithTimer.csv, unexpected output TestSchedulerWithTimer.xml,
errors in TestSchedulerWithTimer.log]
            at org.apache.jmeter.buildtools.batchtest.BatchTest.exec(BatchTest.kt:184)
            at org.gradle.internal.reflect.JavaMethod.invoke(JavaMethod.java:104)
            at org.gradle.api.internal.project.taskfactory.StandardTaskAction.doExecute(StandardTaskAction.java:58)
            at org.gradle.api.internal.project.taskfactory.StandardTaskAction.execute(StandardTaskAction.java:51)
            at org.gradle.api.internal.project.taskfactory.StandardTaskAction.execute(StandardTaskAction.java:29)
            at org.gradle.api.internal.tasks.execution.ExecuteActionsTaskExecuter$2.run(ExecuteActionsTaskExecuter.java:494)
            at org.gradle.internal.operations.DefaultBuildOperationRunner$1.execute(DefaultBuildOperationRunner.java:29)
            at org.gradle.internal.operations.DefaultBuildOperationRunner$1.execute(DefaultBuildOperationRunner.java:26)
            at org.gradle.internal.operations.DefaultBuildOperationRunner$3.execute(DefaultBuildOperationRunner.java:75)
            at org.gradle.internal.operations.DefaultBuildOperationRunner$3.execute(DefaultBuildOperationRunner.java:68)
            at org.gradle.internal.operations.DefaultBuildOperationRunner.execute(DefaultBuildOperationRunner.java:153)
            at org.gradle.internal.operations.DefaultBuildOperationRunner.execute(DefaultBuildOperationRunner.java:68)
            at org.gradle.internal.operations.DefaultBuildOperationRunner.run(DefaultBuildOperationRunner.java:56)
            at org.gradle.internal.operations.DefaultBuildOperationExecutor.lambda$run$1(DefaultBuildOperationExecutor.java:71)
            at org.gradle.internal.operations.UnmanagedBuildOperationWrapper.runWithUnmanagedSupport(UnmanagedBuildOperationWrapper.java:45)
            at org.gradle.internal.operations.DefaultBuildOperationExecutor.run(DefaultBuildOperationExecutor.java:71)
            at org.gradle.api.internal.tasks.execution.ExecuteActionsTaskExecuter.executeAction(ExecuteActionsTaskExecuter.java:479)
            at org.gradle.api.internal.tasks.execution.ExecuteActionsTaskExecuter.executeActions(ExecuteActionsTaskExecuter.java:462)
            at org.gradle.api.internal.tasks.execution.ExecuteActionsTaskExecuter.access$400(ExecuteActionsTaskExecuter.java:105)
            at org.gradle.api.internal.tasks.execution.ExecuteActionsTaskExecuter$TaskExecution.executeWithPreviousOutputFiles(ExecuteActionsTaskExecuter.java:273)
            at org.gradle.api.internal.tasks.execution.ExecuteActionsTaskExecuter$TaskExecution.execute(ExecuteActionsTaskExecuter.java:251)
            at org.gradle.internal.execution.steps.ExecuteStep.lambda$executeOperation$1(ExecuteStep.java:66)
            at org.gradle.internal.execution.steps.ExecuteStep.executeOperation(ExecuteStep.java:66)
            at org.gradle.internal.execution.steps.ExecuteStep.access$000(ExecuteStep.java:34)
            at org.gradle.internal.execution.steps.ExecuteStep$1.call(ExecuteStep.java:47)
            at org.gradle.internal.execution.steps.ExecuteStep$1.call(ExecuteStep.java:44)
            at org.gradle.internal.operations.DefaultBuildOperationRunner$CallableBuildOperationWorker.execute(DefaultBuildOperationRunner.java:200)
            at org.gradle.internal.operations.DefaultBuildOperationRunner$CallableBuildOperationWorker.execute(DefaultBuildOperationRunner.java:195)
            at org.gradle.internal.operations.DefaultBuildOperationRunner$3.execute(DefaultBuildOperationRunner.java:75)
            at org.gradle.internal.operations.DefaultBuildOperationRunner$3.execute(DefaultBuildOperationRunner.java:68)
            at org.gradle.internal.operations.DefaultBuildOperationRunner.execute(DefaultBuildOperationRunner.java:153)
            at org.gradle.internal.operations.DefaultBuildOperationRunner.execute(DefaultBuildOperationRunner.java:68)
            at org.gradle.internal.operations.DefaultBuildOperationRunner.call(DefaultBuildOperationRunner.java:62)
            at org.gradle.internal.operations.DefaultBuildOperationExecutor.lambda$call$2(DefaultBuildOperationExecutor.java:76)
            at org.gradle.internal.operations.UnmanagedBuildOperationWrapper.callWithUnmanagedSupport(UnmanagedBuildOperationWrapper.java:54)
            at org.gradle.internal.operations.DefaultBuildOperationExecutor.call(DefaultBuildOperationExecutor.java:76)
            at org.gradle.internal.execution.steps.ExecuteStep.execute(ExecuteStep.java:44)
            at org.gradle.internal.execution.steps.ExecuteStep.execute(ExecuteStep.java:34)
            at org.gradle.internal.execution.steps.RemovePreviousOutputsStep.execute(RemovePreviousOutputsStep.java:72)
            at org.gradle.internal.execution.steps.RemovePreviousOutputsStep.execute(RemovePreviousOutputsStep.java:42)
            at org.gradle.internal.execution.steps.ResolveInputChangesStep.execute(ResolveInputChangesStep.java:53)
            at org.gradle.internal.execution.steps.ResolveInputChangesStep.execute(ResolveInputChangesStep.java:39)
            at org.gradle.internal.execution.steps.CancelExecutionStep.execute(CancelExecutionStep.java:44)
            at org.gradle.internal.execution.steps.TimeoutStep.executeWithoutTimeout(TimeoutStep.java:77)
            at org.gradle.internal.execution.steps.TimeoutStep.execute(TimeoutStep.java:58)
            at org.gradle.internal.execution.steps.CreateOutputsStep.execute(CreateOutputsStep.java:54)
            at org.gradle.internal.execution.steps.CreateOutputsStep.execute(CreateOutputsStep.java:32)
            at org.gradle.internal.execution.steps.CaptureStateAfterExecutionStep.execute(CaptureStateAfterExecutionStep.java:57)
            at org.gradle.internal.execution.steps.CaptureStateAfterExecutionStep.execute(CaptureStateAfterExecutionStep.java:38)
            at org.gradle.internal.execution.steps.BroadcastChangingOutputsStep.execute(BroadcastChangingOutputsStep.java:63)
            at org.gradle.internal.execution.steps.BroadcastChangingOutputsStep.execute(BroadcastChangingOutputsStep.java:30)
            at org.gradle.internal.execution.steps.BuildCacheStep.executeWithoutCache(BuildCacheStep.java:176)
            at org.gradle.internal.execution.steps.BuildCacheStep.execute(BuildCacheStep.java:76)
            at org.gradle.internal.execution.steps.BuildCacheStep.execute(BuildCacheStep.java:47)
            at org.gradle.internal.execution.steps.StoreExecutionStateStep.execute(StoreExecutionStateStep.java:43)
            at org.gradle.internal.execution.steps.StoreExecutionStateStep.execute(StoreExecutionStateStep.java:32)
            at org.gradle.internal.execution.steps.RecordOutputsStep.execute(RecordOutputsStep.java:39)
            at org.gradle.internal.execution.steps.RecordOutputsStep.execute(RecordOutputsStep.java:25)
            at org.gradle.internal.execution.steps.SkipUpToDateStep.executeBecause(SkipUpToDateStep.java:102)
            at org.gradle.internal.execution.steps.SkipUpToDateStep.lambda$execute$0(SkipUpToDateStep.java:95)
            at org.gradle.internal.execution.steps.SkipUpToDateStep.execute(SkipUpToDateStep.java:55)
            at org.gradle.internal.execution.steps.SkipUpToDateStep.execute(SkipUpToDateStep.java:39)
            at org.gradle.internal.execution.steps.ResolveChangesStep.execute(ResolveChangesStep.java:83)
            at org.gradle.internal.execution.steps.ResolveChangesStep.execute(ResolveChangesStep.java:44)
            at org.gradle.internal.execution.steps.legacy.MarkSnapshottingInputsFinishedStep.execute(MarkSnapshottingInputsFinishedStep.java:37)
            at org.gradle.internal.execution.steps.legacy.MarkSnapshottingInputsFinishedStep.execute(MarkSnapshottingInputsFinishedStep.java:27)
            at org.gradle.internal.execution.steps.ResolveCachingStateStep.execute(ResolveCachingStateStep.java:96)
            at org.gradle.internal.execution.steps.ResolveCachingStateStep.execute(ResolveCachingStateStep.java:52)
            at org.gradle.internal.execution.steps.CaptureStateBeforeExecutionStep.execute(CaptureStateBeforeExecutionStep.java:83)
            at org.gradle.internal.execution.steps.CaptureStateBeforeExecutionStep.execute(CaptureStateBeforeExecutionStep.java:54)
            at org.gradle.internal.execution.steps.ValidateStep.execute(ValidateStep.java:74)
            at org.gradle.internal.execution.steps.SkipEmptyWorkStep.lambda$execute$2(SkipEmptyWorkStep.java:88)
            at org.gradle.internal.execution.steps.SkipEmptyWorkStep.execute(SkipEmptyWorkStep.java:88)
            at org.gradle.internal.execution.steps.SkipEmptyWorkStep.execute(SkipEmptyWorkStep.java:34)
            at org.gradle.internal.execution.steps.legacy.MarkSnapshottingInputsStartedStep.execute(MarkSnapshottingInputsStartedStep.java:38)
            at org.gradle.internal.execution.steps.LoadExecutionStateStep.execute(LoadExecutionStateStep.java:46)
            at org.gradle.internal.execution.steps.LoadExecutionStateStep.execute(LoadExecutionStateStep.java:34)
            at org.gradle.internal.execution.steps.AssignWorkspaceStep.lambda$execute$0(AssignWorkspaceStep.java:43)
            at org.gradle.api.internal.tasks.execution.ExecuteActionsTaskExecuter$TaskExecution$3.withWorkspace(ExecuteActionsTaskExecuter.java:286)
            at org.gradle.internal.execution.steps.AssignWorkspaceStep.execute(AssignWorkspaceStep.java:43)
            at org.gradle.internal.execution.steps.AssignWorkspaceStep.execute(AssignWorkspaceStep.java:33)
            at org.gradle.internal.execution.steps.IdentityCacheStep.execute(IdentityCacheStep.java:40)
            at org.gradle.internal.execution.steps.IdentityCacheStep.execute(IdentityCacheStep.java:30)
            at org.gradle.internal.execution.steps.IdentifyStep.execute(IdentifyStep.java:54)
            at org.gradle.internal.execution.steps.IdentifyStep.execute(IdentifyStep.java:40)


FAILURE: Build failed with an exception.

* What went wrong:
Execution failed for task ':src:dist-check:batchTestSchedulerWithTimer'.
> Failures detected while testing <https://ci-builds.apache.org/job/JMeter/job/JMeter-trunk/ws/bin/testfiles/TestSchedulerWithTimer.jmx>:
[unexpected output TestSchedulerWithTimer.csv, unexpected output TestSchedulerWithTimer.xml,
errors in TestSchedulerWithTimer.log]

* Try:
Run with --stacktrace option to get the stack trace. Run with --info or --debug option to
get more log output. Run with --scan to get full insights.

* Get more help at https://help.gradle.org

Deprecated Gradle features were used in this build, making it incompatible with Gradle 7.0.
Use '--warning-mode all' to show the individual deprecation warnings.
See https://docs.gradle.org/6.8.1/userguide/command_line_interface.html#sec:command_line_warnings

BUILD FAILED in 5m 44s
357 actionable tasks: 190 executed, 167 up-to-date

See the profiling report at: file://<https://ci-builds.apache.org/job/JMeter/job/JMeter-trunk/ws/build/reports/profile/profile-2021-03-08-18-25-01.html>
A fine-grained performance profile is available: use the --scan option.
Build step 'Invoke Gradle script' changed build result to FAILURE
Build step 'Invoke Gradle script' marked build as failure
Xvfb stopping
Archiving artifacts
[Fast Archiver] Compressed 171.89 MB of artifacts by 82.7% relative to #225
Recording test results
[Checks API] No suitable checks publisher found.

Mime
View raw message