jmeter-dev mailing list archives

Site index · List index
Message view « Date » · « Thread »
Top « Date » · « Thread »
From Apache Jenkins Server <jenk...@builds.apache.org>
Subject Build failed in Jenkins: JMeter » JMeter-trunk #250
Date Sat, 24 Apr 2021 09:36:20 GMT
See <https://ci-builds.apache.org/job/JMeter/job/JMeter-trunk/250/display/redirect?page=changes>

Changes:

[Felix Schumacher] JMESPathExtractor writes error log entries if JMESPath filter returns empty
result


------------------------------------------
[...truncated 255.37 KB...]

> Task :src:components:spotbugsTest
47 SpotBugs violations were found. See the report at: file://<https://ci-builds.apache.org/job/JMeter/job/JMeter-trunk/ws/src/components/build/reports/spotbugs/test.xml>

org.gradle.api.GradleException: 47 SpotBugs violations were found. See the report at: file://<https://ci-builds.apache.org/job/JMeter/job/JMeter-trunk/ws/src/components/build/reports/spotbugs/test.xml>
	at com.github.spotbugs.snom.internal.SpotBugsRunnerForWorker$SpotBugsExecutor.execute(SpotBugsRunnerForWorker.java:115)
	at org.gradle.workers.internal.DefaultWorkerServer.execute(DefaultWorkerServer.java:63)
	at org.gradle.workers.internal.AbstractClassLoaderWorker$1.create(AbstractClassLoaderWorker.java:49)
	at org.gradle.workers.internal.AbstractClassLoaderWorker$1.create(AbstractClassLoaderWorker.java:43)
	at org.gradle.internal.classloader.ClassLoaderUtils.executeInClassloader(ClassLoaderUtils.java:97)
	at org.gradle.workers.internal.AbstractClassLoaderWorker.executeInClassLoader(AbstractClassLoaderWorker.java:43)
	at org.gradle.workers.internal.IsolatedClassloaderWorker.run(IsolatedClassloaderWorker.java:49)
	at org.gradle.workers.internal.IsolatedClassloaderWorker.run(IsolatedClassloaderWorker.java:30)
	at org.gradle.workers.internal.WorkerDaemonServer.run(WorkerDaemonServer.java:85)
	at org.gradle.workers.internal.WorkerDaemonServer.run(WorkerDaemonServer.java:55)
	at org.gradle.process.internal.worker.request.WorkerAction$1.call(WorkerAction.java:138)
	at org.gradle.process.internal.worker.child.WorkerLogEventListener.withWorkerLoggingProtocol(WorkerLogEventListener.java:41)
	at org.gradle.process.internal.worker.request.WorkerAction.run(WorkerAction.java:135)
	at sun.reflect.NativeMethodAccessorImpl.invoke0(Native Method)
	at sun.reflect.NativeMethodAccessorImpl.invoke(NativeMethodAccessorImpl.java:62)
	at sun.reflect.DelegatingMethodAccessorImpl.invoke(DelegatingMethodAccessorImpl.java:43)
	at java.lang.reflect.Method.invoke(Method.java:498)
	at org.gradle.internal.dispatch.ReflectionDispatch.dispatch(ReflectionDispatch.java:36)
	at org.gradle.internal.dispatch.ReflectionDispatch.dispatch(ReflectionDispatch.java:24)
	at org.gradle.internal.remote.internal.hub.MessageHubBackedObjectConnection$DispatchWrapper.dispatch(MessageHubBackedObjectConnection.java:182)
	at org.gradle.internal.remote.internal.hub.MessageHubBackedObjectConnection$DispatchWrapper.dispatch(MessageHubBackedObjectConnection.java:164)
	at org.gradle.internal.remote.internal.hub.MessageHub$Handler.run(MessageHub.java:414)
	at org.gradle.internal.concurrent.ExecutorPolicy$CatchAndRecordFailures.onExecute(ExecutorPolicy.java:64)
	at org.gradle.internal.concurrent.ManagedExecutorImpl$1.run(ManagedExecutorImpl.java:48)
	at java.util.concurrent.ThreadPoolExecutor.runWorker(ThreadPoolExecutor.java:1149)
	at java.util.concurrent.ThreadPoolExecutor$Worker.run(ThreadPoolExecutor.java:624)
	at org.gradle.internal.concurrent.ThreadFactoryImpl$ManagedThreadRunnable.run(ThreadFactoryImpl.java:56)
	at java.lang.Thread.run(Thread.java:748)

> Task :src:components:test
          2.7sec, org.apache.jmeter.visualizers.backend.influxdb.HttpMetricsSenderTest
> checkTokenPresentInHeader(WireMockServer)
          5.4sec,    4 completed,   0 failed,   0 skipped, org.apache.jmeter.visualizers.backend.influxdb.HttpMetricsSenderTest
          0.1sec,    8 completed,   0 failed,   0 skipped, org.apache.jmeter.visualizers.TestRenderAsJson
          0.0sec,    2 completed,   0 failed,   0 skipped, org.apache.jmeter.visualizers.TestSamplingStatCalculator
          0.5sec,    1 completed,   0 failed,   0 skipped, org.apache.jmeter.resources.ResourceKeyUsageTestComponents
WARNING   1.5sec,    8 completed,   0 failed,   1 skipped, org.apache.jmeter.control.TestIfController
          0.0sec,    1 completed,   0 failed,   0 skipped, org.apache.jmeter.control.TestGenericController
          0.2sec,    4 completed,   0 failed,   0 skipped, org.apache.jmeter.control.TestLoopController
          0.0sec,    6 completed,   0 failed,   0 skipped, org.apache.jmeter.control.TestInterleaveControl
          0.1sec,    1 completed,   0 failed,   0 skipped, org.apache.jmeter.control.TestTransactionController
          0.0sec,    4 completed,   0 failed,   0 skipped, org.apache.jmeter.control.TestOnceOnlyController
          0.0sec,   12 completed,   0 failed,   0 skipped, org.apache.jmeter.control.TestWhileController
          0.0sec,    3 completed,   0 failed,   0 skipped, org.apache.jmeter.control.TestRandomController
          0.0sec,    5 completed,   0 failed,   0 skipped, org.apache.jmeter.reporters.TestResultSaver
          0.1sec,    6 completed,   0 failed,   0 skipped, org.apache.jmeter.config.TestCVSDataSet
          0.6sec,    1 completed,   0 failed,   0 skipped, org.apache.jmeter.config.gui.TestArgumentsPanel
          0.0sec,    3 completed,   0 failed,   0 skipped, org.apache.jmeter.config.TestRandomVariableConfig
          1.5sec,    6 completed,   0 failed,   0 skipped, org.apache.jmeter.assertions.SMIMEAssertionTest
          0.9sec,    7 completed,   0 failed,   0 skipped, org.apache.jmeter.assertions.gui.TestJSONPathAssertionGui

> Task :src:dist-check:batchBug52968
Creating summariser <summary>
Created the tree successfully using <https://ci-builds.apache.org/job/JMeter/job/JMeter-trunk/ws/bin/testfiles/Bug52968.jmx>
Starting standalone test @ Sat Apr 24 09:35:10 UTC 2021 (1619256910818)
Waiting for possible Shutdown/StopTestNow/HeapDump/ThreadDump message on port 4445
summary =     30 in 00:00:01 =   26.2/s Avg:     7 Min:     5 Max:    17 Err:     9 (30.00%)
Tidying up ...    @ Sat Apr 24 09:35:13 UTC 2021 (1619256913548)
... end of run
No errors present in the logfile <https://ci-builds.apache.org/job/JMeter/job/JMeter-trunk/ws/bin/Bug52968.log>
(the file is empty)

> Task :src:protocol:http:spotbugsMain
25 SpotBugs violations were found. See the report at: file://<https://ci-builds.apache.org/job/JMeter/job/JMeter-trunk/ws/src/protocol/http/build/reports/spotbugs/main.xml>

org.gradle.api.GradleException: 25 SpotBugs violations were found. See the report at: file://<https://ci-builds.apache.org/job/JMeter/job/JMeter-trunk/ws/src/protocol/http/build/reports/spotbugs/main.xml>
	at com.github.spotbugs.snom.internal.SpotBugsRunnerForWorker$SpotBugsExecutor.execute(SpotBugsRunnerForWorker.java:115)
	at org.gradle.workers.internal.DefaultWorkerServer.execute(DefaultWorkerServer.java:63)
	at org.gradle.workers.internal.AbstractClassLoaderWorker$1.create(AbstractClassLoaderWorker.java:49)
	at org.gradle.workers.internal.AbstractClassLoaderWorker$1.create(AbstractClassLoaderWorker.java:43)
	at org.gradle.internal.classloader.ClassLoaderUtils.executeInClassloader(ClassLoaderUtils.java:97)
	at org.gradle.workers.internal.AbstractClassLoaderWorker.executeInClassLoader(AbstractClassLoaderWorker.java:43)
	at org.gradle.workers.internal.IsolatedClassloaderWorker.run(IsolatedClassloaderWorker.java:49)
	at org.gradle.workers.internal.IsolatedClassloaderWorker.run(IsolatedClassloaderWorker.java:30)
	at org.gradle.workers.internal.WorkerDaemonServer.run(WorkerDaemonServer.java:85)
	at org.gradle.workers.internal.WorkerDaemonServer.run(WorkerDaemonServer.java:55)
	at org.gradle.process.internal.worker.request.WorkerAction$1.call(WorkerAction.java:138)
	at org.gradle.process.internal.worker.child.WorkerLogEventListener.withWorkerLoggingProtocol(WorkerLogEventListener.java:41)
	at org.gradle.process.internal.worker.request.WorkerAction.run(WorkerAction.java:135)
	at sun.reflect.NativeMethodAccessorImpl.invoke0(Native Method)
	at sun.reflect.NativeMethodAccessorImpl.invoke(NativeMethodAccessorImpl.java:62)
	at sun.reflect.DelegatingMethodAccessorImpl.invoke(DelegatingMethodAccessorImpl.java:43)
	at java.lang.reflect.Method.invoke(Method.java:498)
	at org.gradle.internal.dispatch.ReflectionDispatch.dispatch(ReflectionDispatch.java:36)
	at org.gradle.internal.dispatch.ReflectionDispatch.dispatch(ReflectionDispatch.java:24)
	at org.gradle.internal.remote.internal.hub.MessageHubBackedObjectConnection$DispatchWrapper.dispatch(MessageHubBackedObjectConnection.java:182)
	at org.gradle.internal.remote.internal.hub.MessageHubBackedObjectConnection$DispatchWrapper.dispatch(MessageHubBackedObjectConnection.java:164)
	at org.gradle.internal.remote.internal.hub.MessageHub$Handler.run(MessageHub.java:414)
	at org.gradle.internal.concurrent.ExecutorPolicy$CatchAndRecordFailures.onExecute(ExecutorPolicy.java:64)
	at org.gradle.internal.concurrent.ManagedExecutorImpl$1.run(ManagedExecutorImpl.java:48)
	at java.util.concurrent.ThreadPoolExecutor.runWorker(ThreadPoolExecutor.java:1149)
	at java.util.concurrent.ThreadPoolExecutor$Worker.run(ThreadPoolExecutor.java:624)
	at org.gradle.internal.concurrent.ThreadFactoryImpl$ManagedThreadRunnable.run(ThreadFactoryImpl.java:56)
	at java.lang.Thread.run(Thread.java:748)

> Task :src:components:test
          0.2sec,   14 completed,   0 failed,   0 skipped, org.apache.jmeter.assertions.XPath2AssertionTest
          0.2sec,   29 completed,   0 failed,   0 skipped, org.apache.jmeter.assertions.XPathAssertionTest
          0.0sec,   25 completed,   0 failed,   0 skipped, org.apache.jmeter.assertions.TestJSONPathAssertion
          0.3sec,    9 completed,   0 failed,   0 skipped, org.apache.jmeter.assertions.XMLSchemaAssertionTest
          0.1sec,    7 completed,   0 failed,   0 skipped, org.apache.jmeter.assertions.jmespath.gui.JMESPathAssertionGuiTest
          0.0sec,    4 completed,   0 failed,   0 skipped, org.apache.jmeter.assertions.XmlAssertionTest
          0.0sec,    4 completed,   0 failed,   0 skipped, org.apache.jmeter.assertions.DurationAssertionTest
          0.0sec,    6 completed,   0 failed,   0 skipped, org.apache.jmeter.assertions.SizeAssertionTest
          0.2sec,   10 completed,   0 failed,   0 skipped, org.apache.jmeter.assertions.ResponseAssertionTest
FAILURE   0.0sec, org.apache.jmeter.extractor.json.jmespath.TestJMESPathExtractor$SourceVarOrResponse
> testRandomElementOneMatch[0]
    java.lang.AssertionError: 
    Expected: is "value"
         but: was "NONE"
        at org.hamcrest.MatcherAssert.assertThat(MatcherAssert.java:20)
        at org.hamcrest.MatcherAssert.assertThat(MatcherAssert.java:6)
        at org.apache.jmeter.extractor.json.jmespath.TestJMESPathExtractor$SourceVarOrResponse.testRandomElementOneMatch(TestJMESPathExtractor.java:246)

FAILURE   0.0sec, org.apache.jmeter.extractor.json.jmespath.TestJMESPathExtractor$SourceVarOrResponse
> testRandomElementOneMatch[1]
    java.lang.AssertionError: 
    Expected: is "value"
         but: was "NONE"
        at org.hamcrest.MatcherAssert.assertThat(MatcherAssert.java:20)
        at org.hamcrest.MatcherAssert.assertThat(MatcherAssert.java:6)
        at org.apache.jmeter.extractor.json.jmespath.TestJMESPathExtractor$SourceVarOrResponse.testRandomElementOneMatch(TestJMESPathExtractor.java:246)

FAILURE   0.2sec,   10 completed,   2 failed,   0 skipped, org.apache.jmeter.extractor.json.jmespath.TestJMESPathExtractor$SourceVarOrResponse
          0.0sec,   10 completed,   0 failed,   0 skipped, org.apache.jmeter.extractor.json.jmespath.TestJMESPathExtractor$MatchNumberMoreThanZeroOn1ExtractedValue
          0.0sec,    6 completed,   0 failed,   0 skipped, org.apache.jmeter.extractor.json.jmespath.TestJMESPathExtractor$MultipleMatchesOnAllExtractedValues
FAILURE   0.0sec, org.apache.jmeter.extractor.json.jmespath.TestJMESPathExtractor$OneMatchOnAllExtractedValues
> testFromVars[1]
    java.lang.AssertionError: 
    Expected: is null
         but: was "NONE"
        at org.hamcrest.MatcherAssert.assertThat(MatcherAssert.java:20)
        at org.hamcrest.MatcherAssert.assertThat(MatcherAssert.java:6)
        at org.apache.jmeter.extractor.json.jmespath.TestJMESPathExtractor$OneMatchOnAllExtractedValues.test(TestJMESPathExtractor.java:106)
        at org.apache.jmeter.extractor.json.jmespath.TestJMESPathExtractor$OneMatchOnAllExtractedValues.testFromVars(TestJMESPathExtractor.java:92)

FAILURE   0.0sec, org.apache.jmeter.extractor.json.jmespath.TestJMESPathExtractor$OneMatchOnAllExtractedValues
> testFromSampleResult[1]
    java.lang.AssertionError: 
    Expected: is null
         but: was "NONE"
        at org.hamcrest.MatcherAssert.assertThat(MatcherAssert.java:20)
        at org.hamcrest.MatcherAssert.assertThat(MatcherAssert.java:6)
        at org.apache.jmeter.extractor.json.jmespath.TestJMESPathExtractor$OneMatchOnAllExtractedValues.test(TestJMESPathExtractor.java:106)
        at org.apache.jmeter.extractor.json.jmespath.TestJMESPathExtractor$OneMatchOnAllExtractedValues.testFromSampleResult(TestJMESPathExtractor.java:97)

FAILURE   0.0sec,    6 completed,   2 failed,   0 skipped, org.apache.jmeter.extractor.json.jmespath.TestJMESPathExtractor$OneMatchOnAllExtractedValues
FAILURE   0.2sec,   32 completed,   4 failed,   0 skipped, org.apache.jmeter.extractor.json.jmespath.TestJMESPathExtractor
          0.0sec,    9 completed,   0 failed,   0 skipped, org.apache.jmeter.visualizers.TestSampleCompareTo
          0.0sec,   27 completed,   0 failed,   0 skipped, org.apache.jmeter.assertions.jmespath.TestJMESPathAssertion$TestAssertion
          0.0sec,   27 completed,   0 failed,   0 skipped, org.apache.jmeter.assertions.jmespath.TestJMESPathAssertion
          0.1sec,    6 completed,   0 failed,   0 skipped, org.apache.jmeter.timers.UniformRandomTimerSpec
          0.3sec,   11 completed,   0 failed,   0 skipped, org.apache.jmeter.extractor.json.render.RenderAsJsonRendererSpec
          0.1sec,   11 completed,   0 failed,   0 skipped, org.apache.jmeter.extractor.json.render.RenderAsJmesPathRendererSpec
          0.2sec,   43 completed,   0 failed,   0 skipped, org.apache.jmeter.extractor.BoundaryExtractorSpec
          0.0sec,    4 completed,   0 failed,   0 skipped, org.apache.jmeter.extractor.JoddExtractorSpec
          0.3sec,    5 completed,   0 failed,   0 skipped, org.apache.jmeter.visualizers.backend.graphite.TextGraphiteMetricsSenderSpec
          0.0sec,    7 completed,   0 failed,   0 skipped, org.apache.jmeter.visualizers.backend.graphite.PickleGraphiteMetricsSenderSpec
          0.1sec,    3 completed,   0 failed,   0 skipped, org.apache.jmeter.visualizers.backend.influxdb.InfluxdbBackendListenerClientSpec
          0.1sec,    6 completed,   0 failed,   0 skipped, org.apache.jmeter.visualizers.backend.influxdb.InfluxDBRawBackendListenerClientSpec
          0.1sec,    8 completed,   0 failed,   0 skipped, org.apache.jmeter.control.ThroughputControllerSpec
WARNING   0.0sec,    5 completed,   0 failed,   1 skipped, org.apache.jmeter.control.RunTimeSpec
          0.0sec,    4 completed,   0 failed,   0 skipped, org.apache.jmeter.control.RandomOrderControllerSpec
          0.2sec,    5 completed,   0 failed,   0 skipped, org.apache.jmeter.assertions.gui.AssertionGuiSpec
          0.1sec,    7 completed,   0 failed,   0 skipped, org.apache.jmeter.assertions.CompareAssertionSpec
          0.0sec,    7 completed,   0 failed,   0 skipped, org.apache.jmeter.assertions.MD5HexAssertionSpec
FAILURE  50.9sec,  509 completed,   4 failed,   2 skipped,
Gradle Test Run :src:components:test

509 tests completed, 4 failed, 2 skipped

> Task :src:components:test FAILED

> Task :src:dist-check:batchBug54685
Creating summariser <summary>
Created the tree successfully using <https://ci-builds.apache.org/job/JMeter/job/JMeter-trunk/ws/bin/testfiles/Bug54685.jmx>
Starting standalone test @ Sat Apr 24 09:35:16 UTC 2021 (1619256916587)
Waiting for possible Shutdown/StopTestNow/HeapDump/ThreadDump message on port 4445
summary =      1 in 00:00:00 =    7.4/s Avg:     7 Min:     7 Max:     7 Err:     0 (0.00%)
Tidying up ...    @ Sat Apr 24 09:35:17 UTC 2021 (1619256917378)
... end of run
No errors present in the logfile <https://ci-builds.apache.org/job/JMeter/job/JMeter-trunk/ws/bin/Bug54685.log>
(the file is empty)

> Task :src:core:spotbugsMain
37 SpotBugs violations were found. See the report at: file://<https://ci-builds.apache.org/job/JMeter/job/JMeter-trunk/ws/src/core/build/reports/spotbugs/main.xml>

org.gradle.api.GradleException: 37 SpotBugs violations were found. See the report at: file://<https://ci-builds.apache.org/job/JMeter/job/JMeter-trunk/ws/src/core/build/reports/spotbugs/main.xml>
	at com.github.spotbugs.snom.internal.SpotBugsRunnerForWorker$SpotBugsExecutor.execute(SpotBugsRunnerForWorker.java:115)
	at org.gradle.workers.internal.DefaultWorkerServer.execute(DefaultWorkerServer.java:63)
	at org.gradle.workers.internal.AbstractClassLoaderWorker$1.create(AbstractClassLoaderWorker.java:49)
	at org.gradle.workers.internal.AbstractClassLoaderWorker$1.create(AbstractClassLoaderWorker.java:43)
	at org.gradle.internal.classloader.ClassLoaderUtils.executeInClassloader(ClassLoaderUtils.java:97)
	at org.gradle.workers.internal.AbstractClassLoaderWorker.executeInClassLoader(AbstractClassLoaderWorker.java:43)
	at org.gradle.workers.internal.IsolatedClassloaderWorker.run(IsolatedClassloaderWorker.java:49)
	at org.gradle.workers.internal.IsolatedClassloaderWorker.run(IsolatedClassloaderWorker.java:30)
	at org.gradle.workers.internal.WorkerDaemonServer.run(WorkerDaemonServer.java:85)
	at org.gradle.workers.internal.WorkerDaemonServer.run(WorkerDaemonServer.java:55)
	at org.gradle.process.internal.worker.request.WorkerAction$1.call(WorkerAction.java:138)
	at org.gradle.process.internal.worker.child.WorkerLogEventListener.withWorkerLoggingProtocol(WorkerLogEventListener.java:41)
	at org.gradle.process.internal.worker.request.WorkerAction.run(WorkerAction.java:135)
	at sun.reflect.NativeMethodAccessorImpl.invoke0(Native Method)
	at sun.reflect.NativeMethodAccessorImpl.invoke(NativeMethodAccessorImpl.java:62)
	at sun.reflect.DelegatingMethodAccessorImpl.invoke(DelegatingMethodAccessorImpl.java:43)
	at java.lang.reflect.Method.invoke(Method.java:498)
	at org.gradle.internal.dispatch.ReflectionDispatch.dispatch(ReflectionDispatch.java:36)
	at org.gradle.internal.dispatch.ReflectionDispatch.dispatch(ReflectionDispatch.java:24)
	at org.gradle.internal.remote.internal.hub.MessageHubBackedObjectConnection$DispatchWrapper.dispatch(MessageHubBackedObjectConnection.java:182)
	at org.gradle.internal.remote.internal.hub.MessageHubBackedObjectConnection$DispatchWrapper.dispatch(MessageHubBackedObjectConnection.java:164)
	at org.gradle.internal.remote.internal.hub.MessageHub$Handler.run(MessageHub.java:414)
	at org.gradle.internal.concurrent.ExecutorPolicy$CatchAndRecordFailures.onExecute(ExecutorPolicy.java:64)
	at org.gradle.internal.concurrent.ManagedExecutorImpl$1.run(ManagedExecutorImpl.java:48)
	at java.util.concurrent.ThreadPoolExecutor.runWorker(ThreadPoolExecutor.java:1149)
	at java.util.concurrent.ThreadPoolExecutor$Worker.run(ThreadPoolExecutor.java:624)
	at org.gradle.internal.concurrent.ThreadFactoryImpl$ManagedThreadRunnable.run(ThreadFactoryImpl.java:56)
	at java.lang.Thread.run(Thread.java:748)

> Task :src:dist:javadocAggregate
9 warnings
checksum-dependency elapsed time: 105953ms, configurations processed: 352
    SHA-512 computation time: 3010ms (goes in parallel, it might exceed wall-clock time),
files processed: 43, processed: 12MiB, skipped: 3158MiB
    PGP signature resolution time: 2888ms (wall-clock), resolution requests: 210, signatures
resolved: 266
    PGP key resolution time: 85139ms (wall-clock), resolution requests: 210, download time:
0ms (goes in parallel, it might exceed wall-clock time), keys downloaded: 0
        PGP signature verification time: 162418ms (goes in parallel, it might exceed wall-clock
time), files processed: 801, processed: 829MiB, skipped: 2298MiB

FAILURE: Build failed with an exception.

* What went wrong:
Execution failed for task ':src:components:test'.
> There were failing tests. See the report at: file://<https://ci-builds.apache.org/job/JMeter/job/JMeter-trunk/ws/src/components/build/reports/tests/test/index.html>

* Try:
Run with --stacktrace option to get the stack trace. Run with --info or --debug option to
get more log output. Run with --scan to get full insights.

* Get more help at https://help.gradle.org

Deprecated Gradle features were used in this build, making it incompatible with Gradle 7.0.
Use '--warning-mode all' to show the individual deprecation warnings.
See https://docs.gradle.org/6.8.1/userguide/command_line_interface.html#sec:command_line_warnings

BUILD FAILED in 3m 45s
321 actionable tasks: 159 executed, 162 up-to-date

See the profiling report at: file://<https://ci-builds.apache.org/job/JMeter/job/JMeter-trunk/ws/build/reports/profile/profile-2021-04-24-09-32-27.html>
A fine-grained performance profile is available: use the --scan option.
Build step 'Invoke Gradle script' changed build result to FAILURE
Build step 'Invoke Gradle script' marked build as failure
Xvfb stopping
Archiving artifacts
[Fast Archiver] Compressed 33.62 MB of artifacts by 57.1% relative to #249
Recording test results
[Checks API] No suitable checks publisher found.

Mime
View raw message