jmeter-dev mailing list archives

Site index · List index
Message view « Date » · « Thread »
Top « Date » · « Thread »
From Apache Jenkins Server <jenk...@builds.apache.org>
Subject Build failed in Jenkins: JMeter » JMeter-trunk #251
Date Sat, 24 Apr 2021 09:49:52 GMT
See <https://ci-builds.apache.org/job/JMeter/job/JMeter-trunk/251/display/redirect?page=changes>

Changes:

[Felix Schumacher] JMESPathExtractor Attribute Match No. Required


------------------------------------------
[...truncated 220.71 KB...]
    file.encoding=ISO-8859-1
    default encoding=ISO-8859-1
    user.home=/home/jenkins
    user.dir=<https://ci-builds.apache.org/job/JMeter/job/JMeter-trunk/ws/src/components>
    user.language=en
    user.region=null
    user.country=US
    user.variant=
    Locale=en_US
    java.class.version=52.0
    java.awt.headless=null
    os.name=Linux
    os.version=4.15.0-76-generic
    os.arch=amd64
          0.4sec,    4 completed,   0 failed,   0 skipped, org.apache.jmeter.timers.TimerServiceTest
          0.8sec,    4 completed,   0 failed,   0 skipped, org.apache.jmeter.timers.SyncTimerTest
          0.8sec,    6 completed,   0 failed,   0 skipped, org.apache.jmeter.timers.poissonarrivals.PreciseThroughputTimerTest
          2.4sec,    9 completed,   0 failed,   0 skipped, org.apache.jmeter.timers.ConstantThroughputTimerTest
          1.4sec,    7 completed,   0 failed,   0 skipped, org.apache.jmeter.gui.action.template.TestTemplateManager
          0.0sec,    1 completed,   0 failed,   0 skipped, org.apache.jmeter.gui.action.TestSave
          0.0sec,    4 completed,   0 failed,   0 skipped, org.apache.jmeter.extractor.TestBoundaryExtractor
          0.3sec,   14 completed,   0 failed,   0 skipped, org.apache.jmeter.extractor.TestHtmlExtractorJodd
          0.2sec,   14 completed,   0 failed,   0 skipped, org.apache.jmeter.extractor.TestHtmlExtractorJSoup
          1.6sec,    6 completed,   0 failed,   0 skipped, org.apache.jmeter.extractor.TestXPathExtractor
          1.4sec,    7 completed,   0 failed,   0 skipped, org.apache.jmeter.extractor.TestXPath2Extractor
          0.1sec,   25 completed,   0 failed,   0 skipped, org.apache.jmeter.extractor.TestRegexExtractor
          0.1sec,    9 completed,   0 failed,   0 skipped, org.apache.jmeter.extractor.TestJSONPostProcessor
          0.1sec,    4 completed,   0 failed,   0 skipped, org.apache.jmeter.visualizers.backend.SamplerMetricTimedModeTest
          0.0sec,    5 completed,   0 failed,   0 skipped, org.apache.jmeter.visualizers.backend.SamplerMetricFixedModeTest
          3.3sec,    4 completed,   0 failed,   0 skipped, org.apache.jmeter.visualizers.backend.influxdb.HttpMetricsSenderTest
          0.1sec,    8 completed,   0 failed,   0 skipped, org.apache.jmeter.visualizers.TestRenderAsJson
          0.0sec,    2 completed,   0 failed,   0 skipped, org.apache.jmeter.visualizers.TestSamplingStatCalculator
          0.3sec,    1 completed,   0 failed,   0 skipped, org.apache.jmeter.resources.ResourceKeyUsageTestComponents

> Task :src:core:spotbugsTest
22 SpotBugs violations were found. See the report at: file://<https://ci-builds.apache.org/job/JMeter/job/JMeter-trunk/ws/src/core/build/reports/spotbugs/test.xml>

org.gradle.api.GradleException: 22 SpotBugs violations were found. See the report at: file://<https://ci-builds.apache.org/job/JMeter/job/JMeter-trunk/ws/src/core/build/reports/spotbugs/test.xml>
	at com.github.spotbugs.snom.internal.SpotBugsRunnerForWorker$SpotBugsExecutor.execute(SpotBugsRunnerForWorker.java:115)
	at org.gradle.workers.internal.DefaultWorkerServer.execute(DefaultWorkerServer.java:63)
	at org.gradle.workers.internal.AbstractClassLoaderWorker$1.create(AbstractClassLoaderWorker.java:49)
	at org.gradle.workers.internal.AbstractClassLoaderWorker$1.create(AbstractClassLoaderWorker.java:43)
	at org.gradle.internal.classloader.ClassLoaderUtils.executeInClassloader(ClassLoaderUtils.java:97)
	at org.gradle.workers.internal.AbstractClassLoaderWorker.executeInClassLoader(AbstractClassLoaderWorker.java:43)
	at org.gradle.workers.internal.IsolatedClassloaderWorker.run(IsolatedClassloaderWorker.java:49)
	at org.gradle.workers.internal.IsolatedClassloaderWorker.run(IsolatedClassloaderWorker.java:30)
	at org.gradle.workers.internal.WorkerDaemonServer.run(WorkerDaemonServer.java:85)
	at org.gradle.workers.internal.WorkerDaemonServer.run(WorkerDaemonServer.java:55)
	at org.gradle.process.internal.worker.request.WorkerAction$1.call(WorkerAction.java:138)
	at org.gradle.process.internal.worker.child.WorkerLogEventListener.withWorkerLoggingProtocol(WorkerLogEventListener.java:41)
	at org.gradle.process.internal.worker.request.WorkerAction.run(WorkerAction.java:135)
	at sun.reflect.NativeMethodAccessorImpl.invoke0(Native Method)
	at sun.reflect.NativeMethodAccessorImpl.invoke(NativeMethodAccessorImpl.java:62)
	at sun.reflect.DelegatingMethodAccessorImpl.invoke(DelegatingMethodAccessorImpl.java:43)
	at java.lang.reflect.Method.invoke(Method.java:498)
	at org.gradle.internal.dispatch.ReflectionDispatch.dispatch(ReflectionDispatch.java:36)
	at org.gradle.internal.dispatch.ReflectionDispatch.dispatch(ReflectionDispatch.java:24)
	at org.gradle.internal.remote.internal.hub.MessageHubBackedObjectConnection$DispatchWrapper.dispatch(MessageHubBackedObjectConnection.java:182)
	at org.gradle.internal.remote.internal.hub.MessageHubBackedObjectConnection$DispatchWrapper.dispatch(MessageHubBackedObjectConnection.java:164)
	at org.gradle.internal.remote.internal.hub.MessageHub$Handler.run(MessageHub.java:414)
	at org.gradle.internal.concurrent.ExecutorPolicy$CatchAndRecordFailures.onExecute(ExecutorPolicy.java:64)
	at org.gradle.internal.concurrent.ManagedExecutorImpl$1.run(ManagedExecutorImpl.java:48)
	at java.util.concurrent.ThreadPoolExecutor.runWorker(ThreadPoolExecutor.java:1149)
	at java.util.concurrent.ThreadPoolExecutor$Worker.run(ThreadPoolExecutor.java:624)
	at org.gradle.internal.concurrent.ThreadFactoryImpl$ManagedThreadRunnable.run(ThreadFactoryImpl.java:56)
	at java.lang.Thread.run(Thread.java:748)

> Task :src:components:spotbugsMain
31 SpotBugs violations were found. See the report at: file://<https://ci-builds.apache.org/job/JMeter/job/JMeter-trunk/ws/src/components/build/reports/spotbugs/main.xml>

org.gradle.api.GradleException: 31 SpotBugs violations were found. See the report at: file://<https://ci-builds.apache.org/job/JMeter/job/JMeter-trunk/ws/src/components/build/reports/spotbugs/main.xml>
	at com.github.spotbugs.snom.internal.SpotBugsRunnerForWorker$SpotBugsExecutor.execute(SpotBugsRunnerForWorker.java:115)
	at org.gradle.workers.internal.DefaultWorkerServer.execute(DefaultWorkerServer.java:63)
	at org.gradle.workers.internal.AbstractClassLoaderWorker$1.create(AbstractClassLoaderWorker.java:49)
	at org.gradle.workers.internal.AbstractClassLoaderWorker$1.create(AbstractClassLoaderWorker.java:43)
	at org.gradle.internal.classloader.ClassLoaderUtils.executeInClassloader(ClassLoaderUtils.java:97)
	at org.gradle.workers.internal.AbstractClassLoaderWorker.executeInClassLoader(AbstractClassLoaderWorker.java:43)
	at org.gradle.workers.internal.IsolatedClassloaderWorker.run(IsolatedClassloaderWorker.java:49)
	at org.gradle.workers.internal.IsolatedClassloaderWorker.run(IsolatedClassloaderWorker.java:30)
	at org.gradle.workers.internal.WorkerDaemonServer.run(WorkerDaemonServer.java:85)
	at org.gradle.workers.internal.WorkerDaemonServer.run(WorkerDaemonServer.java:55)
	at org.gradle.process.internal.worker.request.WorkerAction$1.call(WorkerAction.java:138)
	at org.gradle.process.internal.worker.child.WorkerLogEventListener.withWorkerLoggingProtocol(WorkerLogEventListener.java:41)
	at org.gradle.process.internal.worker.request.WorkerAction.run(WorkerAction.java:135)
	at sun.reflect.NativeMethodAccessorImpl.invoke0(Native Method)
	at sun.reflect.NativeMethodAccessorImpl.invoke(NativeMethodAccessorImpl.java:62)
	at sun.reflect.DelegatingMethodAccessorImpl.invoke(DelegatingMethodAccessorImpl.java:43)
	at java.lang.reflect.Method.invoke(Method.java:498)
	at org.gradle.internal.dispatch.ReflectionDispatch.dispatch(ReflectionDispatch.java:36)
	at org.gradle.internal.dispatch.ReflectionDispatch.dispatch(ReflectionDispatch.java:24)
	at org.gradle.internal.remote.internal.hub.MessageHubBackedObjectConnection$DispatchWrapper.dispatch(MessageHubBackedObjectConnection.java:182)
	at org.gradle.internal.remote.internal.hub.MessageHubBackedObjectConnection$DispatchWrapper.dispatch(MessageHubBackedObjectConnection.java:164)
	at org.gradle.internal.remote.internal.hub.MessageHub$Handler.run(MessageHub.java:414)
	at org.gradle.internal.concurrent.ExecutorPolicy$CatchAndRecordFailures.onExecute(ExecutorPolicy.java:64)
	at org.gradle.internal.concurrent.ManagedExecutorImpl$1.run(ManagedExecutorImpl.java:48)
	at java.util.concurrent.ThreadPoolExecutor.runWorker(ThreadPoolExecutor.java:1149)
	at java.util.concurrent.ThreadPoolExecutor$Worker.run(ThreadPoolExecutor.java:624)
	at org.gradle.internal.concurrent.ThreadFactoryImpl$ManagedThreadRunnable.run(ThreadFactoryImpl.java:56)
	at java.lang.Thread.run(Thread.java:748)

> Task :src:components:test
WARNING   0.9sec,    8 completed,   0 failed,   1 skipped, org.apache.jmeter.control.TestIfController
          0.0sec,    1 completed,   0 failed,   0 skipped, org.apache.jmeter.control.TestGenericController
          0.1sec,    4 completed,   0 failed,   0 skipped, org.apache.jmeter.control.TestLoopController
          0.0sec,    6 completed,   0 failed,   0 skipped, org.apache.jmeter.control.TestInterleaveControl
          0.0sec,    1 completed,   0 failed,   0 skipped, org.apache.jmeter.control.TestTransactionController
          0.0sec,    4 completed,   0 failed,   0 skipped, org.apache.jmeter.control.TestOnceOnlyController
          0.0sec,   12 completed,   0 failed,   0 skipped, org.apache.jmeter.control.TestWhileController
          0.0sec,    3 completed,   0 failed,   0 skipped, org.apache.jmeter.control.TestRandomController
          0.0sec,    5 completed,   0 failed,   0 skipped, org.apache.jmeter.reporters.TestResultSaver
          0.1sec,    6 completed,   0 failed,   0 skipped, org.apache.jmeter.config.TestCVSDataSet
          0.4sec,    1 completed,   0 failed,   0 skipped, org.apache.jmeter.config.gui.TestArgumentsPanel
          0.0sec,    3 completed,   0 failed,   0 skipped, org.apache.jmeter.config.TestRandomVariableConfig
          0.6sec,    6 completed,   0 failed,   0 skipped, org.apache.jmeter.assertions.SMIMEAssertionTest
          0.4sec,    7 completed,   0 failed,   0 skipped, org.apache.jmeter.assertions.gui.TestJSONPathAssertionGui
          0.1sec,   14 completed,   0 failed,   0 skipped, org.apache.jmeter.assertions.XPath2AssertionTest
          0.2sec,   29 completed,   0 failed,   0 skipped, org.apache.jmeter.assertions.XPathAssertionTest
          0.0sec,   25 completed,   0 failed,   0 skipped, org.apache.jmeter.assertions.TestJSONPathAssertion
          0.2sec,    9 completed,   0 failed,   0 skipped, org.apache.jmeter.assertions.XMLSchemaAssertionTest
          0.1sec,    7 completed,   0 failed,   0 skipped, org.apache.jmeter.assertions.jmespath.gui.JMESPathAssertionGuiTest
          0.0sec,    4 completed,   0 failed,   0 skipped, org.apache.jmeter.assertions.XmlAssertionTest
          0.0sec,    4 completed,   0 failed,   0 skipped, org.apache.jmeter.assertions.DurationAssertionTest
          0.0sec,    6 completed,   0 failed,   0 skipped, org.apache.jmeter.assertions.SizeAssertionTest
          0.1sec,   10 completed,   0 failed,   0 skipped, org.apache.jmeter.assertions.ResponseAssertionTest
FAILURE   0.0sec, org.apache.jmeter.extractor.json.jmespath.TestJMESPathExtractor$SourceVarOrResponse
> testRandomElementOneMatch[0]
    java.lang.AssertionError: 
    Expected: is "value"
         but: was "NONE"
        at org.hamcrest.MatcherAssert.assertThat(MatcherAssert.java:20)
        at org.hamcrest.MatcherAssert.assertThat(MatcherAssert.java:6)
        at org.apache.jmeter.extractor.json.jmespath.TestJMESPathExtractor$SourceVarOrResponse.testRandomElementOneMatch(TestJMESPathExtractor.java:258)

FAILURE   0.0sec, org.apache.jmeter.extractor.json.jmespath.TestJMESPathExtractor$SourceVarOrResponse
> testRandomElementOneMatch[1]
    java.lang.AssertionError: 
    Expected: is "value"
         but: was "NONE"
        at org.hamcrest.MatcherAssert.assertThat(MatcherAssert.java:20)
        at org.hamcrest.MatcherAssert.assertThat(MatcherAssert.java:6)
        at org.apache.jmeter.extractor.json.jmespath.TestJMESPathExtractor$SourceVarOrResponse.testRandomElementOneMatch(TestJMESPathExtractor.java:258)

FAILURE   0.2sec,   10 completed,   2 failed,   0 skipped, org.apache.jmeter.extractor.json.jmespath.TestJMESPathExtractor$SourceVarOrResponse
          0.0sec,   10 completed,   0 failed,   0 skipped, org.apache.jmeter.extractor.json.jmespath.TestJMESPathExtractor$MatchNumberMoreThanZeroOn1ExtractedValue
          0.0sec,    6 completed,   0 failed,   0 skipped, org.apache.jmeter.extractor.json.jmespath.TestJMESPathExtractor$MultipleMatchesOnAllExtractedValues
FAILURE   0.0sec, org.apache.jmeter.extractor.json.jmespath.TestJMESPathExtractor$OneMatchOnAllExtractedValues
> testFromVars[1]
    java.lang.AssertionError: 
    Expected: is null
         but: was "NONE"
        at org.hamcrest.MatcherAssert.assertThat(MatcherAssert.java:20)
        at org.hamcrest.MatcherAssert.assertThat(MatcherAssert.java:6)
        at org.apache.jmeter.extractor.json.jmespath.TestJMESPathExtractor$OneMatchOnAllExtractedValues.test(TestJMESPathExtractor.java:118)
        at org.apache.jmeter.extractor.json.jmespath.TestJMESPathExtractor$OneMatchOnAllExtractedValues.testFromVars(TestJMESPathExtractor.java:104)

FAILURE   0.0sec, org.apache.jmeter.extractor.json.jmespath.TestJMESPathExtractor$OneMatchOnAllExtractedValues
> testFromSampleResult[1]
    java.lang.AssertionError: 
    Expected: is null
         but: was "NONE"
        at org.hamcrest.MatcherAssert.assertThat(MatcherAssert.java:20)
        at org.hamcrest.MatcherAssert.assertThat(MatcherAssert.java:6)
        at org.apache.jmeter.extractor.json.jmespath.TestJMESPathExtractor$OneMatchOnAllExtractedValues.test(TestJMESPathExtractor.java:118)
        at org.apache.jmeter.extractor.json.jmespath.TestJMESPathExtractor$OneMatchOnAllExtractedValues.testFromSampleResult(TestJMESPathExtractor.java:109)

FAILURE   0.0sec,    6 completed,   2 failed,   0 skipped, org.apache.jmeter.extractor.json.jmespath.TestJMESPathExtractor$OneMatchOnAllExtractedValues
          0.0sec,    1 completed,   0 failed,   0 skipped, org.apache.jmeter.extractor.json.jmespath.TestJMESPathExtractor$NonParemeterizedTests
FAILURE   0.2sec,   33 completed,   4 failed,   0 skipped, org.apache.jmeter.extractor.json.jmespath.TestJMESPathExtractor
          0.0sec,    9 completed,   0 failed,   0 skipped, org.apache.jmeter.visualizers.TestSampleCompareTo
          0.0sec,   27 completed,   0 failed,   0 skipped, org.apache.jmeter.assertions.jmespath.TestJMESPathAssertion$TestAssertion
          0.0sec,   27 completed,   0 failed,   0 skipped, org.apache.jmeter.assertions.jmespath.TestJMESPathAssertion
          0.1sec,    6 completed,   0 failed,   0 skipped, org.apache.jmeter.timers.UniformRandomTimerSpec
          0.3sec,   11 completed,   0 failed,   0 skipped, org.apache.jmeter.extractor.json.render.RenderAsJsonRendererSpec
          0.1sec,   11 completed,   0 failed,   0 skipped, org.apache.jmeter.extractor.json.render.RenderAsJmesPathRendererSpec
          0.2sec,   43 completed,   0 failed,   0 skipped, org.apache.jmeter.extractor.BoundaryExtractorSpec
          0.0sec,    4 completed,   0 failed,   0 skipped, org.apache.jmeter.extractor.JoddExtractorSpec
          0.2sec,    5 completed,   0 failed,   0 skipped, org.apache.jmeter.visualizers.backend.graphite.TextGraphiteMetricsSenderSpec
          0.0sec,    7 completed,   0 failed,   0 skipped, org.apache.jmeter.visualizers.backend.graphite.PickleGraphiteMetricsSenderSpec
          0.2sec,    3 completed,   0 failed,   0 skipped, org.apache.jmeter.visualizers.backend.influxdb.InfluxdbBackendListenerClientSpec
          0.1sec,    6 completed,   0 failed,   0 skipped, org.apache.jmeter.visualizers.backend.influxdb.InfluxDBRawBackendListenerClientSpec
          0.0sec,    8 completed,   0 failed,   0 skipped, org.apache.jmeter.control.ThroughputControllerSpec
WARNING   0.0sec,    5 completed,   0 failed,   1 skipped, org.apache.jmeter.control.RunTimeSpec
          0.0sec,    4 completed,   0 failed,   0 skipped, org.apache.jmeter.control.RandomOrderControllerSpec
          0.2sec,    5 completed,   0 failed,   0 skipped, org.apache.jmeter.assertions.gui.AssertionGuiSpec
          0.1sec,    7 completed,   0 failed,   0 skipped, org.apache.jmeter.assertions.CompareAssertionSpec
          0.0sec,    7 completed,   0 failed,   0 skipped, org.apache.jmeter.assertions.MD5HexAssertionSpec
FAILURE  36.4sec,  510 completed,   4 failed,   2 skipped,
Gradle Test Run :src:components:test

510 tests completed, 4 failed, 2 skipped

> Task :src:components:test FAILED

> Task :src:core:spotbugsMain
37 SpotBugs violations were found. See the report at: file://<https://ci-builds.apache.org/job/JMeter/job/JMeter-trunk/ws/src/core/build/reports/spotbugs/main.xml>

org.gradle.api.GradleException: 37 SpotBugs violations were found. See the report at: file://<https://ci-builds.apache.org/job/JMeter/job/JMeter-trunk/ws/src/core/build/reports/spotbugs/main.xml>
	at com.github.spotbugs.snom.internal.SpotBugsRunnerForWorker$SpotBugsExecutor.execute(SpotBugsRunnerForWorker.java:115)
	at org.gradle.workers.internal.DefaultWorkerServer.execute(DefaultWorkerServer.java:63)
	at org.gradle.workers.internal.AbstractClassLoaderWorker$1.create(AbstractClassLoaderWorker.java:49)
	at org.gradle.workers.internal.AbstractClassLoaderWorker$1.create(AbstractClassLoaderWorker.java:43)
	at org.gradle.internal.classloader.ClassLoaderUtils.executeInClassloader(ClassLoaderUtils.java:97)
	at org.gradle.workers.internal.AbstractClassLoaderWorker.executeInClassLoader(AbstractClassLoaderWorker.java:43)
	at org.gradle.workers.internal.IsolatedClassloaderWorker.run(IsolatedClassloaderWorker.java:49)
	at org.gradle.workers.internal.IsolatedClassloaderWorker.run(IsolatedClassloaderWorker.java:30)
	at org.gradle.workers.internal.WorkerDaemonServer.run(WorkerDaemonServer.java:85)
	at org.gradle.workers.internal.WorkerDaemonServer.run(WorkerDaemonServer.java:55)
	at org.gradle.process.internal.worker.request.WorkerAction$1.call(WorkerAction.java:138)
	at org.gradle.process.internal.worker.child.WorkerLogEventListener.withWorkerLoggingProtocol(WorkerLogEventListener.java:41)
	at org.gradle.process.internal.worker.request.WorkerAction.run(WorkerAction.java:135)
	at sun.reflect.NativeMethodAccessorImpl.invoke0(Native Method)
	at sun.reflect.NativeMethodAccessorImpl.invoke(NativeMethodAccessorImpl.java:62)
	at sun.reflect.DelegatingMethodAccessorImpl.invoke(DelegatingMethodAccessorImpl.java:43)
	at java.lang.reflect.Method.invoke(Method.java:498)
	at org.gradle.internal.dispatch.ReflectionDispatch.dispatch(ReflectionDispatch.java:36)
	at org.gradle.internal.dispatch.ReflectionDispatch.dispatch(ReflectionDispatch.java:24)
	at org.gradle.internal.remote.internal.hub.MessageHubBackedObjectConnection$DispatchWrapper.dispatch(MessageHubBackedObjectConnection.java:182)
	at org.gradle.internal.remote.internal.hub.MessageHubBackedObjectConnection$DispatchWrapper.dispatch(MessageHubBackedObjectConnection.java:164)
	at org.gradle.internal.remote.internal.hub.MessageHub$Handler.run(MessageHub.java:414)
	at org.gradle.internal.concurrent.ExecutorPolicy$CatchAndRecordFailures.onExecute(ExecutorPolicy.java:64)
	at org.gradle.internal.concurrent.ManagedExecutorImpl$1.run(ManagedExecutorImpl.java:48)
	at java.util.concurrent.ThreadPoolExecutor.runWorker(ThreadPoolExecutor.java:1149)
	at java.util.concurrent.ThreadPoolExecutor$Worker.run(ThreadPoolExecutor.java:624)
	at org.gradle.internal.concurrent.ThreadFactoryImpl$ManagedThreadRunnable.run(ThreadFactoryImpl.java:56)
	at java.lang.Thread.run(Thread.java:748)
checksum-dependency elapsed time: 12401ms, configurations processed: 321 (add -PchecksumTimingsPrint
to print detailed timings)

FAILURE: Build failed with an exception.

* What went wrong:
Execution failed for task ':src:components:test'.
> There were failing tests. See the report at: file://<https://ci-builds.apache.org/job/JMeter/job/JMeter-trunk/ws/src/components/build/reports/tests/test/index.html>

* Try:
Run with --stacktrace option to get the stack trace. Run with --info or --debug option to
get more log output. Run with --scan to get full insights.

* Get more help at https://help.gradle.org

Deprecated Gradle features were used in this build, making it incompatible with Gradle 7.0.
Use '--warning-mode all' to show the individual deprecation warnings.
See https://docs.gradle.org/6.8.1/userguide/command_line_interface.html#sec:command_line_warnings

BUILD FAILED in 2m 13s
294 actionable tasks: 143 executed, 151 up-to-date

See the profiling report at: file://<https://ci-builds.apache.org/job/JMeter/job/JMeter-trunk/ws/build/reports/profile/profile-2021-04-24-09-47-30.html>
A fine-grained performance profile is available: use the --scan option.
Build step 'Invoke Gradle script' changed build result to FAILURE
Build step 'Invoke Gradle script' marked build as failure
Xvfb stopping
Archiving artifacts
[Fast Archiver] Compressed 33.62 MB of artifacts by 57.0% relative to #249
Recording test results
[Checks API] No suitable checks publisher found.

Mime
View raw message