jmeter-dev mailing list archives

Site index · List index
Message view « Date » · « Thread »
Top « Date » · « Thread »
From Apache Jenkins Server <jenk...@builds.apache.org>
Subject Build failed in Jenkins: JMeter » JMeter Ubuntu #186
Date Sat, 22 May 2021 13:46:28 GMT
See <https://ci-builds.apache.org/job/JMeter/job/JMeter%20Ubuntu/186/display/redirect?page=changes>

Changes:

[Felix Schumacher] Replace deprecated methods to make code compile with Java 17

[Felix Schumacher] Updated Groovy to 3.0.8 (from 3.0.7)

[Felix Schumacher] Correct sizes for expected JARs (Groovy update)


------------------------------------------
[...truncated 412.33 KB...]
    	at java.util.stream.ForEachOps$ForEachOp.evaluateSequential(ForEachOps.java:151)
    	at java.util.stream.ForEachOps$ForEachOp$OfRef.evaluateSequential(ForEachOps.java:174)
    	at java.util.stream.AbstractPipeline.evaluate(AbstractPipeline.java:234)
    	at java.util.stream.ReferencePipeline.forEach(ReferencePipeline.java:418)
    	at org.junit.vintage.engine.VintageTestEngine.executeAllChildren(VintageTestEngine.java:82)
    	at org.junit.vintage.engine.VintageTestEngine.execute(VintageTestEngine.java:73)
    	at org.junit.platform.launcher.core.EngineExecutionOrchestrator.execute(EngineExecutionOrchestrator.java:108)
    	at org.junit.platform.launcher.core.EngineExecutionOrchestrator.execute(EngineExecutionOrchestrator.java:88)
    	at org.junit.platform.launcher.core.EngineExecutionOrchestrator.lambda$execute$0(EngineExecutionOrchestrator.java:54)
    	at org.junit.platform.launcher.core.EngineExecutionOrchestrator.withInterceptedStreams(EngineExecutionOrchestrator.java:67)
    	at org.junit.platform.launcher.core.EngineExecutionOrchestrator.execute(EngineExecutionOrchestrator.java:52)
    	at org.junit.platform.launcher.core.DefaultLauncher.execute(DefaultLauncher.java:96)
    	at org.junit.platform.launcher.core.DefaultLauncher.execute(DefaultLauncher.java:75)
    	at org.gradle.api.internal.tasks.testing.junitplatform.JUnitPlatformTestClassProcessor$CollectAllTestClassesExecutor.processAllTestClasses(JUnitPlatformTestClassProcessor.java:99)
    	at org.gradle.api.internal.tasks.testing.junitplatform.JUnitPlatformTestClassProcessor$CollectAllTestClassesExecutor.access$000(JUnitPlatformTestClassProcessor.java:79)
    	at org.gradle.api.internal.tasks.testing.junitplatform.JUnitPlatformTestClassProcessor.stop(JUnitPlatformTestClassProcessor.java:75)
    	at org.gradle.api.internal.tasks.testing.SuiteTestClassProcessor.stop(SuiteTestClassProcessor.java:61)
    	at sun.reflect.NativeMethodAccessorImpl.invoke0(Native Method)
    	at sun.reflect.NativeMethodAccessorImpl.invoke(NativeMethodAccessorImpl.java:62)
    	at sun.reflect.DelegatingMethodAccessorImpl.invoke(DelegatingMethodAccessorImpl.java:43)
    	at java.lang.reflect.Method.invoke(Method.java:498)
    	at org.gradle.internal.dispatch.ReflectionDispatch.dispatch(ReflectionDispatch.java:36)
    	at org.gradle.internal.dispatch.ReflectionDispatch.dispatch(ReflectionDispatch.java:24)
    	at org.gradle.internal.dispatch.ContextClassLoaderDispatch.dispatch(ContextClassLoaderDispatch.java:33)
    	at org.gradle.internal.dispatch.ProxyDispatchAdapter$DispatchingInvocationHandler.invoke(ProxyDispatchAdapter.java:94)
    	at com.sun.proxy.$Proxy2.stop(Unknown Source)
    	at org.gradle.api.internal.tasks.testing.worker.TestWorker.stop(TestWorker.java:135)
    	at sun.reflect.NativeMethodAccessorImpl.invoke0(Native Method)
    	at sun.reflect.NativeMethodAccessorImpl.invoke(NativeMethodAccessorImpl.java:62)
    	at sun.reflect.DelegatingMethodAccessorImpl.invoke(DelegatingMethodAccessorImpl.java:43)
    	at java.lang.reflect.Method.invoke(Method.java:498)
    	at org.gradle.internal.dispatch.ReflectionDispatch.dispatch(ReflectionDispatch.java:36)
    	at org.gradle.internal.dispatch.ReflectionDispatch.dispatch(ReflectionDispatch.java:24)
    	at org.gradle.internal.remote.internal.hub.MessageHubBackedObjectConnection$DispatchWrapper.dispatch(MessageHubBackedObjectConnection.java:182)
    	at org.gradle.internal.remote.internal.hub.MessageHubBackedObjectConnection$DispatchWrapper.dispatch(MessageHubBackedObjectConnection.java:164)
    	at org.gradle.internal.remote.internal.hub.MessageHub$Handler.run(MessageHub.java:414)
    	at org.gradle.internal.concurrent.ExecutorPolicy$CatchAndRecordFailures.onExecute(ExecutorPolicy.java:64)
    	at org.gradle.internal.concurrent.ManagedExecutorImpl$1.run(ManagedExecutorImpl.java:48)
    	at java.util.concurrent.ThreadPoolExecutor.runWorker(ThreadPoolExecutor.java:1149)
    	at java.util.concurrent.ThreadPoolExecutor$Worker.run(ThreadPoolExecutor.java:624)
    	at org.gradle.internal.concurrent.ThreadFactoryImpl$ManagedThreadRunnable.run(ThreadFactoryImpl.java:56)
    	at java.lang.Thread.run(Thread.java:748)
    Caused by: java.net.ConnectException: Connection refused (Connection refused)
    	at java.net.PlainSocketImpl.socketConnect(Native Method)
    	at java.net.AbstractPlainSocketImpl.doConnect(AbstractPlainSocketImpl.java:476)
    	at java.net.AbstractPlainSocketImpl.connectToAddress(AbstractPlainSocketImpl.java:218)
    	at java.net.AbstractPlainSocketImpl.connect(AbstractPlainSocketImpl.java:200)
    	at java.net.SocksSocketImpl.connect(SocksSocketImpl.java:394)
    	at java.net.Socket.connect(Socket.java:606)
    	at org.apache.http.conn.socket.PlainConnectionSocketFactory.connectSocket(PlainConnectionSocketFactory.java:75)
    	at org.apache.http.impl.conn.DefaultHttpClientConnectionOperator.connect(DefaultHttpClientConnectionOperator.java:142)
    	... 84 more
    ]
        at junit.framework.Assert.fail(Assert.java:57)
        at junit.framework.TestCase.fail(TestCase.java:223)
        at org.apache.jmeter.protocol.http.sampler.TestHTTPSamplersAgainstHttpMirrorServer.checkGetRequest_Parameters(TestHTTPSamplersAgainstHttpMirrorServer.java:1069)
        at org.apache.jmeter.protocol.http.sampler.TestHTTPSamplersAgainstHttpMirrorServer.testGetRequest_Parameters(TestHTTPSamplersAgainstHttpMirrorServer.java:800)
        at org.apache.jmeter.protocol.http.sampler.TestHTTPSamplersAgainstHttpMirrorServer.itemised_testGetRequest_Parameters3(TestHTTPSamplersAgainstHttpMirrorServer.java:185)


TestHTTPSamplersAgainstHttpMirrorServer > itemised_testPostRequest_UrlEncoded 5 STANDARD_OUT

    >>>>>>>>>>>>>>>>>>>> expected:
    title=%2FwEPDwULLTE2MzM2OTA0NTYPZBYCAgMPZ%2FrA%2B8DZ2dnZ2dnZ2d%2FGNDar6OshPwdJc%3D&description=mydescription5
    ==================== actual:

    <<<<<<<<<<<<<<<<<<<<
    URL=http://localhost:8182/test/somescript.jsp
FAILURE   0.0sec, org.apache.jmeter.protocol.http.sampler.TestHTTPSamplersAgainstHttpMirrorServer
> itemised_testPostRequest_UrlEncoded 5
    junit.framework.AssertionFailedError: arrays have different length, expected is 109, actual
is 0
        at junit.framework.Assert.fail(Assert.java:57)
        at junit.framework.TestCase.fail(TestCase.java:223)
        at org.apache.jmeter.protocol.http.sampler.TestHTTPSamplersAgainstHttpMirrorServer.checkArraysHaveSameContent(TestHTTPSamplersAgainstHttpMirrorServer.java:1301)
        at org.apache.jmeter.protocol.http.sampler.TestHTTPSamplersAgainstHttpMirrorServer.checkPostRequestBody(TestHTTPSamplersAgainstHttpMirrorServer.java:971)
        at org.apache.jmeter.protocol.http.sampler.TestHTTPSamplersAgainstHttpMirrorServer.checkPostRequestUrlEncoded(TestHTTPSamplersAgainstHttpMirrorServer.java:852)
        at org.apache.jmeter.protocol.http.sampler.TestHTTPSamplersAgainstHttpMirrorServer.testPostRequest_UrlEncoded(TestHTTPSamplersAgainstHttpMirrorServer.java:288)
        at org.apache.jmeter.protocol.http.sampler.TestHTTPSamplersAgainstHttpMirrorServer.itemised_testPostRequest_UrlEncoded(TestHTTPSamplersAgainstHttpMirrorServer.java:139)

FAILURE   0.0sec, org.apache.jmeter.protocol.http.sampler.TestHTTPSamplersAgainstHttpMirrorServer
> itemised_testPostRequest_UrlEncoded3 5
    junit.framework.AssertionFailedError: No header and body section found
        at junit.framework.Assert.fail(Assert.java:57)
        at junit.framework.TestCase.fail(TestCase.java:223)
        at org.apache.jmeter.protocol.http.sampler.TestHTTPSamplersAgainstHttpMirrorServer.checkPostRequestBody(TestHTTPSamplersAgainstHttpMirrorServer.java:985)
        at org.apache.jmeter.protocol.http.sampler.TestHTTPSamplersAgainstHttpMirrorServer.checkPostRequestUrlEncoded(TestHTTPSamplersAgainstHttpMirrorServer.java:852)
        at org.apache.jmeter.protocol.http.sampler.TestHTTPSamplersAgainstHttpMirrorServer.testPostRequest_UrlEncoded(TestHTTPSamplersAgainstHttpMirrorServer.java:288)
        at org.apache.jmeter.protocol.http.sampler.TestHTTPSamplersAgainstHttpMirrorServer.itemised_testPostRequest_UrlEncoded3(TestHTTPSamplersAgainstHttpMirrorServer.java:143)


TestHTTPSamplersAgainstHttpMirrorServer > itemised_testPostRequest_UrlEncoded 6 STANDARD_OUT

    >>>>>>>>>>>>>>>>>>>> expected:
    title=%2FwEPDwULLTE2MzM2OTA0NTYPZBYCAgMPZ%2FrA%2B8DZ2dnZ2dnZ2d%2FGNDar6OshPwdJc%3D&description=mydescription6
    ==================== actual:

    <<<<<<<<<<<<<<<<<<<<
    URL=http://localhost:8182/test/somescript.jsp
FAILURE   0.0sec, org.apache.jmeter.protocol.http.sampler.TestHTTPSamplersAgainstHttpMirrorServer
> itemised_testPostRequest_UrlEncoded 6
    junit.framework.AssertionFailedError: arrays have different length, expected is 109, actual
is 0
        at junit.framework.Assert.fail(Assert.java:57)
        at junit.framework.TestCase.fail(TestCase.java:223)
        at org.apache.jmeter.protocol.http.sampler.TestHTTPSamplersAgainstHttpMirrorServer.checkArraysHaveSameContent(TestHTTPSamplersAgainstHttpMirrorServer.java:1301)
        at org.apache.jmeter.protocol.http.sampler.TestHTTPSamplersAgainstHttpMirrorServer.checkPostRequestBody(TestHTTPSamplersAgainstHttpMirrorServer.java:971)
        at org.apache.jmeter.protocol.http.sampler.TestHTTPSamplersAgainstHttpMirrorServer.checkPostRequestUrlEncoded(TestHTTPSamplersAgainstHttpMirrorServer.java:852)
        at org.apache.jmeter.protocol.http.sampler.TestHTTPSamplersAgainstHttpMirrorServer.testPostRequest_UrlEncoded(TestHTTPSamplersAgainstHttpMirrorServer.java:306)
        at org.apache.jmeter.protocol.http.sampler.TestHTTPSamplersAgainstHttpMirrorServer.itemised_testPostRequest_UrlEncoded(TestHTTPSamplersAgainstHttpMirrorServer.java:139)

FAILURE   0.0sec, org.apache.jmeter.protocol.http.sampler.TestHTTPSamplersAgainstHttpMirrorServer
> itemised_testPostRequest_UrlEncoded3 6
    junit.framework.AssertionFailedError: No header and body section found
        at junit.framework.Assert.fail(Assert.java:57)
        at junit.framework.TestCase.fail(TestCase.java:223)
        at org.apache.jmeter.protocol.http.sampler.TestHTTPSamplersAgainstHttpMirrorServer.checkPostRequestBody(TestHTTPSamplersAgainstHttpMirrorServer.java:985)
        at org.apache.jmeter.protocol.http.sampler.TestHTTPSamplersAgainstHttpMirrorServer.checkPostRequestUrlEncoded(TestHTTPSamplersAgainstHttpMirrorServer.java:852)
        at org.apache.jmeter.protocol.http.sampler.TestHTTPSamplersAgainstHttpMirrorServer.testPostRequest_UrlEncoded(TestHTTPSamplersAgainstHttpMirrorServer.java:306)
        at org.apache.jmeter.protocol.http.sampler.TestHTTPSamplersAgainstHttpMirrorServer.itemised_testPostRequest_UrlEncoded3(TestHTTPSamplersAgainstHttpMirrorServer.java:143)


TestHTTPSamplersAgainstHttpMirrorServer > itemised_testPostRequest_UrlEncoded 7 STANDARD_OUT

    >>>>>>>>>>>>>>>>>>>> expected:
    title=a+test%C3%85mytitle7%C5%93%E2%82%A1%C4%95%C3%85&description=mydescription7%C5%93%E2%82%A1%C4%95%C3%85the_end
    ==================== actual:

    <<<<<<<<<<<<<<<<<<<<
    URL=http://localhost:8182/test/somescript.jsp
FAILURE   0.0sec, org.apache.jmeter.protocol.http.sampler.TestHTTPSamplersAgainstHttpMirrorServer
> itemised_testPostRequest_UrlEncoded 7
    junit.framework.AssertionFailedError: arrays have different length, expected is 114, actual
is 0
        at junit.framework.Assert.fail(Assert.java:57)
        at junit.framework.TestCase.fail(TestCase.java:223)
        at org.apache.jmeter.protocol.http.sampler.TestHTTPSamplersAgainstHttpMirrorServer.checkArraysHaveSameContent(TestHTTPSamplersAgainstHttpMirrorServer.java:1301)
        at org.apache.jmeter.protocol.http.sampler.TestHTTPSamplersAgainstHttpMirrorServer.checkPostRequestBody(TestHTTPSamplersAgainstHttpMirrorServer.java:971)
        at org.apache.jmeter.protocol.http.sampler.TestHTTPSamplersAgainstHttpMirrorServer.checkPostRequestUrlEncoded(TestHTTPSamplersAgainstHttpMirrorServer.java:852)
        at org.apache.jmeter.protocol.http.sampler.TestHTTPSamplersAgainstHttpMirrorServer.testPostRequest_UrlEncoded(TestHTTPSamplersAgainstHttpMirrorServer.java:333)
        at org.apache.jmeter.protocol.http.sampler.TestHTTPSamplersAgainstHttpMirrorServer.itemised_testPostRequest_UrlEncoded(TestHTTPSamplersAgainstHttpMirrorServer.java:139)

FAILURE   0.0sec, org.apache.jmeter.protocol.http.sampler.TestHTTPSamplersAgainstHttpMirrorServer
> itemised_testPostRequest_UrlEncoded3 7
    junit.framework.AssertionFailedError: No header and body section found
        at junit.framework.Assert.fail(Assert.java:57)
        at junit.framework.TestCase.fail(TestCase.java:223)
        at org.apache.jmeter.protocol.http.sampler.TestHTTPSamplersAgainstHttpMirrorServer.checkPostRequestBody(TestHTTPSamplersAgainstHttpMirrorServer.java:985)
        at org.apache.jmeter.protocol.http.sampler.TestHTTPSamplersAgainstHttpMirrorServer.checkPostRequestUrlEncoded(TestHTTPSamplersAgainstHttpMirrorServer.java:852)
        at org.apache.jmeter.protocol.http.sampler.TestHTTPSamplersAgainstHttpMirrorServer.testPostRequest_UrlEncoded(TestHTTPSamplersAgainstHttpMirrorServer.java:333)
        at org.apache.jmeter.protocol.http.sampler.TestHTTPSamplersAgainstHttpMirrorServer.itemised_testPostRequest_UrlEncoded3(TestHTTPSamplersAgainstHttpMirrorServer.java:143)

FAILURE   0.6sec,   53 completed,  37 failed,   0 skipped, org.apache.jmeter.protocol.http.sampler.TestHTTPSamplersAgainstHttpMirrorServer
          0.6sec,  103 completed,   0 failed,   0 skipped, org.apache.jmeter.protocol.http.parser.TestHTMLParser
          0.0sec,    1 completed,   0 failed,   0 skipped, [0]
          0.0sec,    1 completed,   0 failed,   0 skipped, [1]
          0.0sec,    1 completed,   0 failed,   0 skipped, [2]
          0.0sec,    1 completed,   0 failed,   0 skipped, [3]
          0.0sec,    1 completed,   0 failed,   0 skipped, [4]
          0.0sec,    1 completed,   0 failed,   0 skipped, [5]
          0.0sec,    1 completed,   0 failed,   0 skipped, [6]
          0.0sec,    1 completed,   0 failed,   0 skipped, [7]
          0.0sec,    1 completed,   0 failed,   0 skipped, [8]
          0.0sec,    1 completed,   0 failed,   0 skipped, [9]
          0.0sec,    1 completed,   0 failed,   0 skipped, [10]
          0.0sec,    1 completed,   0 failed,   0 skipped, [11]
          0.0sec,    1 completed,   0 failed,   0 skipped, [12]
          0.0sec,    1 completed,   0 failed,   0 skipped, [13]
          0.0sec,    1 completed,   0 failed,   0 skipped, [14]
          0.0sec,    1 completed,   0 failed,   0 skipped, [15]
          0.0sec,    1 completed,   0 failed,   0 skipped, [16]
          0.0sec,    1 completed,   0 failed,   0 skipped, [17]
          0.0sec,    1 completed,   0 failed,   0 skipped, [18]
          0.0sec,    1 completed,   0 failed,   0 skipped, [19]
          0.0sec,    1 completed,   0 failed,   0 skipped, [20]
          0.0sec,    1 completed,   0 failed,   0 skipped, [21]
          0.0sec,    1 completed,   0 failed,   0 skipped, [22]
          0.0sec,    1 completed,   0 failed,   0 skipped, [23]
          0.0sec,    1 completed,   0 failed,   0 skipped, [24]
          0.0sec,    1 completed,   0 failed,   0 skipped, [25]
          0.0sec,    1 completed,   0 failed,   0 skipped, [26]
          0.0sec,    1 completed,   0 failed,   0 skipped, [27]
          0.0sec,    1 completed,   0 failed,   0 skipped, [28]
          0.0sec,    1 completed,   0 failed,   0 skipped, [29]
          0.0sec,    1 completed,   0 failed,   0 skipped, [30]
          0.0sec,    1 completed,   0 failed,   0 skipped, [31]
          0.0sec,    1 completed,   0 failed,   0 skipped, [32]
          0.0sec,    1 completed,   0 failed,   0 skipped, [33]
          0.0sec,    1 completed,   0 failed,   0 skipped, [34]
          0.0sec,    1 completed,   0 failed,   0 skipped, [35]
          0.0sec,    1 completed,   0 failed,   0 skipped, [36]
          0.0sec,    1 completed,   0 failed,   0 skipped, [37]
          0.0sec,    1 completed,   0 failed,   0 skipped, [38]
          0.0sec,    1 completed,   0 failed,   0 skipped, [39]
          0.0sec,    1 completed,   0 failed,   0 skipped, [40]
          0.0sec,    1 completed,   0 failed,   0 skipped, [41]
          0.0sec,    1 completed,   0 failed,   0 skipped, [42]
          0.0sec,    1 completed,   0 failed,   0 skipped, [43]
          0.0sec,    1 completed,   0 failed,   0 skipped, [44]
          0.0sec,    1 completed,   0 failed,   0 skipped, [45]
          0.0sec,    1 completed,   0 failed,   0 skipped, [46]
          0.0sec,    1 completed,   0 failed,   0 skipped, [47]
          0.0sec,    1 completed,   0 failed,   0 skipped, [48]
          0.0sec,    1 completed,   0 failed,   0 skipped, [49]
          0.0sec,   50 completed,   0 failed,   0 skipped, org.apache.jmeter.protocol.http.parser.TestBug60842HtmlParser
          0.0sec,    7 completed,   0 failed,   0 skipped, org.apache.jmeter.protocol.http.visualizers.RequestViewHTTPTest
          0.9sec,    9 completed,   0 failed,   0 skipped, org.apache.jmeter.protocol.http.control.TestHTTPMirrorThread
          0.1sec,    8 completed,   0 failed,   0 skipped, getEncoding returns #expectedEncoding
from #contentType
          0.0sec,    7 completed,   0 failed,   0 skipped, makeRelativeURL works with a trailing
file
          0.0sec,    7 completed,   0 failed,   0 skipped, makeRelativeURL works with a trailing
directory
          0.0sec,    4 completed,   0 failed,   0 skipped, makeRelativeURL given invalid path
'#path' returns '#path'
          0.0sec,   17 completed,   0 failed,   0 skipped, removeSlashDotDot given a url or
path #urlOrPath returns #expectedUrl
          0.0sec,   15 completed,   0 failed,   0 skipped, testSanitizeUrl
          0.2sec,   58 completed,   0 failed,   0 skipped, org.apache.jmeter.protocol.http.util.HTTPUtilsSpec
          0.3sec,   12 completed,   0 failed,   0 skipped, org.apache.jmeter.protocol.http.control.DNSCacheManagerSpec
FAILURE  18.9sec,  670 completed,  37 failed,   3 skipped,
Gradle Test Run :src:protocol:http:test

670 tests completed, 37 failed, 3 skipped

> Task :src:protocol:http:test FAILED

> Task :src:dist-check:batchHttp4ImplPreemptiveBasicAuth
Creating summariser <summary>
Created the tree successfully using <https://ci-builds.apache.org/job/JMeter/job/JMeter%20Ubuntu/ws/bin/testfiles/Http4ImplPreemptiveBasicAuth.jmx>
Starting standalone test @ Sat May 22 13:46:16 UTC 2021 (1621691176819)
Waiting for possible Shutdown/StopTestNow/HeapDump/ThreadDump message on port 4445
summary =     12 in 00:00:07 =    1.8/s Avg:   227 Min:    67 Max:   859 Err:     0 (0.00%)
Tidying up ...    @ Sat May 22 13:46:24 UTC 2021 (1621691184119)
... end of run
No errors present in the logfile <https://ci-builds.apache.org/job/JMeter/job/JMeter%20Ubuntu/ws/bin/Http4ImplPreemptiveBasicAuth.log>
(the file is empty)
checksum-dependency elapsed time: 72875ms, configurations processed: 278
    SHA-512 computation time: 2734ms (goes in parallel, it might exceed wall-clock time),
files processed: 27, processed: 10MiB, skipped: 3232MiB
    PGP signature resolution time: 8442ms (wall-clock), resolution requests: 166, signatures
resolved: 256
    PGP key resolution time: 45930ms (wall-clock), resolution requests: 166, download time:
4012ms (goes in parallel, it might exceed wall-clock time), keys downloaded: 1
        PGP signature verification time: 88251ms (goes in parallel, it might exceed wall-clock
time), files processed: 533, processed: 581MiB, skipped: 2617MiB

FAILURE: Build failed with an exception.

* What went wrong:
Execution failed for task ':src:protocol:http:test'.
> There were failing tests. See the report at: file:///home/jenkins/workspace/JMeter/JMeter%20Ubuntu/src/protocol/http/build/reports/tests/test/index.html

* Try:
Run with --stacktrace option to get the stack trace. Run with --info or --debug option to
get more log output. Run with --scan to get full insights.

* Get more help at https://help.gradle.org

Deprecated Gradle features were used in this build, making it incompatible with Gradle 8.0.
Use '--warning-mode all' to show the individual deprecation warnings.
See https://docs.gradle.org/7.0.2/userguide/command_line_interface.html#sec:command_line_warnings

Execution optimizations have been disabled for 3 invalid unit(s) of work during this build
to ensure correctness.
Please consult deprecation warnings for more details.

BUILD FAILED in 1m 56s
246 actionable tasks: 125 executed, 121 up-to-date
Build step 'Invoke Gradle script' changed build result to FAILURE
Build step 'Invoke Gradle script' marked build as failure

Mime
View raw message