jmeter-dev mailing list archives

Site index · List index
Message view « Date » · « Thread »
Top « Date » · « Thread »
From Apache Jenkins Server <jenk...@builds.apache.org>
Subject Build failed in Jenkins: JMeter » JMeter-trunk #263
Date Sat, 22 May 2021 11:46:07 GMT
See <https://ci-builds.apache.org/job/JMeter/job/JMeter-trunk/263/display/redirect?page=changes>

Changes:

[Felix Schumacher] Replace deprecated methods to make code compile with Java 17

[Felix Schumacher] Updated Groovy to 3.0.8 (from 3.0.7)


------------------------------------------
[...truncated 374.22 KB...]
          0.0sec,    4 completed,   0 failed,   0 skipped, testInvalidGraphQLContentType(String)
          0.0sec,    2 completed,   0 failed,   0 skipped, testInvalidJsonData(String)
          0.1sec,   20 completed,   0 failed,   0 skipped, org.apache.jmeter.protocol.http.util.TestGraphQLRequestParamUtils
          0.0sec,    3 completed,   0 failed,   0 skipped, org.apache.jmeter.protocol.http.util.TestHTTPArgument
          0.0sec,    3 completed,   0 failed,   0 skipped, org.apache.jmeter.protocol.http.util.TestHTTPFileArg
          0.1sec,    1 completed,   0 failed,   0 skipped, org.apache.jmeter.resources.ResourceKeyUsageTestHttp
          0.0sec,    2 completed,   0 failed,   0 skipped, org.apache.jmeter.testelement.TestHeaderManager
          0.1sec,   66 completed,   0 failed,   0 skipped, org.apache.jmeter.curl.BasicCurlParserTest
          0.0sec,    7 completed,   0 failed,   0 skipped, org.apache.jmeter.protocol.http.visualizers.RequestViewHTTPTest
          0.3sec,   53 completed,   0 failed,   0 skipped, org.apache.jmeter.protocol.http.sampler.TestHTTPSamplersAgainstHttpMirrorServer
WARNING   0.0sec,    1 completed,   0 failed,   1 skipped, [Run
0: implementation:HttpClient4]
WARNING   0.0sec,    1 completed,   0 failed,   1 skipped, [Run
1: implementation:Java]
WARNING   0.0sec,    2 completed,   0 failed,   2 skipped, org.apache.jmeter.protocol.http.sampler.SamplingNamingTest
          0.9sec,    9 completed,   0 failed,   0 skipped, org.apache.jmeter.protocol.http.control.TestHTTPMirrorThread
          0.4sec,  103 completed,   0 failed,   0 skipped, org.apache.jmeter.protocol.http.parser.TestHTMLParser
          0.0sec,    1 completed,   0 failed,   0 skipped, [0]
          0.0sec,    1 completed,   0 failed,   0 skipped, [1]
          0.0sec,    1 completed,   0 failed,   0 skipped, [2]
          0.0sec,    1 completed,   0 failed,   0 skipped, [3]
          0.0sec,    1 completed,   0 failed,   0 skipped, [4]
          0.0sec,    1 completed,   0 failed,   0 skipped, [5]
          0.0sec,    1 completed,   0 failed,   0 skipped, [6]
          0.0sec,    1 completed,   0 failed,   0 skipped, [7]
          0.0sec,    1 completed,   0 failed,   0 skipped, [8]
          0.0sec,    1 completed,   0 failed,   0 skipped, [9]
          0.0sec,    1 completed,   0 failed,   0 skipped, [10]
          0.0sec,    1 completed,   0 failed,   0 skipped, [11]
          0.0sec,    1 completed,   0 failed,   0 skipped, [12]
          0.0sec,    1 completed,   0 failed,   0 skipped, [13]
          0.0sec,    1 completed,   0 failed,   0 skipped, [14]
          0.0sec,    1 completed,   0 failed,   0 skipped, [15]
          0.0sec,    1 completed,   0 failed,   0 skipped, [16]
          0.0sec,    1 completed,   0 failed,   0 skipped, [17]
          0.0sec,    1 completed,   0 failed,   0 skipped, [18]
          0.0sec,    1 completed,   0 failed,   0 skipped, [19]
          0.0sec,    1 completed,   0 failed,   0 skipped, [20]
          0.0sec,    1 completed,   0 failed,   0 skipped, [21]
          0.0sec,    1 completed,   0 failed,   0 skipped, [22]
          0.0sec,    1 completed,   0 failed,   0 skipped, [23]
          0.0sec,    1 completed,   0 failed,   0 skipped, [24]
          0.0sec,    1 completed,   0 failed,   0 skipped, [25]
          0.0sec,    1 completed,   0 failed,   0 skipped, [26]
          0.0sec,    1 completed,   0 failed,   0 skipped, [27]
          0.0sec,    1 completed,   0 failed,   0 skipped, [28]
          0.0sec,    1 completed,   0 failed,   0 skipped, [29]
          0.0sec,    1 completed,   0 failed,   0 skipped, [30]
          0.0sec,    1 completed,   0 failed,   0 skipped, [31]
          0.0sec,    1 completed,   0 failed,   0 skipped, [32]
          0.0sec,    1 completed,   0 failed,   0 skipped, [33]
          0.0sec,    1 completed,   0 failed,   0 skipped, [34]
          0.0sec,    1 completed,   0 failed,   0 skipped, [35]
          0.0sec,    1 completed,   0 failed,   0 skipped, [36]
          0.0sec,    1 completed,   0 failed,   0 skipped, [37]
          0.0sec,    1 completed,   0 failed,   0 skipped, [38]
          0.0sec,    1 completed,   0 failed,   0 skipped, [39]
          0.0sec,    1 completed,   0 failed,   0 skipped, [40]
          0.0sec,    1 completed,   0 failed,   0 skipped, [41]
          0.0sec,    1 completed,   0 failed,   0 skipped, [42]
          0.0sec,    1 completed,   0 failed,   0 skipped, [43]
          0.0sec,    1 completed,   0 failed,   0 skipped, [44]
          0.0sec,    1 completed,   0 failed,   0 skipped, [45]
          0.0sec,    1 completed,   0 failed,   0 skipped, [46]
          0.0sec,    1 completed,   0 failed,   0 skipped, [47]
          0.0sec,    1 completed,   0 failed,   0 skipped, [48]
          0.0sec,    1 completed,   0 failed,   0 skipped, [49]
          0.0sec,   50 completed,   0 failed,   0 skipped, org.apache.jmeter.protocol.http.parser.TestBug60842HtmlParser
          0.3sec,   12 completed,   0 failed,   0 skipped, org.apache.jmeter.protocol.http.control.DNSCacheManagerSpec
          0.1sec,    8 completed,   0 failed,   0 skipped, getEncoding returns #expectedEncoding
from #contentType
          0.0sec,    7 completed,   0 failed,   0 skipped, makeRelativeURL works with a trailing
file
          0.0sec,    7 completed,   0 failed,   0 skipped, makeRelativeURL works with a trailing
directory
          0.0sec,    4 completed,   0 failed,   0 skipped, makeRelativeURL given invalid path
'#path' returns '#path'
          0.0sec,   17 completed,   0 failed,   0 skipped, removeSlashDotDot given a url or
path #urlOrPath returns #expectedUrl
          0.0sec,   15 completed,   0 failed,   0 skipped, testSanitizeUrl
          0.2sec,   58 completed,   0 failed,   0 skipped, org.apache.jmeter.protocol.http.util.HTTPUtilsSpec
WARNING  28.9sec,  670 completed,   0 failed,   3 skipped, Gradle
Test Run :src:protocol:http:test

> Task :src:protocol:http:check
> Task :src:protocol:http:assemble

> Task :src:dist:javadocAggregate
9 warnings

> Task :src:dist:test NO-SOURCE
> Task :src:dist:verifyReleaseDependencies FAILED
checksum-dependency elapsed time: 100842ms, configurations processed: 387
    SHA-512 computation time: 2509ms (goes in parallel, it might exceed wall-clock time),
files processed: 36, processed: 12MiB, skipped: 3557MiB
    PGP signature resolution time: 4618ms (wall-clock), resolution requests: 231, signatures
resolved: 273
    PGP key resolution time: 67482ms (wall-clock), resolution requests: 231, download time:
1896ms (goes in parallel, it might exceed wall-clock time), keys downloaded: 2
        PGP signature verification time: 138907ms (goes in parallel, it might exceed wall-clock
time), files processed: 732, processed: 807MiB, skipped: 2717MiB

Build jmeter FAILURE reason:                                
    Execution failed for task ':src:dist:verifyReleaseDependencies':
        External dependencies differ (you could update src/dist/src/dist/expected_release_jars.csv
if you add -PupdateExpectedJars):
          55946439 => 55985122 bytes (+38683 bytes)
        
        - 7949743 groovy-3.0.7.jar
        + 7987432 groovy-3.0.8.jar
        -   19457 groovy-datetime-3.0.7.jar
        +   19458 groovy-datetime-3.0.8.jar
        -   11684 groovy-dateutil-3.0.7.jar
        +   11685 groovy-dateutil-3.0.8.jar
        -  137461 groovy-jmx-3.0.7.jar
        +  137554 groovy-jmx-3.0.8.jar
        -  133034 groovy-json-3.0.7.jar
        +  133033 groovy-json-3.0.8.jar
        -   21294 groovy-jsr223-3.0.7.jar
        +   21295 groovy-jsr223-3.0.8.jar
        -   82930 groovy-sql-3.0.7.jar
        +   82931 groovy-sql-3.0.8.jar
        -   97065 groovy-templates-3.0.7.jar
        +   97098 groovy-templates-3.0.8.jar
        -  292540 groovy-xml-3.0.7.jar
        +  293405 groovy-xml-3.0.8.jar
            at Build_gradle$verifyReleaseDependencies$2$1.execute(build.gradle.kts:228)
            at Build_gradle$verifyReleaseDependencies$2$1.execute(build.gradle.kts:24)
            at org.gradle.api.internal.AbstractTask$TaskActionWrapper.execute(AbstractTask.java:749)
            at org.gradle.api.internal.AbstractTask$TaskActionWrapper.execute(AbstractTask.java:722)
            at org.gradle.api.internal.tasks.execution.ExecuteActionsTaskExecuter$2.run(ExecuteActionsTaskExecuter.java:498)
            at org.gradle.internal.operations.DefaultBuildOperationRunner$1.execute(DefaultBuildOperationRunner.java:29)
            at org.gradle.internal.operations.DefaultBuildOperationRunner$1.execute(DefaultBuildOperationRunner.java:26)
            at org.gradle.internal.operations.DefaultBuildOperationRunner$3.execute(DefaultBuildOperationRunner.java:75)
            at org.gradle.internal.operations.DefaultBuildOperationRunner$3.execute(DefaultBuildOperationRunner.java:68)
            at org.gradle.internal.operations.DefaultBuildOperationRunner.execute(DefaultBuildOperationRunner.java:153)
            at org.gradle.internal.operations.DefaultBuildOperationRunner.execute(DefaultBuildOperationRunner.java:68)
            at org.gradle.internal.operations.DefaultBuildOperationRunner.run(DefaultBuildOperationRunner.java:56)
            at org.gradle.internal.operations.DefaultBuildOperationExecutor.lambda$run$1(DefaultBuildOperationExecutor.java:71)
            at org.gradle.internal.operations.UnmanagedBuildOperationWrapper.runWithUnmanagedSupport(UnmanagedBuildOperationWrapper.java:45)
            at org.gradle.internal.operations.DefaultBuildOperationExecutor.run(DefaultBuildOperationExecutor.java:71)
            at org.gradle.api.internal.tasks.execution.ExecuteActionsTaskExecuter.executeAction(ExecuteActionsTaskExecuter.java:483)
            at org.gradle.api.internal.tasks.execution.ExecuteActionsTaskExecuter.executeActions(ExecuteActionsTaskExecuter.java:466)
            at org.gradle.api.internal.tasks.execution.ExecuteActionsTaskExecuter.access$300(ExecuteActionsTaskExecuter.java:105)
            at org.gradle.api.internal.tasks.execution.ExecuteActionsTaskExecuter$TaskExecution.executeWithPreviousOutputFiles(ExecuteActionsTaskExecuter.java:270)
            at org.gradle.api.internal.tasks.execution.ExecuteActionsTaskExecuter$TaskExecution.execute(ExecuteActionsTaskExecuter.java:248)
            at org.gradle.internal.execution.steps.ExecuteStep.executeInternal(ExecuteStep.java:83)
            at org.gradle.internal.execution.steps.ExecuteStep.access$000(ExecuteStep.java:37)
            at org.gradle.internal.execution.steps.ExecuteStep$1.call(ExecuteStep.java:50)
            at org.gradle.internal.execution.steps.ExecuteStep$1.call(ExecuteStep.java:47)
            at org.gradle.internal.operations.DefaultBuildOperationRunner$CallableBuildOperationWorker.execute(DefaultBuildOperationRunner.java:200)
            at org.gradle.internal.operations.DefaultBuildOperationRunner$CallableBuildOperationWorker.execute(DefaultBuildOperationRunner.java:195)
            at org.gradle.internal.operations.DefaultBuildOperationRunner$3.execute(DefaultBuildOperationRunner.java:75)
            at org.gradle.internal.operations.DefaultBuildOperationRunner$3.execute(DefaultBuildOperationRunner.java:68)
            at org.gradle.internal.operations.DefaultBuildOperationRunner.execute(DefaultBuildOperationRunner.java:153)
            at org.gradle.internal.operations.DefaultBuildOperationRunner.execute(DefaultBuildOperationRunner.java:68)
            at org.gradle.internal.operations.DefaultBuildOperationRunner.call(DefaultBuildOperationRunner.java:62)
            at org.gradle.internal.operations.DefaultBuildOperationExecutor.lambda$call$2(DefaultBuildOperationExecutor.java:76)
            at org.gradle.internal.operations.UnmanagedBuildOperationWrapper.callWithUnmanagedSupport(UnmanagedBuildOperationWrapper.java:54)
            at org.gradle.internal.operations.DefaultBuildOperationExecutor.call(DefaultBuildOperationExecutor.java:76)
            at org.gradle.internal.execution.steps.ExecuteStep.execute(ExecuteStep.java:47)
            at org.gradle.internal.execution.steps.ExecuteStep.execute(ExecuteStep.java:37)
            at org.gradle.internal.execution.steps.RemovePreviousOutputsStep.execute(RemovePreviousOutputsStep.java:68)
            at org.gradle.internal.execution.steps.RemovePreviousOutputsStep.execute(RemovePreviousOutputsStep.java:38)
            at org.gradle.internal.execution.steps.ResolveInputChangesStep.execute(ResolveInputChangesStep.java:50)
            at org.gradle.internal.execution.steps.ResolveInputChangesStep.execute(ResolveInputChangesStep.java:36)
            at org.gradle.internal.execution.steps.CancelExecutionStep.execute(CancelExecutionStep.java:41)
            at org.gradle.internal.execution.steps.TimeoutStep.executeWithoutTimeout(TimeoutStep.java:74)
            at org.gradle.internal.execution.steps.TimeoutStep.execute(TimeoutStep.java:55)
            at org.gradle.internal.execution.steps.CreateOutputsStep.execute(CreateOutputsStep.java:51)
            at org.gradle.internal.execution.steps.CreateOutputsStep.execute(CreateOutputsStep.java:29)
            at org.gradle.internal.execution.steps.CaptureStateAfterExecutionStep.execute(CaptureStateAfterExecutionStep.java:54)
            at org.gradle.internal.execution.steps.CaptureStateAfterExecutionStep.execute(CaptureStateAfterExecutionStep.java:35)
            at org.gradle.internal.execution.steps.BroadcastChangingOutputsStep.execute(BroadcastChangingOutputsStep.java:60)
            at org.gradle.internal.execution.steps.BroadcastChangingOutputsStep.execute(BroadcastChangingOutputsStep.java:27)
            at org.gradle.internal.execution.steps.BuildCacheStep.executeWithoutCache(BuildCacheStep.java:174)
            at org.gradle.internal.execution.steps.BuildCacheStep.execute(BuildCacheStep.java:74)
            at org.gradle.internal.execution.steps.BuildCacheStep.execute(BuildCacheStep.java:45)
            at org.gradle.internal.execution.steps.StoreExecutionStateStep.execute(StoreExecutionStateStep.java:40)
            at org.gradle.internal.execution.steps.StoreExecutionStateStep.execute(StoreExecutionStateStep.java:29)
            at org.gradle.internal.execution.steps.RecordOutputsStep.execute(RecordOutputsStep.java:36)
            at org.gradle.internal.execution.steps.RecordOutputsStep.execute(RecordOutputsStep.java:22)
            at org.gradle.internal.execution.steps.SkipUpToDateStep.executeBecause(SkipUpToDateStep.java:99)
            at org.gradle.internal.execution.steps.SkipUpToDateStep.lambda$execute$0(SkipUpToDateStep.java:92)
            at org.gradle.internal.execution.steps.SkipUpToDateStep.execute(SkipUpToDateStep.java:52)
            at org.gradle.internal.execution.steps.SkipUpToDateStep.execute(SkipUpToDateStep.java:36)
            at org.gradle.internal.execution.steps.ResolveChangesStep.execute(ResolveChangesStep.java:84)
            at org.gradle.internal.execution.steps.ResolveChangesStep.execute(ResolveChangesStep.java:41)
            at org.gradle.internal.execution.steps.legacy.MarkSnapshottingInputsFinishedStep.execute(MarkSnapshottingInputsFinishedStep.java:37)
            at org.gradle.internal.execution.steps.legacy.MarkSnapshottingInputsFinishedStep.execute(MarkSnapshottingInputsFinishedStep.java:27)
            at org.gradle.internal.execution.steps.ResolveCachingStateStep.execute(ResolveCachingStateStep.java:91)
            at org.gradle.internal.execution.steps.ResolveCachingStateStep.execute(ResolveCachingStateStep.java:49)
            at org.gradle.internal.execution.steps.CaptureStateBeforeExecutionStep.execute(CaptureStateBeforeExecutionStep.java:78)
            at org.gradle.internal.execution.steps.CaptureStateBeforeExecutionStep.execute(CaptureStateBeforeExecutionStep.java:49)
            at org.gradle.internal.execution.steps.ValidateStep.execute(ValidateStep.java:105)
            at org.gradle.internal.execution.steps.ValidateStep.execute(ValidateStep.java:50)
            at org.gradle.internal.execution.steps.SkipEmptyWorkStep.lambda$execute$2(SkipEmptyWorkStep.java:86)
            at org.gradle.internal.execution.steps.SkipEmptyWorkStep.execute(SkipEmptyWorkStep.java:86)
            at org.gradle.internal.execution.steps.SkipEmptyWorkStep.execute(SkipEmptyWorkStep.java:32)
            at org.gradle.internal.execution.steps.legacy.MarkSnapshottingInputsStartedStep.execute(MarkSnapshottingInputsStartedStep.java:38)
            at org.gradle.internal.execution.steps.LoadExecutionStateStep.execute(LoadExecutionStateStep.java:43)
            at org.gradle.internal.execution.steps.LoadExecutionStateStep.execute(LoadExecutionStateStep.java:31)
            at org.gradle.internal.execution.steps.AssignWorkspaceStep.lambda$execute$0(AssignWorkspaceStep.java:40)
            at org.gradle.api.internal.tasks.execution.ExecuteActionsTaskExecuter$TaskExecution$2.withWorkspace(ExecuteActionsTaskExecuter.java:283)
            at org.gradle.internal.execution.steps.AssignWorkspaceStep.execute(AssignWorkspaceStep.java:40)
            at org.gradle.internal.execution.steps.AssignWorkspaceStep.execute(AssignWorkspaceStep.java:30)
            at org.gradle.internal.execution.steps.IdentityCacheStep.execute(IdentityCacheStep.java:37)
            at org.gradle.internal.execution.steps.IdentityCacheStep.execute(IdentityCacheStep.java:27)
            at org.gradle.internal.execution.steps.IdentifyStep.execute(IdentifyStep.java:49)
            at org.gradle.internal.execution.steps.IdentifyStep.execute(IdentifyStep.java:35)


FAILURE: Build failed with an exception.

* What went wrong:
Execution failed for task ':src:dist:verifyReleaseDependencies'.
> External dependencies differ (you could update src/dist/src/dist/expected_release_jars.csv
if you add -PupdateExpectedJars):
    55946439 => 55985122 bytes (+38683 bytes)
  
  - 7949743 groovy-3.0.7.jar
  + 7987432 groovy-3.0.8.jar
  -   19457 groovy-datetime-3.0.7.jar
  +   19458 groovy-datetime-3.0.8.jar
  -   11684 groovy-dateutil-3.0.7.jar
  +   11685 groovy-dateutil-3.0.8.jar
  -  137461 groovy-jmx-3.0.7.jar
  +  137554 groovy-jmx-3.0.8.jar
  -  133034 groovy-json-3.0.7.jar
  +  133033 groovy-json-3.0.8.jar
  -   21294 groovy-jsr223-3.0.7.jar
  +   21295 groovy-jsr223-3.0.8.jar
  -   82930 groovy-sql-3.0.7.jar
  +   82931 groovy-sql-3.0.8.jar
  -   97065 groovy-templates-3.0.7.jar
  +   97098 groovy-templates-3.0.8.jar
  -  292540 groovy-xml-3.0.7.jar
  +  293405 groovy-xml-3.0.8.jar

* Try:
Run with --stacktrace option to get the stack trace. Run with --info or --debug option to
get more log output. Run with --scan to get full insights.

* Get more help at https://help.gradle.org

Deprecated Gradle features were used in this build, making it incompatible with Gradle 8.0.
Use '--warning-mode all' to show the individual deprecation warnings.
See https://docs.gradle.org/7.0.2/userguide/command_line_interface.html#sec:command_line_warnings

Execution optimizations have been disabled for 4 invalid unit(s) of work during this build
to ensure correctness.
Please consult deprecation warnings for more details.

BUILD FAILED in 6m 11s
323 actionable tasks: 310 executed, 13 up-to-date

See the profiling report at: file://<https://ci-builds.apache.org/job/JMeter/job/JMeter-trunk/ws/build/reports/profile/profile-2021-05-22-11-39-53.html>
A fine-grained performance profile is available: use the --scan option.
Build step 'Invoke Gradle script' changed build result to FAILURE
Build step 'Invoke Gradle script' marked build as failure
Xvfb stopping
Archiving artifacts
[Fast Archiver] Compressed 33.62 MB of artifacts by 51.5% relative to #262
Recording test results
[Checks API] No suitable checks publisher found.

Mime
View raw message