jmeter-dev mailing list archives

Site index · List index
Message view « Date » · « Thread »
Top « Date » · « Thread »
From Apache Jenkins Server <jenk...@builds.apache.org>
Subject Build failed in Jenkins: JMeter » JMeter-trunk #269
Date Thu, 03 Jun 2021 16:10:07 GMT
See <https://ci-builds.apache.org/job/JMeter/job/JMeter-trunk/269/display/redirect?page=changes>

Changes:

[Felix Schumacher] Warning logged when Boundary Extractor doesn't find any match


------------------------------------------
[...truncated 326.07 KB...]
	at org.gradle.workers.internal.AbstractClassLoaderWorker$1.create(AbstractClassLoaderWorker.java:43)
	at org.gradle.internal.classloader.ClassLoaderUtils.executeInClassloader(ClassLoaderUtils.java:97)
	at org.gradle.workers.internal.AbstractClassLoaderWorker.executeInClassLoader(AbstractClassLoaderWorker.java:43)
	at org.gradle.workers.internal.IsolatedClassloaderWorker.run(IsolatedClassloaderWorker.java:49)
	at org.gradle.workers.internal.IsolatedClassloaderWorker.run(IsolatedClassloaderWorker.java:30)
	at org.gradle.workers.internal.WorkerDaemonServer.run(WorkerDaemonServer.java:85)
	at org.gradle.workers.internal.WorkerDaemonServer.run(WorkerDaemonServer.java:55)
	at org.gradle.process.internal.worker.request.WorkerAction$1.call(WorkerAction.java:138)
	at org.gradle.process.internal.worker.child.WorkerLogEventListener.withWorkerLoggingProtocol(WorkerLogEventListener.java:41)
	at org.gradle.process.internal.worker.request.WorkerAction.run(WorkerAction.java:135)
	at sun.reflect.NativeMethodAccessorImpl.invoke0(Native Method)
	at sun.reflect.NativeMethodAccessorImpl.invoke(NativeMethodAccessorImpl.java:62)
	at sun.reflect.DelegatingMethodAccessorImpl.invoke(DelegatingMethodAccessorImpl.java:43)
	at java.lang.reflect.Method.invoke(Method.java:498)
	at org.gradle.internal.dispatch.ReflectionDispatch.dispatch(ReflectionDispatch.java:36)
	at org.gradle.internal.dispatch.ReflectionDispatch.dispatch(ReflectionDispatch.java:24)
	at org.gradle.internal.remote.internal.hub.MessageHubBackedObjectConnection$DispatchWrapper.dispatch(MessageHubBackedObjectConnection.java:182)
	at org.gradle.internal.remote.internal.hub.MessageHubBackedObjectConnection$DispatchWrapper.dispatch(MessageHubBackedObjectConnection.java:164)
	at org.gradle.internal.remote.internal.hub.MessageHub$Handler.run(MessageHub.java:414)
	at org.gradle.internal.concurrent.ExecutorPolicy$CatchAndRecordFailures.onExecute(ExecutorPolicy.java:64)
	at org.gradle.internal.concurrent.ManagedExecutorImpl$1.run(ManagedExecutorImpl.java:48)
	at java.util.concurrent.ThreadPoolExecutor.runWorker(ThreadPoolExecutor.java:1149)
	at java.util.concurrent.ThreadPoolExecutor$Worker.run(ThreadPoolExecutor.java:624)
	at org.gradle.internal.concurrent.ThreadFactoryImpl$ManagedThreadRunnable.run(ThreadFactoryImpl.java:56)
	at java.lang.Thread.run(Thread.java:748)

> Task :src:components:test
          0.9sec,    7 completed,   0 failed,   0 skipped, org.apache.jmeter.assertions.gui.TestJSONPathAssertionGui
          0.2sec,   14 completed,   0 failed,   0 skipped, org.apache.jmeter.assertions.XPath2AssertionTest
          0.2sec,   29 completed,   0 failed,   0 skipped, org.apache.jmeter.assertions.XPathAssertionTest
          0.0sec,   25 completed,   0 failed,   0 skipped, org.apache.jmeter.assertions.TestJSONPathAssertion
          0.3sec,    9 completed,   0 failed,   0 skipped, org.apache.jmeter.assertions.XMLSchemaAssertionTest
          0.1sec,    7 completed,   0 failed,   0 skipped, org.apache.jmeter.assertions.jmespath.gui.JMESPathAssertionGuiTest
          0.0sec,    4 completed,   0 failed,   0 skipped, org.apache.jmeter.assertions.XmlAssertionTest
          0.0sec,    4 completed,   0 failed,   0 skipped, org.apache.jmeter.assertions.DurationAssertionTest
          0.0sec,    6 completed,   0 failed,   0 skipped, org.apache.jmeter.assertions.SizeAssertionTest
          0.2sec,   10 completed,   0 failed,   0 skipped, org.apache.jmeter.assertions.ResponseAssertionTest
          0.2sec,    5 completed,   0 failed,   0 skipped, [0]
          0.0sec,    5 completed,   0 failed,   0 skipped, [1]
          0.2sec,   10 completed,   0 failed,   0 skipped, org.apache.jmeter.extractor.json.jmespath.TestJMESPathExtractor$SourceVarOrResponse
          0.0sec,    1 completed,   0 failed,   0 skipped, [0: Mode: ALL Path: a MatchNr:
1 Result: 23 Count: 2]
          0.0sec,    1 completed,   0 failed,   0 skipped, [1: Mode: ALL Path: a MatchNr:
2 Result: 42 Count: 2]
          0.0sec,    1 completed,   0 failed,   0 skipped, [2: Mode: ALL Path: b MatchNr:
0 Result: parent_only Count: 1]
          0.0sec,    1 completed,   0 failed,   0 skipped, [3: Mode: ALL Path: c MatchNr:
0 Result: child_only Count: 1]
          0.0sec,    1 completed,   0 failed,   0 skipped, [4: Mode: PARENT Path: a MatchNr:
1 Result: 23 Count: 1]
          0.0sec,    1 completed,   0 failed,   0 skipped, [5: Mode: PARENT Path: b MatchNr:
0 Result: parent_only Count: 1]
          0.0sec,    1 completed,   0 failed,   0 skipped, [6: Mode: PARENT Path: c MatchNr:
0 Result: NONE Count: 0]
          0.0sec,    1 completed,   0 failed,   0 skipped, [7: Mode: CHILDREN Path: a MatchNr:
1 Result: 42 Count: 1]
          0.0sec,    1 completed,   0 failed,   0 skipped, [8: Mode: CHILDREN Path: b MatchNr:
0 Result: NONE Count: 0]
          0.0sec,    1 completed,   0 failed,   0 skipped, [9: Mode: CHILDREN Path: c MatchNr:
0 Result: child_only Count: 1]
          0.0sec,   10 completed,   0 failed,   0 skipped, org.apache.jmeter.extractor.json.jmespath.TestJMESPathExtractor$ScopedSamples
          0.0sec,    2 completed,   0 failed,   0 skipped, [0]
          0.0sec,    2 completed,   0 failed,   0 skipped, [1]
          0.0sec,    2 completed,   0 failed,   0 skipped, [2]
          0.0sec,    2 completed,   0 failed,   0 skipped, [3]
          0.0sec,    2 completed,   0 failed,   0 skipped, [4]
          0.0sec,   10 completed,   0 failed,   0 skipped, org.apache.jmeter.extractor.json.jmespath.TestJMESPathExtractor$MatchNumberMoreThanZeroOn1ExtractedValue
          0.0sec,    2 completed,   0 failed,   0 skipped, [0]
          0.0sec,    2 completed,   0 failed,   0 skipped, [1]
          0.0sec,    2 completed,   0 failed,   0 skipped, [2]
          0.0sec,    6 completed,   0 failed,   0 skipped, org.apache.jmeter.extractor.json.jmespath.TestJMESPathExtractor$MultipleMatchesOnAllExtractedValues
          0.0sec,    2 completed,   0 failed,   0 skipped, [Extract from ["one"] with path
[*] should result in one for match 1]
          0.0sec,    2 completed,   0 failed,   0 skipped, [Extract from {"a": {"b": {"c":
{"d": "value"}}}} with path a.b.c.d should result in value for match 1]
          0.0sec,    2 completed,   0 failed,   0 skipped, [Extract from {
  "people": [
    {"first": "James", "last": "d"},
    {"first": "Jacob", "last": "e"},
    {"first": "Jayden", "last": "f"},
    {"missing": "different"}
  ],
  "foo": {"bar": "baz"}
} with path people[2] should result in {"first":"Jayden","last":"f"} for match 1]
          0.0sec,    6 completed,   0 failed,   0 skipped, org.apache.jmeter.extractor.json.jmespath.TestJMESPathExtractor$OneMatchOnAllExtractedValues
          0.0sec,    1 completed,   0 failed,   0 skipped, org.apache.jmeter.extractor.json.jmespath.TestJMESPathExtractor$NonParemeterizedTests
          0.3sec,   43 completed,   0 failed,   0 skipped, org.apache.jmeter.extractor.json.jmespath.TestJMESPathExtractor
          0.0sec,    1 completed,   0 failed,   0 skipped, [0]
          0.0sec,    1 completed,   0 failed,   0 skipped, [1]
          0.0sec,    1 completed,   0 failed,   0 skipped, [2]
          0.0sec,    1 completed,   0 failed,   0 skipped, [3]
          0.0sec,    1 completed,   0 failed,   0 skipped, [4]
          0.0sec,    1 completed,   0 failed,   0 skipped, [5]
          0.0sec,    1 completed,   0 failed,   0 skipped, [6]
          0.0sec,    1 completed,   0 failed,   0 skipped, [7]
          0.0sec,    1 completed,   0 failed,   0 skipped, [8]
          0.0sec,    9 completed,   0 failed,   0 skipped, org.apache.jmeter.visualizers.TestSampleCompareTo
          0.0sec,    1 completed,   0 failed,   0 skipped, [index:0 => data([0, 1, 2, 3,
4, 5, 6, 7, 8, 9], jmespath=[6:6], invert=USE_INVERT, validation:USE_VALIDATION, regex:USE_NO_REXEG,
nullability:EXPECT_NOT_NULL, expected value:[], expected result type:FAILURE, expected failure
message:Value expected not to be equal to [])]
          0.0sec,    1 completed,   0 failed,   0 skipped, [index:1 => data([0, 1, 2, 3,
4, 5, 6, 7, 8, 9], jmespath=[6:6], invert=USE_NO_INVERT, validation:USE_VALIDATION, regex:USE_NO_REXEG,
nullability:EXPECT_NOT_NULL, expected value:[], expected result type:SUCCESS, expected failure
message:)]
          0.0sec,    1 completed,   0 failed,   0 skipped, [index:2 => data([0, 1, 2, 3,
4, 5, 6, 7, 8, 9], jmespath=[6:6], invert=USE_NO_INVERT, validation:USE_VALIDATION, regex:USE_NO_REXEG,
nullability:EXPECT_NOT_NULL, expected value:[1], expected result type:FAILURE, expected failure
message:Value expected to be equal to [1])]
          0.0sec,    1 completed,   0 failed,   0 skipped, [index:3 => data({"one": "1","two":
"2"}, jmespath=[one,two], invert=USE_NO_INVERT, validation:USE_VALIDATION, regex:USE_NO_REXEG,
nullability:EXPECT_NOT_NULL, expected value:["1","2"], expected result type:SUCCESS, expected
failure message:)]
          0.0sec,    1 completed,   0 failed,   0 skipped, [index:4 => data({"a": "foo",
"b": "bar", "c": "baz"}, jmespath=a, invert=USE_NO_INVERT, validation:USE_VALIDATION, regex:USE_NO_REXEG,
nullability:EXPECT_NOT_NULL, expected value:foo, expected result type:SUCCESS, expected failure
message:)]
          0.0sec,    1 completed,   0 failed,   0 skipped, [index:5 => data({"a": "123"},
jmespath=a, invert=USE_NO_INVERT, validation:USE_VALIDATION, regex:USE_REGEX, nullability:EXPECT_NOT_NULL,
expected value:123|456, expected result type:SUCCESS, expected failure message:)]
          0.0sec,    1 completed,   0 failed,   0 skipped, [index:6 => data({"a": "123"},
jmespath=a, invert=USE_NO_INVERT, validation:USE_VALIDATION, regex:USE_REGEX, nullability:EXPECT_NOT_NULL,
expected value:789|012, expected result type:FAILURE, expected failure message:Value expected
to match 789|012)]
          0.0sec,    1 completed,   0 failed,   0 skipped, [index:7 => data({"a": "123"},
jmespath=a, invert=USE_INVERT, validation:USE_VALIDATION, regex:USE_REGEX, nullability:EXPECT_NOT_NULL,
expected value:123|012, expected result type:FAILURE, expected failure message:Value expected
not to match 123|012)]
          0.0sec,    1 completed,   0 failed,   0 skipped, [index:8 => data({"people":
[ {"name": "b", "age": 30}, {"name": "a", "age": 50}, {"name": "c", "age": 40}  ]}, jmespath=max_by(people,
&age).name, invert=USE_NO_INVERT, validation:USE_VALIDATION, regex:USE_NO_REXEG, nullability:EXPECT_NOT_NULL,
expected value:a, expected result type:SUCCESS, expected failure message:)]
          0.0sec,    1 completed,   0 failed,   0 skipped, [index:9 => data({"one": ""},
jmespath=two, invert=USE_NO_INVERT, validation:USE_VALIDATION, regex:USE_NO_REXEG, nullability:EXPECT_NULL,
expected value:null, expected result type:SUCCESS, expected failure message:)]
          0.0sec,    1 completed,   0 failed,   0 skipped, [index:10 => data({"one": ""},
jmespath=one, invert=USE_NO_INVERT, validation:USE_VALIDATION, regex:USE_NO_REXEG, nullability:EXPECT_NOT_NULL,
expected value:, expected result type:SUCCESS, expected failure message:)]
          0.0sec,    1 completed,   0 failed,   0 skipped, [index:11 => data({"one": ""},
jmespath=one, invert=USE_NO_INVERT, validation:USE_VALIDATION, regex:USE_NO_REXEG, nullability:EXPECT_NULL,
expected value:1, expected result type:FAILURE, expected failure message:Value expected to
be null)]
          0.0sec,    1 completed,   0 failed,   0 skipped, [index:12 => data({"one": "1"},
jmespath=one, invert=USE_INVERT, validation:USE_VALIDATION, regex:USE_NO_REXEG, nullability:EXPECT_NOT_NULL,
expected value:2, expected result type:SUCCESS, expected failure message:)]
          0.0sec,    1 completed,   0 failed,   0 skipped, [index:13 => data({"one": ""},
jmespath=one, invert=USE_INVERT, validation:USE_VALIDATION, regex:USE_NO_REXEG, nullability:EXPECT_NULL,
expected value:, expected result type:SUCCESS, expected failure message:)]
          0.0sec,    1 completed,   0 failed,   0 skipped, [index:14 => data({"one": ""},
jmespath=two, invert=USE_INVERT, validation:USE_VALIDATION, regex:USE_NO_REXEG, nullability:EXPECT_NULL,
expected value:, expected result type:FAILURE, expected failure message:Value expected not
to be null)]
          0.0sec,    1 completed,   0 failed,   0 skipped, [index:15 => data({"one": "1"},
jmespath=one, invert=USE_NO_INVERT, validation:USE_VALIDATION, regex:USE_NO_REXEG, nullability:EXPECT_NOT_NULL,
expected value:2, expected result type:FAILURE, expected failure message:Value expected to
be equal to 2)]
          0.0sec,    1 completed,   0 failed,   0 skipped, [index:16 => data({"one": "1"},
jmespath=one, invert=USE_INVERT, validation:USE_VALIDATION, regex:USE_NO_REXEG, nullability:EXPECT_NOT_NULL,
expected value:1, expected result type:FAILURE, expected failure message:Value expected not
to be equal to 1)]
          0.0sec,    1 completed,   0 failed,   0 skipped, [index:17 => data({'one': '1'},
jmespath=one, invert=USE_INVERT, validation:USE_VALIDATION, regex:USE_NO_REXEG, nullability:EXPECT_NOT_NULL,
expected value:2, expected result type:SUCCESS, expected failure message:)]
          0.0sec,    1 completed,   0 failed,   0 skipped, [index:18 => data({'one': '1'},
jmespath=one, invert=USE_NO_INVERT, validation:USE_VALIDATION, regex:USE_NO_REXEG, nullability:EXPECT_NOT_NULL,
expected value:2, expected result type:ERROR, expected failure message:Unexpected character
(''' (code 39)): was expecting double-quote to start field name
 at [Source: (String)"{'one': '1'}"; line: 1, column: 3])]
          0.0sec,    1 completed,   0 failed,   0 skipped, [index:19 => data({"one": ""},
jmespath=one, invert=USE_NO_INVERT, validation:USE_VALIDATION, regex:USE_NO_REXEG, nullability:EXPECT_NOT_NULL,
expected value:1, expected result type:FAILURE, expected failure message:Value expected to
be equal to 1)]
          0.0sec,    1 completed,   0 failed,   0 skipped, [index:20 => data({"":""}, jmespath=foo,
invert=USE_NO_INVERT, validation:USE_VALIDATION, regex:USE_NO_REXEG, nullability:EXPECT_NULL,
expected value:null, expected result type:SUCCESS, expected failure message:)]
          0.0sec,    1 completed,   0 failed,   0 skipped, [index:21 => data({"one": ""},
jmespath=one, invert=USE_NO_INVERT, validation:USE_NO_VALIDATION, regex:USE_NO_REXEG, nullability:EXPECT_NOT_NULL,
expected value:, expected result type:SUCCESS, expected failure message:)]
          0.0sec,    1 completed,   0 failed,   0 skipped, [index:22 => data({"one": ""},
jmespath=two, invert=USE_NO_INVERT, validation:USE_NO_VALIDATION, regex:USE_NO_REXEG, nullability:EXPECT_NOT_NULL,
expected value:, expected result type:FAILURE, expected failure message:JMESPATH two expected
to exist)]
          0.0sec,    1 completed,   0 failed,   0 skipped, [index:23 => data({"one": ""},
jmespath=one, invert=USE_INVERT, validation:USE_NO_VALIDATION, regex:USE_NO_REXEG, nullability:EXPECT_NOT_NULL,
expected value:, expected result type:FAILURE, expected failure message:JMESPATH one expected
not to exist)]
          0.0sec,    1 completed,   0 failed,   0 skipped, [index:24 => data({"one": ""},
jmespath=two, invert=USE_INVERT, validation:USE_NO_VALIDATION, regex:USE_NO_REXEG, nullability:EXPECT_NOT_NULL,
expected value:, expected result type:SUCCESS, expected failure message:)]
          0.0sec,    1 completed,   0 failed,   0 skipped, [index:25 => data(, jmespath=two,
invert=USE_NO_INVERT, validation:USE_NO_VALIDATION, regex:USE_NO_REXEG, nullability:EXPECT_NOT_NULL,
expected value:, expected result type:FAILURE, expected failure message:Response was null)]
          0.0sec,    1 completed,   0 failed,   0 skipped, [index:26 => data({
  "reservations": [
    {
      "instances": [
        {"state": "running"},
        {"state": "stopped"}
      ]
    },
    {
      "instances": [
        {"state": "terminated"},
        {"state": "running"}
      ]
    }
  ]
}, jmespath=reservations[*].instances[*].state, invert=USE_NO_INVERT, validation:USE_VALIDATION,
regex:USE_NO_REXEG, nullability:EXPECT_NOT_NULL, expected value:[["running","stopped"],["terminated","running"]],
expected result type:SUCCESS, expected failure message:)]
          0.0sec,   27 completed,   0 failed,   0 skipped, org.apache.jmeter.assertions.jmespath.TestJMESPathAssertion$TestAssertion
          0.0sec,   27 completed,   0 failed,   0 skipped, org.apache.jmeter.assertions.jmespath.TestJMESPathAssertion
          0.0sec,    3 completed,   0 failed,   0 skipped, #delay <= computedDelay <=
trunc(#delay + abs(#range))
          0.1sec,    6 completed,   0 failed,   0 skipped, org.apache.jmeter.timers.UniformRandomTimerSpec
          0.0sec,    2 completed,   0 failed,   0 skipped, render '#input' as JSON Response
to '#output'
          0.1sec,    3 completed,   0 failed,   0 skipped, execute '#expression' on '#input'
results into '#output'
          0.4sec,   11 completed,   0 failed,   0 skipped, org.apache.jmeter.extractor.json.render.RenderAsJsonRendererSpec
          0.0sec,    2 completed,   0 failed,   0 skipped, render '#input' as JSON Response
to '#output'
          0.0sec,    3 completed,   0 failed,   0 skipped, execute '#expression' on '#input'
results into '#output'
          0.1sec,   11 completed,   0 failed,   0 skipped, org.apache.jmeter.extractor.json.render.RenderAsJmesPathRendererSpec
          0.1sec,    8 completed,   0 failed,   0 skipped, Extract, where pattern exists,
with matchNumber=#matchNumber from #occurences returns #expected
          0.0sec,    5 completed,   0 failed,   0 skipped, Extract, where pattern does not
exist, with matchNumber=#matchNumber returns an empty list
          0.0sec,    9 completed,   0 failed,   0 skipped, Extract, where pattern exists in
the stream, with matchNumber=#matchNumber from #occurances returns #expected
          0.0sec,    5 completed,   0 failed,   0 skipped, Extract, where pattern does not
exist in the stream, with matchNumber=#matchNumber returns an empty list
          0.0sec,    1 completed,   0 failed,   0 skipped, IllegalArgumentException when name
(#name) is null

> Task :src:core:test
          0.1sec,    2 completed,   0 failed,   0 skipped, org.apache.jmeter.report.processor.graph.impl.ResponseTimePercentilesOverTimeGraphConsumerSpec
          0.0sec,    4 completed,   0 failed,   0 skipped, setting base to #file gives getBaseDirRelative
== #expectedBaseDirRelative
          0.1sec,   23 completed,   0 failed,   0 skipped, org.apache.jmeter.services.FileServerSpec
          0.0sec,    3 completed,   0 failed,   0 skipped, IllegalArgumentException expected
when (#startIndex, #endIndex) startIndex < 0, endIndex < -1, or endIndex < startIndex
          0.0sec,    3 completed,   0 failed,   0 skipped, org.apache.jmeter.util.keystore.JmeterKeyStoreSpec
         42.4sec,  286 completed,   0 failed,   0 skipped, Gradle Test Run :src:core:test

> Task :src:core:assemble

> Task :src:components:test FAILED
FAILURE   0.1sec, org.apache.jmeter.extractor.BoundaryExtractorSpec
> extract all from an empty variable returns no results
    Condition not satisfied:
    
    vars.get("${VAR_NAME}_matchNr") == "0"
    |    |      |                   |
    |    null   varName             false
    <org.apache.jmeter.threads.JMeterVariables@64426be2 variables=[varName:defaultVal,
contentvar:] iteration=0>
    
        at org.apache.jmeter.extractor.BoundaryExtractorSpec.extract all from an empty
variable returns no results(BoundaryExtractorSpec.groovy:334)

FAILURE   0.3sec,   43 completed,   1 failed,   0 skipped, org.apache.jmeter.extractor.BoundaryExtractorSpec
          0.0sec,    4 completed,   0 failed,   0 skipped, extract #expression and #attribute
          0.0sec,    4 completed,   0 failed,   0 skipped, org.apache.jmeter.extractor.JoddExtractorSpec
          0.3sec,    5 completed,   0 failed,   0 skipped, org.apache.jmeter.visualizers.backend.graphite.TextGraphiteMetricsSenderSpec
          0.0sec,    7 completed,   0 failed,   0 skipped, org.apache.jmeter.visualizers.backend.graphite.PickleGraphiteMetricsSenderSpec
          0.2sec,    3 completed,   0 failed,   0 skipped, org.apache.jmeter.visualizers.backend.influxdb.InfluxdbBackendListenerClientSpec
          0.0sec,    6 completed,   0 failed,   0 skipped, org.apache.jmeter.visualizers.backend.influxdb.InfluxDBRawBackendListenerClientSpec
          0.0sec,    8 completed,   0 failed,   0 skipped, org.apache.jmeter.control.ThroughputControllerSpec
WARNING   0.0sec,    5 completed,   0 failed,   1 skipped, org.apache.jmeter.control.RunTimeSpec
          0.0sec,    4 completed,   0 failed,   0 skipped, org.apache.jmeter.control.RandomOrderControllerSpec
          0.2sec,    5 completed,   0 failed,   0 skipped, org.apache.jmeter.assertions.gui.AssertionGuiSpec
          0.1sec,    6 completed,   0 failed,   0 skipped, content '#content' with compareContent==#compareContent,
skip=#skip, elapsed=#elapsed and compareTime==#compareTime
          0.1sec,    7 completed,   0 failed,   0 skipped, org.apache.jmeter.assertions.CompareAssertionSpec
          0.0sec,    3 completed,   0 failed,   0 skipped, incorrect hash #allowedHex causes
result failure
          0.0sec,    2 completed,   0 failed,   0 skipped, example MD5s - '#sampleData' ==
'#hash'
          0.0sec,    7 completed,   0 failed,   0 skipped, org.apache.jmeter.assertions.MD5HexAssertionSpec
FAILURE  47.1sec,  530 completed,   1 failed,   2 skipped,
Gradle Test Run :src:components:test

530 tests completed, 1 failed, 2 skipped

> Task :src:core:spotbugsMain
37 SpotBugs violations were found. See the report at: file://<https://ci-builds.apache.org/job/JMeter/job/JMeter-trunk/ws/src/core/build/reports/spotbugs/main.xml>

org.gradle.api.GradleException: 37 SpotBugs violations were found. See the report at: file://<https://ci-builds.apache.org/job/JMeter/job/JMeter-trunk/ws/src/core/build/reports/spotbugs/main.xml>
	at com.github.spotbugs.snom.internal.SpotBugsRunnerForWorker$SpotBugsExecutor.execute(SpotBugsRunnerForWorker.java:115)
	at org.gradle.workers.internal.DefaultWorkerServer.execute(DefaultWorkerServer.java:63)
	at org.gradle.workers.internal.AbstractClassLoaderWorker$1.create(AbstractClassLoaderWorker.java:49)
	at org.gradle.workers.internal.AbstractClassLoaderWorker$1.create(AbstractClassLoaderWorker.java:43)
	at org.gradle.internal.classloader.ClassLoaderUtils.executeInClassloader(ClassLoaderUtils.java:97)
	at org.gradle.workers.internal.AbstractClassLoaderWorker.executeInClassLoader(AbstractClassLoaderWorker.java:43)
	at org.gradle.workers.internal.IsolatedClassloaderWorker.run(IsolatedClassloaderWorker.java:49)
	at org.gradle.workers.internal.IsolatedClassloaderWorker.run(IsolatedClassloaderWorker.java:30)
	at org.gradle.workers.internal.WorkerDaemonServer.run(WorkerDaemonServer.java:85)
	at org.gradle.workers.internal.WorkerDaemonServer.run(WorkerDaemonServer.java:55)
	at org.gradle.process.internal.worker.request.WorkerAction$1.call(WorkerAction.java:138)
	at org.gradle.process.internal.worker.child.WorkerLogEventListener.withWorkerLoggingProtocol(WorkerLogEventListener.java:41)
	at org.gradle.process.internal.worker.request.WorkerAction.run(WorkerAction.java:135)
	at sun.reflect.NativeMethodAccessorImpl.invoke0(Native Method)
	at sun.reflect.NativeMethodAccessorImpl.invoke(NativeMethodAccessorImpl.java:62)
	at sun.reflect.DelegatingMethodAccessorImpl.invoke(DelegatingMethodAccessorImpl.java:43)
	at java.lang.reflect.Method.invoke(Method.java:498)
	at org.gradle.internal.dispatch.ReflectionDispatch.dispatch(ReflectionDispatch.java:36)
	at org.gradle.internal.dispatch.ReflectionDispatch.dispatch(ReflectionDispatch.java:24)
	at org.gradle.internal.remote.internal.hub.MessageHubBackedObjectConnection$DispatchWrapper.dispatch(MessageHubBackedObjectConnection.java:182)
	at org.gradle.internal.remote.internal.hub.MessageHubBackedObjectConnection$DispatchWrapper.dispatch(MessageHubBackedObjectConnection.java:164)
	at org.gradle.internal.remote.internal.hub.MessageHub$Handler.run(MessageHub.java:414)
	at org.gradle.internal.concurrent.ExecutorPolicy$CatchAndRecordFailures.onExecute(ExecutorPolicy.java:64)
	at org.gradle.internal.concurrent.ManagedExecutorImpl$1.run(ManagedExecutorImpl.java:48)
	at java.util.concurrent.ThreadPoolExecutor.runWorker(ThreadPoolExecutor.java:1149)
	at java.util.concurrent.ThreadPoolExecutor$Worker.run(ThreadPoolExecutor.java:624)
	at org.gradle.internal.concurrent.ThreadFactoryImpl$ManagedThreadRunnable.run(ThreadFactoryImpl.java:56)
	at java.lang.Thread.run(Thread.java:748)
checksum-dependency elapsed time: 12773ms, configurations processed: 321 (add -PchecksumTimingsPrint
to print detailed timings)

FAILURE: Build failed with an exception.

* What went wrong:
Execution failed for task ':src:components:test'.
> There were failing tests. See the report at: file://<https://ci-builds.apache.org/job/JMeter/job/JMeter-trunk/ws/src/components/build/reports/tests/test/index.html>

* Try:
Run with --stacktrace option to get the stack trace. Run with --info or --debug option to
get more log output. Run with --scan to get full insights.

* Get more help at https://help.gradle.org

Deprecated Gradle features were used in this build, making it incompatible with Gradle 8.0.
Use '--warning-mode all' to show the individual deprecation warnings.
See https://docs.gradle.org/7.0.2/userguide/command_line_interface.html#sec:command_line_warnings

Execution optimizations have been disabled for 4 invalid unit(s) of work during this build
to ensure correctness.
Please consult deprecation warnings for more details.

BUILD FAILED in 2m 14s
294 actionable tasks: 144 executed, 150 up-to-date

See the profiling report at: file://<https://ci-builds.apache.org/job/JMeter/job/JMeter-trunk/ws/build/reports/profile/profile-2021-06-03-16-07-45.html>
A fine-grained performance profile is available: use the --scan option.
Build step 'Invoke Gradle script' changed build result to FAILURE
Build step 'Invoke Gradle script' marked build as failure
Xvfb stopping
Archiving artifacts
[Fast Archiver] Compressed 33.63 MB of artifacts by 56.9% relative to #268
Recording test results
[Checks API] No suitable checks publisher found.

Mime
View raw message