jmeter-dev mailing list archives

Site index · List index
Message view « Date » · « Thread »
Top « Date » · « Thread »
From Apache Jenkins Server <jenk...@builds.apache.org>
Subject Build failed in Jenkins: JMeter » JMeter Ubuntu #212
Date Sun, 29 Aug 2021 09:28:56 GMT
See <https://ci-builds.apache.org/job/JMeter/job/JMeter%20Ubuntu/212/display/redirect?page=changes>

Changes:

[Felix Schumacher] JSONPathAssertion attributes are out of order

[Felix Schumacher] Add debug statement for IfController to show result of expression


------------------------------------------
[...truncated 310.77 KB...]
Gradle Test Executor 18 STANDARD_OUT
    Setting JMeterHome: <https://ci-builds.apache.org/job/JMeter/job/JMeter%20Ubuntu/ws/src/protocol/http/../../../.>
    Initializing Properties: ../../.././bin/jmeter.properties
    JMeterVersion=5.5-SNAPSHOT 6ecce5d
    java.version=1.8.0_291
    java.vm.name=Java HotSpot(TM) 64-Bit Server VM
    java.vendor=Oracle Corporation
    java.home=/usr/local/asfpackages/java/oraclejdk-1.8.0-291/jre
    file.encoding=ISO-8859-1
    default encoding=ISO-8859-1
    user.home=/home/jenkins
    user.dir=<https://ci-builds.apache.org/job/JMeter/job/JMeter%20Ubuntu/ws/src/protocol/http>
    user.language=en
    user.region=null
    user.country=US
    user.variant=
    Locale=en_US
    java.class.version=52.0
    java.awt.headless=true
    os.name=Linux
    os.version=4.15.0-122-generic
    os.arch=amd64
          2.1sec,   66 completed,   0 failed,   0 skipped, org.apache.jmeter.curl.BasicCurlParserTest
          0.0sec,    2 completed,   0 failed,   0 skipped, org.apache.jmeter.testelement.TestHeaderManager
          0.7sec,    7 completed,   0 failed,   0 skipped, org.apache.jmeter.protocol.http.proxy.TestProxyControl

> Task :src:dist-check:batchBug62239
Creating summariser <summary>
Created the tree successfully using <https://ci-builds.apache.org/job/JMeter/job/JMeter%20Ubuntu/ws/bin/testfiles/Bug62239.jmx>
Starting standalone test @ Sun Aug 29 09:28:35 UTC 2021 (1630229315104)
Waiting for possible Shutdown/StopTestNow/HeapDump/ThreadDump message on port 4445
summary +      1 in 00:00:00 =    2.3/s Avg:     4 Min:     4 Max:     4 Err:     0 (0.00%)
Active: 1 Started: 1 Finished: 0
summary +    107 in 00:00:01 =  207.4/s Avg:     0 Min:     0 Max:     5 Err:     0 (0.00%)
Active: 0 Started: 6 Finished: 6
summary =    108 in 00:00:01 =  114.0/s Avg:     0 Min:     0 Max:     5 Err:     0 (0.00%)
Tidying up ...    @ Sun Aug 29 09:28:36 UTC 2021 (1630229316358)
... end of run
No errors present in the logfile <https://ci-builds.apache.org/job/JMeter/job/JMeter%20Ubuntu/ws/bin/Bug62239.log>
(the file is empty)

> Task :src:protocol:http:test
          0.2sec,    3 completed,   0 failed,   0 skipped, testInvalidGraphQueryParam(String)
          2.8sec, org.apache.jmeter.protocol.http.control.TestCacheManagerHC4
> testCacheControl()
          2.2sec, org.apache.jmeter.protocol.http.control.TestCacheManagerUrlConnection
> testExpiresBug59962()
          2.9sec, org.apache.jmeter.protocol.http.control.TestCacheManagerHC4
> testExpiresBug59962()
          2.2sec, org.apache.jmeter.protocol.http.control.TestCacheManagerHC4
> testPrivateCache()
          2.9sec, org.apache.jmeter.protocol.http.control.TestCacheManagerUrlConnection
> testPrivateCache()
          2.2sec, org.apache.jmeter.protocol.http.control.TestCacheManagerUrlConnection
> testExpires()
          2.9sec, org.apache.jmeter.protocol.http.control.TestCacheManagerUrlConnection
> testCacheHttpClientBug51932()
          2.9sec, org.apache.jmeter.protocol.http.control.TestCacheManagerHC4
> testExpires()
          2.9sec, org.apache.jmeter.protocol.http.control.TestCacheManagerHC4
> testPrivateCacheExpireNoMaxAge()
          2.9sec, org.apache.jmeter.protocol.http.control.TestCacheManagerHC4
> testCacheHttpClientBug51932()
          2.9sec, org.apache.jmeter.protocol.http.sampler.TestHTTPHC4Impl
> testNotifyFirstSampleAfterLoopRestartWhenThreadIterationIsANewUser()
          2.9sec, org.apache.jmeter.protocol.http.sampler.TestHTTPHC4Impl
> testNotifyFirstSampleAfterLoopRestartWhenThreadIterationIsSameUser()
          0.0sec,    3 completed,   0 failed,   0 skipped, testIsGraphQLContentType(String)
          3.0sec, org.apache.jmeter.protocol.http.sampler.TestHTTPHC4Impl
> testParameterWithMimeTypeWithCharset()
          0.1sec,    4 completed,   0 failed,   0 skipped, testInvalidGraphQLContentType(String)
          0.0sec,    2 completed,   0 failed,   0 skipped, testInvalidJsonData(String)
          0.6sec,   20 completed,   0 failed,   0 skipped, org.apache.jmeter.protocol.http.util.TestGraphQLRequestParamUtils
          2.7sec, org.apache.jmeter.protocol.http.proxy.TestHttpRequestHdr
> testPostRequestEncodings()
          3.0sec, org.apache.jmeter.protocol.http.proxy.TestHttpRequestHdr
> testEncodedArgumentsIPv6()
          2.8sec, org.apache.jmeter.protocol.http.proxy.TestHttpRequestHdr
> testEncodedArguments()
          3.5sec, org.apache.jmeter.protocol.http.proxy.TestHttpRequestHdr
> testPostMultipartFormData()
          3.6sec, org.apache.jmeter.protocol.http.proxy.TestHttpRequestHdr
> testRepeatedArguments()
          3.3sec, org.apache.jmeter.protocol.http.proxy.TestHttpRequestHdr
> testPostMultipartFileUpload()
          4.2sec,   10 completed,   0 failed,   0 skipped, org.apache.jmeter.protocol.http.proxy.TestHttpRequestHdr
          3.9sec, org.apache.jmeter.protocol.http.sampler.TestHTTPHC4Impl
> testFileargWithMimeTypeWithCharset()
          3.9sec, org.apache.jmeter.protocol.http.sampler.TestHTTPHC4Impl
> testParameterWithMultipartAndExplicitHeader()
          4.2sec,    5 completed,   0 failed,   0 skipped, org.apache.jmeter.protocol.http.sampler.TestHTTPHC4Impl
          0.8sec,    5 completed,   0 failed,   0 skipped, org.apache.jmeter.protocol.http.util.TestHTTPFileArgs
          0.0sec,    3 completed,   0 failed,   0 skipped, org.apache.jmeter.protocol.http.util.TestHTTPArgument
          0.1sec,    3 completed,   0 failed,   0 skipped, org.apache.jmeter.protocol.http.util.accesslog.TestSessionFilter
          0.0sec,    4 completed,   0 failed,   0 skipped, org.apache.jmeter.protocol.http.util.accesslog.TestTCLogParser
          0.0sec,    6 completed,   0 failed,   0 skipped, org.apache.jmeter.protocol.http.util.accesslog.TestLogFilter
          0.0sec,    3 completed,   0 failed,   0 skipped, org.apache.jmeter.protocol.http.util.TestHTTPFileArg
          4.8sec, org.apache.jmeter.protocol.http.control.TestCacheManagerHC4
> testNoCacheControlNoMaxAgeNoExpire()
          3.0sec, org.apache.jmeter.protocol.http.control.TestCacheManagerUrlConnection
> testPrivateCacheExpireNoMaxAge()
          3.0sec, org.apache.jmeter.protocol.http.control.TestCacheManagerUrlConnection
> testCacheControl()
          2.0sec, org.apache.jmeter.protocol.http.sampler.TestDecompression
> mockServer(String, ClientGzip, ServerGzip)[1], [1] HttpClient4, REQUESTED,
SUPPORTED
          2.3sec,    8 completed,   0 failed,   0 skipped, mockServer(String, ClientGzip,
ServerGzip)
          2.3sec,    8 completed,   0 failed,   0 skipped, org.apache.jmeter.protocol.http.sampler.TestDecompression
          0.0sec,    2 completed,   0 failed,   0 skipped, org.apache.jmeter.protocol.http.sampler.TestHttpWebdav
          0.0sec,    2 completed,   0 failed,   0 skipped, org.apache.jmeter.protocol.http.sampler.PutWriterTest
          0.1sec,    8 completed,   0 failed,   0 skipped, org.apache.jmeter.protocol.http.sampler.PostWriterTest
          0.1sec,    1 completed,   0 failed,   0 skipped, org.apache.jmeter.protocol.http.sampler.PackageTest
          0.8sec,    1 completed,   0 failed,   0 skipped, org.apache.jmeter.protocol.http.sampler.TestSerializedHTTPSampler
          5.0sec, org.apache.jmeter.protocol.http.control.TestCacheManagerUrlConnection
> testPrivateCacheNoMaxAgeNoExpire()
          5.0sec, org.apache.jmeter.protocol.http.control.TestCacheManagerHC4
> testPrivateCacheNoMaxAgeNoExpire()
          5.0sec, org.apache.jmeter.protocol.http.control.TestCacheManagerUrlConnection
> testNoCacheControlNoMaxAgeNoExpire()
          8.2sec,   26 completed,   0 failed,   0 skipped, org.apache.jmeter.protocol.http.control.TestCacheManagerHC4
          8.2sec,   25 completed,   0 failed,   0 skipped, org.apache.jmeter.protocol.http.control.TestCacheManagerUrlConnection
          2.2sec,   90 completed,   0 failed,   0 skipped, testRedirect(String, int, boolean,
String)
          2.2sec,   90 completed,   0 failed,   0 skipped, org.apache.jmeter.protocol.http.sampler.TestRedirects
          0.0sec,   18 completed,   0 failed,   0 skipped, org.apache.jmeter.protocol.http.sampler.TestHTTPSamplers
          0.3sec,   16 completed,   0 failed,   0 skipped, test(String, String, InetAddress,
WireMockServer, JMeterVariables, TestInfo)
          0.3sec,   16 completed,   0 failed,   0 skipped, org.apache.jmeter.protocol.http.sampler.ParallelResourcesAndIpSource
          0.0sec,   17 completed,   0 failed,   0 skipped, org.apache.jmeter.protocol.http.modifier.TestURLRewritingModifier

> Task :src:dist-check:batchFTP_TESTS
Creating summariser <summary>
Created the tree successfully using <https://ci-builds.apache.org/job/JMeter/job/JMeter%20Ubuntu/ws/bin/testfiles/FTP_TESTS.jmx>
Starting standalone test @ Sun Aug 29 09:28:39 UTC 2021 (1630229319727)
Waiting for possible Shutdown/StopTestNow/HeapDump/ThreadDump message on port 4445
summary =      6 in 00:00:03 =    1.8/s Avg:   343 Min:    15 Max:  1795 Err:     0 (0.00%)
Tidying up ...    @ Sun Aug 29 09:28:43 UTC 2021 (1630229323994)
... end of run
No errors present in the logfile <https://ci-builds.apache.org/job/JMeter/job/JMeter%20Ubuntu/ws/bin/FTP_TESTS.log>
(the file is empty)

> Task :src:protocol:http:test
          0.5sec,   18 completed,   0 failed,   0 skipped, org.apache.jmeter.protocol.http.modifier.TestAnchorModifier
          0.0sec,    2 completed,   0 failed,   0 skipped, org.apache.jmeter.protocol.http.config.UrlConfigTest
          0.0sec,    3 completed,   0 failed,   0 skipped, org.apache.jmeter.protocol.http.config.MultipartUrlConfigTest
          0.0sec,   33 completed,   0 failed,   0 skipped, org.apache.jmeter.protocol.http.control.TestHC4CookieManager

> Task :src:dist-check:batchHTMLParserTestFile_2
Creating summariser <summary>
Created the tree successfully using <https://ci-builds.apache.org/job/JMeter/job/JMeter%20Ubuntu/ws/bin/testfiles/HTMLParserTestFile_2.jmx>
Starting standalone test @ Sun Aug 29 09:28:46 UTC 2021 (1630229326193)
Waiting for possible Shutdown/StopTestNow/HeapDump/ThreadDump message on port 4445
summary =      1 in 00:00:00 =    3.8/s Avg:   125 Min:   125 Max:   125 Err:     0 (0.00%)
Tidying up ...    @ Sun Aug 29 09:28:46 UTC 2021 (1630229326935)
... end of run
No errors present in the logfile <https://ci-builds.apache.org/job/JMeter/job/JMeter%20Ubuntu/ws/bin/HTMLParserTestFile_2.log>
(the file is empty)

> Task :src:dist-check:batchHttp4ImplDigestAuth SKIPPED

> Task :src:dist-check:batchHttp4ImplPreemptiveBasicAuth
Creating summariser <summary>
Created the tree successfully using <https://ci-builds.apache.org/job/JMeter/job/JMeter%20Ubuntu/ws/bin/testfiles/Http4ImplPreemptiveBasicAuth.jmx>
Starting standalone test @ Sun Aug 29 09:28:49 UTC 2021 (1630229329401)
Waiting for possible Shutdown/StopTestNow/HeapDump/ThreadDump message on port 4446

> Task :src:protocol:http:test FAILED
          6.1sec, org.apache.jmeter.protocol.http.control.DnsManagerTest
> badDnsInCustomResolverShouldFailHttpSampler(String, WireMockServer)[1], [1]
HttpClient4
WARNING   6.1sec,    2 completed,   0 failed,   1 skipped, badDnsInCustomResolverShouldFailHttpSampler(String,
WireMockServer)
WARNING   6.1sec,    2 completed,   0 failed,   1 skipped, org.apache.jmeter.protocol.http.control.DnsManagerTest
          0.0sec,    6 completed,   0 failed,   0 skipped, org.apache.jmeter.protocol.http.control.TestAuthManager
          0.0sec,    1 completed,   0 failed,   0 skipped, org.apache.jmeter.protocol.http.control.gui.TestHttpTestSampleGui
          0.0sec,    2 completed,   0 failed,   0 skipped, org.apache.jmeter.protocol.http.control.TestAuthManagerThreadIteration
          0.1sec,    4 completed,   0 failed,   0 skipped, org.apache.jmeter.protocol.http.control.TestCookieManagerThreadIteration
          0.1sec,    5 completed,   0 failed,   0 skipped, org.apache.jmeter.protocol.http.control.TestCacheManagerThreadIteration
          0.0sec,    1 completed,   0 failed,   0 skipped, org.apache.jmeter.protocol.http.control.TestAuthorization
          0.0sec,    7 completed,   0 failed,   0 skipped, org.apache.jmeter.protocol.http.visualizers.RequestViewHTTPTest
          0.0sec,    6 completed,   0 failed,   0 skipped, org.apache.jmeter.protocol.http.parser.TestHtmlParsingUtils
          0.0sec,    2 completed,   0 failed,   0 skipped, org.apache.jmeter.protocol.http.parser.TestBaseParser
          0.3sec,    4 completed,   0 failed,   0 skipped, org.apache.jmeter.protocol.http.parser.TestCssParser
          0.9sec,   22 completed,   0 failed,   0 skipped, org.apache.jmeter.gui.action.ParseCurlCommandActionTest
          0.1sec,    1 completed,   0 failed,   0 skipped, org.apache.jmeter.resources.ResourceKeyUsageTestHttp
WARNING   0.0sec,    1 completed,   0 failed,   1 skipped, [Run
0: implementation:HttpClient4]
WARNING   0.0sec,    1 completed,   0 failed,   1 skipped, [Run
1: implementation:Java]
WARNING   0.0sec,    2 completed,   0 failed,   2 skipped, org.apache.jmeter.protocol.http.sampler.SamplingNamingTest
FAILURE   0.0sec,    0 completed,   0 failed,   0 skipped, org.apache.jmeter.protocol.http.sampler.TestHTTPSamplersAgainstHttpMirrorServer$1,
org.apache.jmeter.protocol.http.sampler.TestHTTPSamplersAgainstHttpMirrorServer
FAILURE   0.1sec,    0 completed,   0 failed,   0 skipped, org.apache.jmeter.protocol.http.sampler.TestHTTPSamplersAgainstHttpMirrorServer
FAILURE   0.0sec,    0 completed,   0 failed,   0 skipped, org.apache.jmeter.protocol.http.control.TestHTTPMirrorThread$1,
org.apache.jmeter.protocol.http.control.TestHTTPMirrorThread
FAILURE   0.1sec,    0 completed,   0 failed,   0 skipped, org.apache.jmeter.protocol.http.control.TestHTTPMirrorThread
          0.0sec,    7 completed,   0 failed,   0 skipped, org.apache.jmeter.protocol.http.visualizers.RequestViewHTTPTest
          0.5sec,  103 completed,   0 failed,   0 skipped, org.apache.jmeter.protocol.http.parser.TestHTMLParser
          0.0sec,    1 completed,   0 failed,   0 skipped, [0]
          0.0sec,    1 completed,   0 failed,   0 skipped, [1]
          0.0sec,    1 completed,   0 failed,   0 skipped, [2]
          0.0sec,    1 completed,   0 failed,   0 skipped, [3]
          0.0sec,    1 completed,   0 failed,   0 skipped, [4]
          0.0sec,    1 completed,   0 failed,   0 skipped, [5]
          0.0sec,    1 completed,   0 failed,   0 skipped, [6]
          0.0sec,    1 completed,   0 failed,   0 skipped, [7]
          0.0sec,    1 completed,   0 failed,   0 skipped, [8]
          0.0sec,    1 completed,   0 failed,   0 skipped, [9]
          0.0sec,    1 completed,   0 failed,   0 skipped, [10]
          0.0sec,    1 completed,   0 failed,   0 skipped, [11]
          0.0sec,    1 completed,   0 failed,   0 skipped, [12]
          0.0sec,    1 completed,   0 failed,   0 skipped, [13]
          0.0sec,    1 completed,   0 failed,   0 skipped, [14]
          0.0sec,    1 completed,   0 failed,   0 skipped, [15]
          0.0sec,    1 completed,   0 failed,   0 skipped, [16]
          0.0sec,    1 completed,   0 failed,   0 skipped, [17]
          0.0sec,    1 completed,   0 failed,   0 skipped, [18]
          0.0sec,    1 completed,   0 failed,   0 skipped, [19]
          0.0sec,    1 completed,   0 failed,   0 skipped, [20]
          0.0sec,    1 completed,   0 failed,   0 skipped, [21]
          0.0sec,    1 completed,   0 failed,   0 skipped, [22]
          0.0sec,    1 completed,   0 failed,   0 skipped, [23]
          0.0sec,    1 completed,   0 failed,   0 skipped, [24]
          0.0sec,    1 completed,   0 failed,   0 skipped, [25]
          0.0sec,    1 completed,   0 failed,   0 skipped, [26]
          0.0sec,    1 completed,   0 failed,   0 skipped, [27]
          0.0sec,    1 completed,   0 failed,   0 skipped, [28]
          0.0sec,    1 completed,   0 failed,   0 skipped, [29]
          0.0sec,    1 completed,   0 failed,   0 skipped, [30]
          0.0sec,    1 completed,   0 failed,   0 skipped, [31]
          0.0sec,    1 completed,   0 failed,   0 skipped, [32]
          0.0sec,    1 completed,   0 failed,   0 skipped, [33]
          0.0sec,    1 completed,   0 failed,   0 skipped, [34]
          0.0sec,    1 completed,   0 failed,   0 skipped, [35]
          0.0sec,    1 completed,   0 failed,   0 skipped, [36]
          0.0sec,    1 completed,   0 failed,   0 skipped, [37]
          0.0sec,    1 completed,   0 failed,   0 skipped, [38]
          0.0sec,    1 completed,   0 failed,   0 skipped, [39]
          0.0sec,    1 completed,   0 failed,   0 skipped, [40]
          0.0sec,    1 completed,   0 failed,   0 skipped, [41]
          0.0sec,    1 completed,   0 failed,   0 skipped, [42]
          0.0sec,    1 completed,   0 failed,   0 skipped, [43]
          0.0sec,    1 completed,   0 failed,   0 skipped, [44]
          0.0sec,    1 completed,   0 failed,   0 skipped, [45]
          0.0sec,    1 completed,   0 failed,   0 skipped, [46]
          0.0sec,    1 completed,   0 failed,   0 skipped, [47]
          0.0sec,    1 completed,   0 failed,   0 skipped, [48]
          0.0sec,    1 completed,   0 failed,   0 skipped, [49]
          0.0sec,   50 completed,   0 failed,   0 skipped, org.apache.jmeter.protocol.http.parser.TestBug60842HtmlParser
          0.2sec,    8 completed,   0 failed,   0 skipped, getEncoding returns #expectedEncoding
from #contentType
          0.0sec,    7 completed,   0 failed,   0 skipped, makeRelativeURL works with a trailing
file
          0.0sec,    7 completed,   0 failed,   0 skipped, makeRelativeURL works with a trailing
directory
          0.0sec,    4 completed,   0 failed,   0 skipped, makeRelativeURL given invalid path
'#path' returns '#path'
          0.0sec,   17 completed,   0 failed,   0 skipped, removeSlashDotDot given a url or
path #urlOrPath returns #expectedUrl
          0.0sec,   15 completed,   0 failed,   0 skipped, testSanitizeUrl
          0.3sec,   58 completed,   0 failed,   0 skipped, org.apache.jmeter.protocol.http.util.HTTPUtilsSpec
          0.3sec,   12 completed,   0 failed,   0 skipped, org.apache.jmeter.protocol.http.control.DNSCacheManagerSpec
FAILURE  26.4sec,  699 completed,   0 failed,   3 skipped, Gradle
Test Run :src:protocol:http:test

> Task :src:dist-check:batchHttp4ImplPreemptiveBasicAuth
summary =     12 in 00:00:05 =    2.2/s Avg:    87 Min:     9 Max:   693 Err:     0 (0.00%)
Tidying up ...    @ Sun Aug 29 09:28:55 UTC 2021 (1630229335633)
... end of run
No errors present in the logfile <https://ci-builds.apache.org/job/JMeter/job/JMeter%20Ubuntu/ws/bin/Http4ImplPreemptiveBasicAuth.log>
(the file is empty)
checksum-dependency elapsed time: 51438ms, configurations processed: 269
    SHA-512 computation time: 142ms (goes in parallel, it might exceed wall-clock time), files
processed: 20, processed: 6MiB, skipped: 3175MiB
    PGP signature resolution time: 492ms (wall-clock), resolution requests: 160, signatures
resolved: 271
    PGP key resolution time: 36052ms (wall-clock), resolution requests: 160, download time:
0ms (goes in parallel, it might exceed wall-clock time), keys downloaded: 0
        PGP signature verification time: 48685ms (goes in parallel, it might exceed wall-clock
time), files processed: 519, processed: 602MiB, skipped: 2535MiB

FAILURE: Build failed with an exception.

* What went wrong:
Execution failed for task ':src:protocol:http:test'.
> There were failing tests. See the report at: file:///home/jenkins/jenkins-agent/workspace/JMeter/JMeter%20Ubuntu/src/protocol/http/build/reports/tests/test/index.html

* Try:
Run with --stacktrace option to get the stack trace. Run with --info or --debug option to
get more log output. Run with --scan to get full insights.

* Get more help at https://help.gradle.org

Deprecated Gradle features were used in this build, making it incompatible with Gradle 8.0.
Use '--warning-mode all' to show the individual deprecation warnings.
See https://docs.gradle.org/7.0.2/userguide/command_line_interface.html#sec:command_line_warnings

Execution optimizations have been disabled for 3 invalid unit(s) of work during this build
to ensure correctness.
Please consult deprecation warnings for more details.

BUILD FAILED in 3m 23s
246 actionable tasks: 107 executed, 8 from cache, 131 up-to-date
Build step 'Invoke Gradle script' changed build result to FAILURE
Build step 'Invoke Gradle script' marked build as failure

Mime
View raw message