lucene-dev mailing list archives

Site index · List index
Message view « Date » · « Thread »
Top « Date » · « Thread »
From Policeman Jenkins Server <jenk...@thetaphi.de>
Subject [JENKINS-EA] Lucene-Solr-master-Linux (64bit/jdk-9-ea+181) - Build # 20403 - Unstable!
Date Fri, 01 Sep 2017 15:45:05 GMT
Build: https://jenkins.thetaphi.de/job/Lucene-Solr-master-Linux/20403/
Java: 64bit/jdk-9-ea+181 -XX:+UseCompressedOops -XX:+UseConcMarkSweepGC --illegal-access=deny

1 tests failed.
FAILED:  junit.framework.TestSuite.org.apache.solr.search.QueryEqualityTest

Error Message:
testParserCoverage was run w/o any other method explicitly testing qparser: bool

Stack Trace:
java.lang.AssertionError: testParserCoverage was run w/o any other method explicitly testing qparser: bool
	at __randomizedtesting.SeedInfo.seed([D8E4083C710F8437]:0)
	at org.junit.Assert.fail(Assert.java:93)
	at org.junit.Assert.assertTrue(Assert.java:43)
	at org.apache.solr.search.QueryEqualityTest.afterClassParserCoverageTest(QueryEqualityTest.java:59)
	at java.base/jdk.internal.reflect.NativeMethodAccessorImpl.invoke0(Native Method)
	at java.base/jdk.internal.reflect.NativeMethodAccessorImpl.invoke(NativeMethodAccessorImpl.java:62)
	at java.base/jdk.internal.reflect.DelegatingMethodAccessorImpl.invoke(DelegatingMethodAccessorImpl.java:43)
	at java.base/java.lang.reflect.Method.invoke(Method.java:564)
	at com.carrotsearch.randomizedtesting.RandomizedRunner.invoke(RandomizedRunner.java:1737)
	at com.carrotsearch.randomizedtesting.RandomizedRunner$7.evaluate(RandomizedRunner.java:897)
	at com.carrotsearch.randomizedtesting.rules.StatementAdapter.evaluate(StatementAdapter.java:36)
	at com.carrotsearch.randomizedtesting.rules.SystemPropertiesRestoreRule$1.evaluate(SystemPropertiesRestoreRule.java:57)
	at org.apache.lucene.util.AbstractBeforeAfterRule$1.evaluate(AbstractBeforeAfterRule.java:45)
	at com.carrotsearch.randomizedtesting.rules.StatementAdapter.evaluate(StatementAdapter.java:36)
	at org.apache.lucene.util.TestRuleStoreClassName$1.evaluate(TestRuleStoreClassName.java:41)
	at com.carrotsearch.randomizedtesting.rules.NoShadowingOrOverridesOnMethodsRule$1.evaluate(NoShadowingOrOverridesOnMethodsRule.java:40)
	at com.carrotsearch.randomizedtesting.rules.NoShadowingOrOverridesOnMethodsRule$1.evaluate(NoShadowingOrOverridesOnMethodsRule.java:40)
	at com.carrotsearch.randomizedtesting.rules.StatementAdapter.evaluate(StatementAdapter.java:36)
	at com.carrotsearch.randomizedtesting.rules.StatementAdapter.evaluate(StatementAdapter.java:36)
	at org.apache.lucene.util.TestRuleAssertionsRequired$1.evaluate(TestRuleAssertionsRequired.java:53)
	at org.apache.lucene.util.TestRuleMarkFailure$1.evaluate(TestRuleMarkFailure.java:47)
	at org.apache.lucene.util.TestRuleIgnoreAfterMaxFailures$1.evaluate(TestRuleIgnoreAfterMaxFailures.java:64)
	at org.apache.lucene.util.TestRuleIgnoreTestSuites$1.evaluate(TestRuleIgnoreTestSuites.java:54)
	at com.carrotsearch.randomizedtesting.rules.StatementAdapter.evaluate(StatementAdapter.java:36)
	at com.carrotsearch.randomizedtesting.ThreadLeakControl$StatementRunner.run(ThreadLeakControl.java:368)
	at java.base/java.lang.Thread.run(Thread.java:844)




Build Log:
[...truncated 1718 lines...]
   [junit4] JVM J0: stderr was not empty, see: /home/jenkins/workspace/Lucene-Solr-master-Linux/lucene/build/core/test/temp/junit4-J0-20170901_143121_13414760000435615651910.syserr
   [junit4] >>> JVM J0 emitted unexpected output (verbatim) ----
   [junit4] Java HotSpot(TM) 64-Bit Server VM warning: Option UseConcMarkSweepGC was deprecated in version 9.0 and will likely be removed in a future release.
   [junit4] <<< JVM J0: EOF ----

   [junit4] JVM J2: stderr was not empty, see: /home/jenkins/workspace/Lucene-Solr-master-Linux/lucene/build/core/test/temp/junit4-J2-20170901_143121_1343619687746621709996.syserr
   [junit4] >>> JVM J2 emitted unexpected output (verbatim) ----
   [junit4] Java HotSpot(TM) 64-Bit Server VM warning: Option UseConcMarkSweepGC was deprecated in version 9.0 and will likely be removed in a future release.
   [junit4] <<< JVM J2: EOF ----

[...truncated 3 lines...]
   [junit4] JVM J1: stderr was not empty, see: /home/jenkins/workspace/Lucene-Solr-master-Linux/lucene/build/core/test/temp/junit4-J1-20170901_143121_13411439946012207185972.syserr
   [junit4] >>> JVM J1 emitted unexpected output (verbatim) ----
   [junit4] Java HotSpot(TM) 64-Bit Server VM warning: Option UseConcMarkSweepGC was deprecated in version 9.0 and will likely be removed in a future release.
   [junit4] <<< JVM J1: EOF ----

[...truncated 299 lines...]
   [junit4] JVM J1: stderr was not empty, see: /home/jenkins/workspace/Lucene-Solr-master-Linux/lucene/build/test-framework/test/temp/junit4-J1-20170901_143641_8962400375702202077692.syserr
   [junit4] >>> JVM J1 emitted unexpected output (verbatim) ----
   [junit4] Java HotSpot(TM) 64-Bit Server VM warning: Option UseConcMarkSweepGC was deprecated in version 9.0 and will likely be removed in a future release.
   [junit4] <<< JVM J1: EOF ----

   [junit4] JVM J0: stderr was not empty, see: /home/jenkins/workspace/Lucene-Solr-master-Linux/lucene/build/test-framework/test/temp/junit4-J0-20170901_143641_89611139307988372608269.syserr
   [junit4] >>> JVM J0 emitted unexpected output (verbatim) ----
   [junit4] Java HotSpot(TM) 64-Bit Server VM warning: Option UseConcMarkSweepGC was deprecated in version 9.0 and will likely be removed in a future release.
   [junit4] <<< JVM J0: EOF ----

[...truncated 3 lines...]
   [junit4] JVM J2: stderr was not empty, see: /home/jenkins/workspace/Lucene-Solr-master-Linux/lucene/build/test-framework/test/temp/junit4-J2-20170901_143641_89611898495303661708025.syserr
   [junit4] >>> JVM J2 emitted unexpected output (verbatim) ----
   [junit4] Java HotSpot(TM) 64-Bit Server VM warning: Option UseConcMarkSweepGC was deprecated in version 9.0 and will likely be removed in a future release.
   [junit4] <<< JVM J2: EOF ----

[...truncated 1041 lines...]
   [junit4] JVM J2: stderr was not empty, see: /home/jenkins/workspace/Lucene-Solr-master-Linux/lucene/build/analysis/common/test/temp/junit4-J2-20170901_143748_7302334834071441888123.syserr
   [junit4] >>> JVM J2 emitted unexpected output (verbatim) ----
   [junit4] Java HotSpot(TM) 64-Bit Server VM warning: Option UseConcMarkSweepGC was deprecated in version 9.0 and will likely be removed in a future release.
   [junit4] <<< JVM J2: EOF ----

[...truncated 3 lines...]
   [junit4] JVM J1: stderr was not empty, see: /home/jenkins/workspace/Lucene-Solr-master-Linux/lucene/build/analysis/common/test/temp/junit4-J1-20170901_143748_7302482766344825299367.syserr
   [junit4] >>> JVM J1 emitted unexpected output (verbatim) ----
   [junit4] Java HotSpot(TM) 64-Bit Server VM warning: Option UseConcMarkSweepGC was deprecated in version 9.0 and will likely be removed in a future release.
   [junit4] <<< JVM J1: EOF ----

[...truncated 3 lines...]
   [junit4] JVM J0: stderr was not empty, see: /home/jenkins/workspace/Lucene-Solr-master-Linux/lucene/build/analysis/common/test/temp/junit4-J0-20170901_143748_73013766781381412960807.syserr
   [junit4] >>> JVM J0 emitted unexpected output (verbatim) ----
   [junit4] Java HotSpot(TM) 64-Bit Server VM warning: Option UseConcMarkSweepGC was deprecated in version 9.0 and will likely be removed in a future release.
   [junit4] <<< JVM J0: EOF ----

[...truncated 226 lines...]
   [junit4] JVM J2: stderr was not empty, see: /home/jenkins/workspace/Lucene-Solr-master-Linux/lucene/build/analysis/icu/test/temp/junit4-J2-20170901_143920_69816769995004324787131.syserr
   [junit4] >>> JVM J2 emitted unexpected output (verbatim) ----
   [junit4] Java HotSpot(TM) 64-Bit Server VM warning: Option UseConcMarkSweepGC was deprecated in version 9.0 and will likely be removed in a future release.
   [junit4] <<< JVM J2: EOF ----

   [junit4] JVM J0: stderr was not empty, see: /home/jenkins/workspace/Lucene-Solr-master-Linux/lucene/build/analysis/icu/test/temp/junit4-J0-20170901_143920_6988104454665727961547.syserr
   [junit4] >>> JVM J0 emitted unexpected output (verbatim) ----
   [junit4] Java HotSpot(TM) 64-Bit Server VM warning: Option UseConcMarkSweepGC was deprecated in version 9.0 and will likely be removed in a future release.
   [junit4] <<< JVM J0: EOF ----

[...truncated 5 lines...]
   [junit4] JVM J1: stderr was not empty, see: /home/jenkins/workspace/Lucene-Solr-master-Linux/lucene/build/analysis/icu/test/temp/junit4-J1-20170901_143920_69812089347470630084579.syserr
   [junit4] >>> JVM J1 emitted unexpected output (verbatim) ----
   [junit4] Java HotSpot(TM) 64-Bit Server VM warning: Option UseConcMarkSweepGC was deprecated in version 9.0 and will likely be removed in a future release.
   [junit4] <<< JVM J1: EOF ----

[...truncated 240 lines...]
   [junit4] JVM J0: stderr was not empty, see: /home/jenkins/workspace/Lucene-Solr-master-Linux/lucene/build/analysis/kuromoji/test/temp/junit4-J0-20170901_143930_93217005062845640926560.syserr
   [junit4] >>> JVM J0 emitted unexpected output (verbatim) ----
   [junit4] Java HotSpot(TM) 64-Bit Server VM warning: Option UseConcMarkSweepGC was deprecated in version 9.0 and will likely be removed in a future release.
   [junit4] <<< JVM J0: EOF ----

[...truncated 6 lines...]
   [junit4] JVM J2: stderr was not empty, see: /home/jenkins/workspace/Lucene-Solr-master-Linux/lucene/build/analysis/kuromoji/test/temp/junit4-J2-20170901_143930_93212707254333188625335.syserr
   [junit4] >>> JVM J2 emitted unexpected output (verbatim) ----
   [junit4] Java HotSpot(TM) 64-Bit Server VM warning: Option UseConcMarkSweepGC was deprecated in version 9.0 and will likely be removed in a future release.
   [junit4] <<< JVM J2: EOF ----

[...truncated 9 lines...]
   [junit4] JVM J1: stderr was not empty, see: /home/jenkins/workspace/Lucene-Solr-master-Linux/lucene/build/analysis/kuromoji/test/temp/junit4-J1-20170901_143930_93217555859256550295853.syserr
   [junit4] >>> JVM J1 emitted unexpected output (verbatim) ----
   [junit4] Java HotSpot(TM) 64-Bit Server VM warning: Option UseConcMarkSweepGC was deprecated in version 9.0 and will likely be removed in a future release.
   [junit4] <<< JVM J1: EOF ----

[...truncated 154 lines...]
   [junit4] JVM J1: stderr was not empty, see: /home/jenkins/workspace/Lucene-Solr-master-Linux/lucene/build/analysis/morfologik/test/temp/junit4-J1-20170901_143948_7862256203004864913627.syserr
   [junit4] >>> JVM J1 emitted unexpected output (verbatim) ----
   [junit4] Java HotSpot(TM) 64-Bit Server VM warning: Option UseConcMarkSweepGC was deprecated in version 9.0 and will likely be removed in a future release.
   [junit4] <<< JVM J1: EOF ----

[...truncated 3 lines...]
   [junit4] JVM J0: stderr was not empty, see: /home/jenkins/workspace/Lucene-Solr-master-Linux/lucene/build/analysis/morfologik/test/temp/junit4-J0-20170901_143948_7868598179928546407184.syserr
   [junit4] >>> JVM J0 emitted unexpected output (verbatim) ----
   [junit4] Java HotSpot(TM) 64-Bit Server VM warning: Option UseConcMarkSweepGC was deprecated in version 9.0 and will likely be removed in a future release.
   [junit4] <<< JVM J0: EOF ----

[...truncated 3 lines...]
   [junit4] JVM J2: stderr was not empty, see: /home/jenkins/workspace/Lucene-Solr-master-Linux/lucene/build/analysis/morfologik/test/temp/junit4-J2-20170901_143948_7862024902340171648336.syserr
   [junit4] >>> JVM J2 emitted unexpected output (verbatim) ----
   [junit4] Java HotSpot(TM) 64-Bit Server VM warning: Option UseConcMarkSweepGC was deprecated in version 9.0 and will likely be removed in a future release.
   [junit4] <<< JVM J2: EOF ----

[...truncated 163 lines...]
   [junit4] JVM J0: stderr was not empty, see: /home/jenkins/workspace/Lucene-Solr-master-Linux/lucene/build/analysis/phonetic/test/temp/junit4-J0-20170901_143952_15111806533418983668352.syserr
   [junit4] >>> JVM J0 emitted unexpected output (verbatim) ----
   [junit4] Java HotSpot(TM) 64-Bit Server VM warning: Option UseConcMarkSweepGC was deprecated in version 9.0 and will likely be removed in a future release.
   [junit4] <<< JVM J0: EOF ----

[...truncated 3 lines...]
   [junit4] JVM J2: stderr was not empty, see: /home/jenkins/workspace/Lucene-Solr-master-Linux/lucene/build/analysis/phonetic/test/temp/junit4-J2-20170901_143952_15116599726828722317693.syserr
   [junit4] >>> JVM J2 emitted unexpected output (verbatim) ----
   [junit4] Java HotSpot(TM) 64-Bit Server VM warning: Option UseConcMarkSweepGC was deprecated in version 9.0 and will likely be removed in a future release.
   [junit4] <<< JVM J2: EOF ----

[...truncated 6 lines...]
   [junit4] JVM J1: stderr was not empty, see: /home/jenkins/workspace/Lucene-Solr-master-Linux/lucene/build/analysis/phonetic/test/temp/junit4-J1-20170901_143952_15111126630834216736918.syserr
   [junit4] >>> JVM J1 emitted unexpected output (verbatim) ----
   [junit4] Java HotSpot(TM) 64-Bit Server VM warning: Option UseConcMarkSweepGC was deprecated in version 9.0 and will likely be removed in a future release.
   [junit4] <<< JVM J1: EOF ----

[...truncated 153 lines...]
   [junit4] JVM J0: stderr was not empty, see: /home/jenkins/workspace/Lucene-Solr-master-Linux/lucene/build/analysis/smartcn/test/temp/junit4-J0-20170901_144002_26111717830876942256311.syserr
   [junit4] >>> JVM J0 emitted unexpected output (verbatim) ----
   [junit4] Java HotSpot(TM) 64-Bit Server VM warning: Option UseConcMarkSweepGC was deprecated in version 9.0 and will likely be removed in a future release.
   [junit4] <<< JVM J0: EOF ----

[...truncated 3 lines...]
   [junit4] JVM J1: stderr was not empty, see: /home/jenkins/workspace/Lucene-Solr-master-Linux/lucene/build/analysis/smartcn/test/temp/junit4-J1-20170901_144002_26117573013173075932598.syserr
   [junit4] >>> JVM J1 emitted unexpected output (verbatim) ----
   [junit4] Java HotSpot(TM) 64-Bit Server VM warning: Option UseConcMarkSweepGC was deprecated in version 9.0 and will likely be removed in a future release.
   [junit4] <<< JVM J1: EOF ----

[...truncated 157 lines...]
   [junit4] JVM J2: stderr was not empty, see: /home/jenkins/workspace/Lucene-Solr-master-Linux/lucene/build/analysis/stempel/test/temp/junit4-J2-20170901_144009_58813032336418018821779.syserr
   [junit4] >>> JVM J2 emitted unexpected output (verbatim) ----
   [junit4] Java HotSpot(TM) 64-Bit Server VM warning: Option UseConcMarkSweepGC was deprecated in version 9.0 and will likely be removed in a future release.
   [junit4] <<< JVM J2: EOF ----

   [junit4] JVM J1: stderr was not empty, see: /home/jenkins/workspace/Lucene-Solr-master-Linux/lucene/build/analysis/stempel/test/temp/junit4-J1-20170901_144009_58816252757255163858884.syserr
   [junit4] >>> JVM J1 emitted unexpected output (verbatim) ----
   [junit4] Java HotSpot(TM) 64-Bit Server VM warning: Option UseConcMarkSweepGC was deprecated in version 9.0 and will likely be removed in a future release.
   [junit4] <<< JVM J1: EOF ----

[...truncated 3 lines...]
   [junit4] JVM J0: stderr was not empty, see: /home/jenkins/workspace/Lucene-Solr-master-Linux/lucene/build/analysis/stempel/test/temp/junit4-J0-20170901_144009_5887325062860071449438.syserr
   [junit4] >>> JVM J0 emitted unexpected output (verbatim) ----
   [junit4] Java HotSpot(TM) 64-Bit Server VM warning: Option UseConcMarkSweepGC was deprecated in version 9.0 and will likely be removed in a future release.
   [junit4] <<< JVM J0: EOF ----

[...truncated 169 lines...]
   [junit4] JVM J0: stderr was not empty, see: /home/jenkins/workspace/Lucene-Solr-master-Linux/lucene/build/analysis/uima/test/temp/junit4-J0-20170901_144012_48014637530454156673997.syserr
   [junit4] >>> JVM J0 emitted unexpected output (verbatim) ----
   [junit4] Java HotSpot(TM) 64-Bit Server VM warning: Option UseConcMarkSweepGC was deprecated in version 9.0 and will likely be removed in a future release.
   [junit4] <<< JVM J0: EOF ----

[...truncated 148 lines...]
   [junit4] JVM J0: stderr was not empty, see: /home/jenkins/workspace/Lucene-Solr-master-Linux/lucene/build/backward-codecs/test/temp/junit4-J0-20170901_144018_6741681797273790969000.syserr
   [junit4] >>> JVM J0 emitted unexpected output (verbatim) ----
   [junit4] Java HotSpot(TM) 64-Bit Server VM warning: Option UseConcMarkSweepGC was deprecated in version 9.0 and will likely be removed in a future release.
   [junit4] <<< JVM J0: EOF ----

[...truncated 5 lines...]
   [junit4] JVM J1: stderr was not empty, see: /home/jenkins/workspace/Lucene-Solr-master-Linux/lucene/build/backward-codecs/test/temp/junit4-J1-20170901_144018_67414427620457914673161.syserr
   [junit4] >>> JVM J1 emitted unexpected output (verbatim) ----
   [junit4] Java HotSpot(TM) 64-Bit Server VM warning: Option UseConcMarkSweepGC was deprecated in version 9.0 and will likely be removed in a future release.
   [junit4] <<< JVM J1: EOF ----

[...truncated 25 lines...]
   [junit4] JVM J2: stderr was not empty, see: /home/jenkins/workspace/Lucene-Solr-master-Linux/lucene/build/backward-codecs/test/temp/junit4-J2-20170901_144018_67414053132427842853732.syserr
   [junit4] >>> JVM J2 emitted unexpected output (verbatim) ----
   [junit4] Java HotSpot(TM) 64-Bit Server VM warning: Option UseConcMarkSweepGC was deprecated in version 9.0 and will likely be removed in a future release.
   [junit4] <<< JVM J2: EOF ----

[...truncated 1237 lines...]
   [junit4] JVM J1: stderr was not empty, see: /home/jenkins/workspace/Lucene-Solr-master-Linux/lucene/build/benchmark/test/temp/junit4-J1-20170901_144030_51412212249544837553834.syserr
   [junit4] >>> JVM J1 emitted unexpected output (verbatim) ----
   [junit4] Java HotSpot(TM) 64-Bit Server VM warning: Option UseConcMarkSweepGC was deprecated in version 9.0 and will likely be removed in a future release.
   [junit4] <<< JVM J1: EOF ----

   [junit4] JVM J2: stderr was not empty, see: /home/jenkins/workspace/Lucene-Solr-master-Linux/lucene/build/benchmark/test/temp/junit4-J2-20170901_144030_5142789904771431799208.syserr
   [junit4] >>> JVM J2 emitted unexpected output (verbatim) ----
   [junit4] Java HotSpot(TM) 64-Bit Server VM warning: Option UseConcMarkSweepGC was deprecated in version 9.0 and will likely be removed in a future release.
   [junit4] <<< JVM J2: EOF ----

[...truncated 3 lines...]
   [junit4] JVM J0: stderr was not empty, see: /home/jenkins/workspace/Lucene-Solr-master-Linux/lucene/build/benchmark/test/temp/junit4-J0-20170901_144030_51417749300346251566232.syserr
   [junit4] >>> JVM J0 emitted unexpected output (verbatim) ----
   [junit4] Java HotSpot(TM) 64-Bit Server VM warning: Option UseConcMarkSweepGC was deprecated in version 9.0 and will likely be removed in a future release.
   [junit4] <<< JVM J0: EOF ----

[...truncated 230 lines...]
   [junit4] JVM J1: stderr was not empty, see: /home/jenkins/workspace/Lucene-Solr-master-Linux/lucene/build/classification/test/temp/junit4-J1-20170901_144038_21610538786103229384330.syserr
   [junit4] >>> JVM J1 emitted unexpected output (verbatim) ----
   [junit4] Java HotSpot(TM) 64-Bit Server VM warning: Option UseConcMarkSweepGC was deprecated in version 9.0 and will likely be removed in a future release.
   [junit4] <<< JVM J1: EOF ----

[...truncated 3 lines...]
   [junit4] JVM J2: stderr was not empty, see: /home/jenkins/workspace/Lucene-Solr-master-Linux/lucene/build/classification/test/temp/junit4-J2-20170901_144038_2168470713554432817468.syserr
   [junit4] >>> JVM J2 emitted unexpected output (verbatim) ----
   [junit4] Java HotSpot(TM) 64-Bit Server VM warning: Option UseConcMarkSweepGC was deprecated in version 9.0 and will likely be removed in a future release.
   [junit4] <<< JVM J2: EOF ----

[...truncated 3 lines...]
   [junit4] JVM J0: stderr was not empty, see: /home/jenkins/workspace/Lucene-Solr-master-Linux/lucene/build/classification/test/temp/junit4-J0-20170901_144038_2161360143718978713823.syserr
   [junit4] >>> JVM J0 emitted unexpected output (verbatim) ----
   [junit4] Java HotSpot(TM) 64-Bit Server VM warning: Option UseConcMarkSweepGC was deprecated in version 9.0 and will likely be removed in a future release.
   [junit4] <<< JVM J0: EOF ----

[...truncated 250 lines...]
   [junit4] JVM J2: stderr was not empty, see: /home/jenkins/workspace/Lucene-Solr-master-Linux/lucene/build/codecs/test/temp/junit4-J2-20170901_144054_46212716857023471777985.syserr
   [junit4] >>> JVM J2 emitted unexpected output (verbatim) ----
   [junit4] Java HotSpot(TM) 64-Bit Server VM warning: Option UseConcMarkSweepGC was deprecated in version 9.0 and will likely be removed in a future release.
   [junit4] <<< JVM J2: EOF ----

[...truncated 7 lines...]
   [junit4] JVM J1: stderr was not empty, see: /home/jenkins/workspace/Lucene-Solr-master-Linux/lucene/build/codecs/test/temp/junit4-J1-20170901_144054_4622762872917837124733.syserr
   [junit4] >>> JVM J1 emitted unexpected output (verbatim) ----
   [junit4] Java HotSpot(TM) 64-Bit Server VM warning: Option UseConcMarkSweepGC was deprecated in version 9.0 and will likely be removed in a future release.
   [junit4] <<< JVM J1: EOF ----

[...truncated 9 lines...]
   [junit4] JVM J0: stderr was not empty, see: /home/jenkins/workspace/Lucene-Solr-master-Linux/lucene/build/codecs/test/temp/junit4-J0-20170901_144054_4623056083784040602237.syserr
   [junit4] >>> JVM J0 emitted unexpected output (verbatim) ----
   [junit4] Java HotSpot(TM) 64-Bit Server VM warning: Option UseConcMarkSweepGC was deprecated in version 9.0 and will likely be removed in a future release.
   [junit4] <<< JVM J0: EOF ----

[...truncated 241 lines...]
   [junit4] JVM J1: stderr was not empty, see: /home/jenkins/workspace/Lucene-Solr-master-Linux/lucene/build/demo/test/temp/junit4-J1-20170901_144332_95311390750824446637104.syserr
   [junit4] >>> JVM J1 emitted unexpected output (verbatim) ----
   [junit4] Java HotSpot(TM) 64-Bit Server VM warning: Option UseConcMarkSweepGC was deprecated in version 9.0 and will likely be removed in a future release.
   [junit4] <<< JVM J1: EOF ----

   [junit4] JVM J2: stderr was not empty, see: /home/jenkins/workspace/Lucene-Solr-master-Linux/lucene/build/demo/test/temp/junit4-J2-20170901_144332_95312693724145579354298.syserr
   [junit4] >>> JVM J2 emitted unexpected output (verbatim) ----
   [junit4] Java HotSpot(TM) 64-Bit Server VM warning: Option UseConcMarkSweepGC was deprecated in version 9.0 and will likely be removed in a future release.
   [junit4] <<< JVM J2: EOF ----

   [junit4] JVM J0: stderr was not empty, see: /home/jenkins/workspace/Lucene-Solr-master-Linux/lucene/build/demo/test/temp/junit4-J0-20170901_144332_9534073889209654757487.syserr
   [junit4] >>> JVM J0 emitted unexpected output (verbatim) ----
   [junit4] Java HotSpot(TM) 64-Bit Server VM warning: Option UseConcMarkSweepGC was deprecated in version 9.0 and will likely be removed in a future release.
   [junit4] <<< JVM J0: EOF ----

[...truncated 170 lines...]
   [junit4] JVM J1: stderr was not empty, see: /home/jenkins/workspace/Lucene-Solr-master-Linux/lucene/build/expressions/test/temp/junit4-J1-20170901_144335_4964061254063718386318.syserr
   [junit4] >>> JVM J1 emitted unexpected output (verbatim) ----
   [junit4] Java HotSpot(TM) 64-Bit Server VM warning: Option UseConcMarkSweepGC was deprecated in version 9.0 and will likely be removed in a future release.
   [junit4] <<< JVM J1: EOF ----

   [junit4] JVM J2: stderr was not empty, see: /home/jenkins/workspace/Lucene-Solr-master-Linux/lucene/build/expressions/test/temp/junit4-J2-20170901_144335_4966245226638549757116.syserr
   [junit4] >>> JVM J2 emitted unexpected output (verbatim) ----
   [junit4] Java HotSpot(TM) 64-Bit Server VM warning: Option UseConcMarkSweepGC was deprecated in version 9.0 and will likely be removed in a future release.
   [junit4] <<< JVM J2: EOF ----

[...truncated 6 lines...]
   [junit4] JVM J0: stderr was not empty, see: /home/jenkins/workspace/Lucene-Solr-master-Linux/lucene/build/expressions/test/temp/junit4-J0-20170901_144335_4967136970028467300546.syserr
   [junit4] >>> JVM J0 emitted unexpected output (verbatim) ----
   [junit4] Java HotSpot(TM) 64-Bit Server VM warning: Option UseConcMarkSweepGC was deprecated in version 9.0 and will likely be removed in a future release.
   [junit4] <<< JVM J0: EOF ----

[...truncated 217 lines...]
   [junit4] JVM J2: stderr was not empty, see: /home/jenkins/workspace/Lucene-Solr-master-Linux/lucene/build/facet/test/temp/junit4-J2-20170901_144340_63513883218623704486335.syserr
   [junit4] >>> JVM J2 emitted unexpected output (verbatim) ----
   [junit4] Java HotSpot(TM) 64-Bit Server VM warning: Option UseConcMarkSweepGC was deprecated in version 9.0 and will likely be removed in a future release.
   [junit4] <<< JVM J2: EOF ----

[...truncated 3 lines...]
   [junit4] JVM J0: stderr was not empty, see: /home/jenkins/workspace/Lucene-Solr-master-Linux/lucene/build/facet/test/temp/junit4-J0-20170901_144340_63511573130592191861146.syserr
   [junit4] >>> JVM J0 emitted unexpected output (verbatim) ----
   [junit4] Java HotSpot(TM) 64-Bit Server VM warning: Option UseConcMarkSweepGC was deprecated in version 9.0 and will likely be removed in a future release.
   [junit4] <<< JVM J0: EOF ----

[...truncated 9 lines...]
   [junit4] JVM J1: stderr was not empty, see: /home/jenkins/workspace/Lucene-Solr-master-Linux/lucene/build/facet/test/temp/junit4-J1-20170901_144340_63515731686494641890670.syserr
   [junit4] >>> JVM J1 emitted unexpected output (verbatim) ----
   [junit4] Java HotSpot(TM) 64-Bit Server VM warning: Option UseConcMarkSweepGC was deprecated in version 9.0 and will likely be removed in a future release.
   [junit4] <<< JVM J1: EOF ----

[...truncated 179 lines...]
   [junit4] JVM J1: stderr was not empty, see: /home/jenkins/workspace/Lucene-Solr-master-Linux/lucene/build/grouping/test/temp/junit4-J1-20170901_144403_2109901229170681662241.syserr
   [junit4] >>> JVM J1 emitted unexpected output (verbatim) ----
   [junit4] Java HotSpot(TM) 64-Bit Server VM warning: Option UseConcMarkSweepGC was deprecated in version 9.0 and will likely be removed in a future release.
   [junit4] <<< JVM J1: EOF ----

[...truncated 3 lines...]
   [junit4] JVM J0: stderr was not empty, see: /home/jenkins/workspace/Lucene-Solr-master-Linux/lucene/build/grouping/test/temp/junit4-J0-20170901_144403_209601350158262715936.syserr
   [junit4] >>> JVM J0 emitted unexpected output (verbatim) ----
   [junit4] Java HotSpot(TM) 64-Bit Server VM warning: Option UseConcMarkSweepGC was deprecated in version 9.0 and will likely be removed in a future release.
   [junit4] <<< JVM J0: EOF ----

[...truncated 3 lines...]
   [junit4] JVM J2: stderr was not empty, see: /home/jenkins/workspace/Lucene-Solr-master-Linux/lucene/build/grouping/test/temp/junit4-J2-20170901_144403_21014029175718798851411.syserr
   [junit4] >>> JVM J2 emitted unexpected output (verbatim) ----
   [junit4] Java HotSpot(TM) 64-Bit Server VM warning: Option UseConcMarkSweepGC was deprecated in version 9.0 and will likely be removed in a future release.
   [junit4] <<< JVM J2: EOF ----

[...truncated 246 lines...]
   [junit4] JVM J2: stderr was not empty, see: /home/jenkins/workspace/Lucene-Solr-master-Linux/lucene/build/highlighter/test/temp/junit4-J2-20170901_144409_3146586970482845865048.syserr
   [junit4] >>> JVM J2 emitted unexpected output (verbatim) ----
   [junit4] Java HotSpot(TM) 64-Bit Server VM warning: Option UseConcMarkSweepGC was deprecated in version 9.0 and will likely be removed in a future release.
   [junit4] <<< JVM J2: EOF ----

   [junit4] JVM J1: stderr was not empty, see: /home/jenkins/workspace/Lucene-Solr-master-Linux/lucene/build/highlighter/test/temp/junit4-J1-20170901_144409_3149731896139761099951.syserr
   [junit4] >>> JVM J1 emitted unexpected output (verbatim) ----
   [junit4] Java HotSpot(TM) 64-Bit Server VM warning: Option UseConcMarkSweepGC was deprecated in version 9.0 and will likely be removed in a future release.
   [junit4] <<< JVM J1: EOF ----

[...truncated 3 lines...]
   [junit4] JVM J0: stderr was not empty, see: /home/jenkins/workspace/Lucene-Solr-master-Linux/lucene/build/highlighter/test/temp/junit4-J0-20170901_144409_31413603510284093566851.syserr
   [junit4] >>> JVM J0 emitted unexpected output (verbatim) ----
   [junit4] Java HotSpot(TM) 64-Bit Server VM warning: Option UseConcMarkSweepGC was deprecated in version 9.0 and will likely be removed in a future release.
   [junit4] <<< JVM J0: EOF ----

[...truncated 160 lines...]
   [junit4] JVM J2: stderr was not empty, see: /home/jenkins/workspace/Lucene-Solr-master-Linux/lucene/build/join/test/temp/junit4-J2-20170901_144425_5416538893430107279235.syserr
   [junit4] >>> JVM J2 emitted unexpected output (verbatim) ----
   [junit4] Java HotSpot(TM) 64-Bit Server VM warning: Option UseConcMarkSweepGC was deprecated in version 9.0 and will likely be removed in a future release.
   [junit4] <<< JVM J2: EOF ----

[...truncated 6 lines...]
   [junit4] JVM J0: stderr was not empty, see: /home/jenkins/workspace/Lucene-Solr-master-Linux/lucene/build/join/test/temp/junit4-J0-20170901_144425_54114442456511110411886.syserr
   [junit4] >>> JVM J0 emitted unexpected output (verbatim) ----
   [junit4] Java HotSpot(TM) 64-Bit Server VM warning: Option UseConcMarkSweepGC was deprecated in version 9.0 and will likely be removed in a future release.
   [junit4] <<< JVM J0: EOF ----

[...truncated 3 lines...]
   [junit4] JVM J1: stderr was not empty, see: /home/jenkins/workspace/Lucene-Solr-master-Linux/lucene/build/join/test/temp/junit4-J1-20170901_144425_54117953233283602303951.syserr
   [junit4] >>> JVM J1 emitted unexpected output (verbatim) ----
   [junit4] Java HotSpot(TM) 64-Bit Server VM warning: Option UseConcMarkSweepGC was deprecated in version 9.0 and will likely be removed in a future release.
   [junit4] <<< JVM J1: EOF ----

[...truncated 149 lines...]
   [junit4] JVM J0: stderr was not empty, see: /home/jenkins/workspace/Lucene-Solr-master-Linux/lucene/build/memory/test/temp/junit4-J0-20170901_144445_65014512465478031802918.syserr
   [junit4] >>> JVM J0 emitted unexpected output (verbatim) ----
   [junit4] Java HotSpot(TM) 64-Bit Server VM warning: Option UseConcMarkSweepGC was deprecated in version 9.0 and will likely be removed in a future release.
   [junit4] <<< JVM J0: EOF ----

[...truncated 3 lines...]
   [junit4] JVM J1: stderr was not empty, see: /home/jenkins/workspace/Lucene-Solr-master-Linux/lucene/build/memory/test/temp/junit4-J1-20170901_144445_65015902601638223712188.syserr
   [junit4] >>> JVM J1 emitted unexpected output (verbatim) ----
   [junit4] Java HotSpot(TM) 64-Bit Server VM warning: Option UseConcMarkSweepGC was deprecated in version 9.0 and will likely be removed in a future release.
   [junit4] <<< JVM J1: EOF ----

[...truncated 174 lines...]
   [junit4] JVM J1: stderr was not empty, see: /home/jenkins/workspace/Lucene-Solr-master-Linux/lucene/build/misc/test/temp/junit4-J1-20170901_144453_7023109246301876095636.syserr
   [junit4] >>> JVM J1 emitted unexpected output (verbatim) ----
   [junit4] Java HotSpot(TM) 64-Bit Server VM warning: Option UseConcMarkSweepGC was deprecated in version 9.0 and will likely be removed in a future release.
   [junit4] <<< JVM J1: EOF ----

[...truncated 3 lines...]
   [junit4] JVM J2: stderr was not empty, see: /home/jenkins/workspace/Lucene-Solr-master-Linux/lucene/build/misc/test/temp/junit4-J2-20170901_144453_7022827418329856790645.syserr
   [junit4] >>> JVM J2 emitted unexpected output (verbatim) ----
   [junit4] Java HotSpot(TM) 64-Bit Server VM warning: Option UseConcMarkSweepGC was deprecated in version 9.0 and will likely be removed in a future release.
   [junit4] <<< JVM J2: EOF ----

[...truncated 9 lines...]
   [junit4] JVM J0: stderr was not empty, see: /home/jenkins/workspace/Lucene-Solr-master-Linux/lucene/build/misc/test/temp/junit4-J0-20170901_144453_70217934712844495954942.syserr
   [junit4] >>> JVM J0 emitted unexpected output (verbatim) ----
   [junit4] Java HotSpot(TM) 64-Bit Server VM warning: Option UseConcMarkSweepGC was deprecated in version 9.0 and will likely be removed in a future release.
   [junit4] <<< JVM J0: EOF ----

[...truncated 312 lines...]
   [junit4] JVM J2: stderr was not empty, see: /home/jenkins/workspace/Lucene-Solr-master-Linux/lucene/build/queries/test/temp/junit4-J2-20170901_144507_8959973270719743181247.syserr
   [junit4] >>> JVM J2 emitted unexpected output (verbatim) ----
   [junit4] Java HotSpot(TM) 64-Bit Server VM warning: Option UseConcMarkSweepGC was deprecated in version 9.0 and will likely be removed in a future release.
   [junit4] <<< JVM J2: EOF ----

[...truncated 6 lines...]
   [junit4] JVM J1: stderr was not empty, see: /home/jenkins/workspace/Lucene-Solr-master-Linux/lucene/build/queries/test/temp/junit4-J1-20170901_144507_8954623272089653297680.syserr
   [junit4] >>> JVM J1 emitted unexpected output (verbatim) ----
   [junit4] Java HotSpot(TM) 64-Bit Server VM warning: Option UseConcMarkSweepGC was deprecated in version 9.0 and will likely be removed in a future release.
   [junit4] <<< JVM J1: EOF ----

   [junit4] JVM J0: stderr was not empty, see: /home/jenkins/workspace/Lucene-Solr-master-Linux/lucene/build/queries/test/temp/junit4-J0-20170901_144507_89511864515452594660099.syserr
   [junit4] >>> JVM J0 emitted unexpected output (verbatim) ----
   [junit4] Java HotSpot(TM) 64-Bit Server VM warning: Option UseConcMarkSweepGC was deprecated in version 9.0 and will likely be removed in a future release.
   [junit4] <<< JVM J0: EOF ----

[...truncated 227 lines...]
   [junit4] JVM J0: stderr was not empty, see: /home/jenkins/workspace/Lucene-Solr-master-Linux/lucene/build/queryparser/test/temp/junit4-J0-20170901_144514_4398256256640821066829.syserr
   [junit4] >>> JVM J0 emitted unexpected output (verbatim) ----
   [junit4] Java HotSpot(TM) 64-Bit Server VM warning: Option UseConcMarkSweepGC was deprecated in version 9.0 and will likely be removed in a future release.
   [junit4] <<< JVM J0: EOF ----

   [junit4] JVM J2: stderr was not empty, see: /home/jenkins/workspace/Lucene-Solr-master-Linux/lucene/build/queryparser/test/temp/junit4-J2-20170901_144514_43911436272084625680719.syserr
   [junit4] >>> JVM J2 emitted unexpected output (verbatim) ----
   [junit4] Java HotSpot(TM) 64-Bit Server VM warning: Option UseConcMarkSweepGC was deprecated in version 9.0 and will likely be removed in a future release.
   [junit4] <<< JVM J2: EOF ----

[...truncated 3 lines...]
   [junit4] JVM J1: stderr was not empty, see: /home/jenkins/workspace/Lucene-Solr-master-Linux/lucene/build/queryparser/test/temp/junit4-J1-20170901_144514_4397931768590897077058.syserr
   [junit4] >>> JVM J1 emitted unexpected output (verbatim) ----
   [junit4] Java HotSpot(TM) 64-Bit Server VM warning: Option UseConcMarkSweepGC was deprecated in version 9.0 and will likely be removed in a future release.
   [junit4] <<< JVM J1: EOF ----

[...truncated 207 lines...]
   [junit4] JVM J1: stderr was not empty, see: /home/jenkins/workspace/Lucene-Solr-master-Linux/lucene/build/replicator/test/temp/junit4-J1-20170901_144520_7161642496547795735920.syserr
   [junit4] >>> JVM J1 emitted unexpected output (verbatim) ----
   [junit4] Java HotSpot(TM) 64-Bit Server VM warning: Option UseConcMarkSweepGC was deprecated in version 9.0 and will likely be removed in a future release.
   [junit4] <<< JVM J1: EOF ----

[...truncated 6 lines...]
   [junit4] JVM J2: stderr was not empty, see: /home/jenkins/workspace/Lucene-Solr-master-Linux/lucene/build/replicator/test/temp/junit4-J2-20170901_144520_7162369843394848972605.syserr
   [junit4] >>> JVM J2 emitted unexpected output (verbatim) ----
   [junit4] Java HotSpot(TM) 64-Bit Server VM warning: Option UseConcMarkSweepGC was deprecated in version 9.0 and will likely be removed in a future release.
   [junit4] <<< JVM J2: EOF ----

   [junit4] JVM J0: stderr was not empty, see: /home/jenkins/workspace/Lucene-Solr-master-Linux/lucene/build/replicator/test/temp/junit4-J0-20170901_144520_71615356681135837070038.syserr
   [junit4] >>> JVM J0 emitted unexpected output (verbatim) ----
   [junit4] Java HotSpot(TM) 64-Bit Server VM warning: Option UseConcMarkSweepGC was deprecated in version 9.0 and will likely be removed in a future release.
   [junit4] <<< JVM J0: EOF ----

[...truncated 205 lines...]
   [junit4] JVM J0: stderr was not empty, see: /home/jenkins/workspace/Lucene-Solr-master-Linux/lucene/build/sandbox/test/temp/junit4-J0-20170901_144531_8114956743965382205411.syserr
   [junit4] >>> JVM J0 emitted unexpected output (verbatim) ----
   [junit4] Java HotSpot(TM) 64-Bit Server VM warning: Option UseConcMarkSweepGC was deprecated in version 9.0 and will likely be removed in a future release.
   [junit4] <<< JVM J0: EOF ----

[...truncated 3 lines...]
   [junit4] JVM J2: stderr was not empty, see: /home/jenkins/workspace/Lucene-Solr-master-Linux/lucene/build/sandbox/test/temp/junit4-J2-20170901_144531_8118421981476947975215.syserr
   [junit4] >>> JVM J2 emitted unexpected output (verbatim) ----
   [junit4] Java HotSpot(TM) 64-Bit Server VM warning: Option UseConcMarkSweepGC was deprecated in version 9.0 and will likely be removed in a future release.
   [junit4] <<< JVM J2: EOF ----

[...truncated 10 lines...]
   [junit4] JVM J1: stderr was not empty, see: /home/jenkins/workspace/Lucene-Solr-master-Linux/lucene/build/sandbox/test/temp/junit4-J1-20170901_144531_81115534256613185644398.syserr
   [junit4] >>> JVM J1 emitted unexpected output (verbatim) ----
   [junit4] Java HotSpot(TM) 64-Bit Server VM warning: Option UseConcMarkSweepGC was deprecated in version 9.0 and will likely be removed in a future release.
   [junit4] <<< JVM J1: EOF ----

[...truncated 215 lines...]
   [junit4] JVM J0: stderr was not empty, see: /home/jenkins/workspace/Lucene-Solr-master-Linux/lucene/build/spatial-extras/test/temp/junit4-J0-20170901_144608_4275895698214951574508.syserr
   [junit4] >>> JVM J0 emitted unexpected output (verbatim) ----
   [junit4] Java HotSpot(TM) 64-Bit Server VM warning: Option UseConcMarkSweepGC was deprecated in version 9.0 and will likely be removed in a future release.
   [junit4] <<< JVM J0: EOF ----

[...truncated 6 lines...]
   [junit4] JVM J2: stderr was not empty, see: /home/jenkins/workspace/Lucene-Solr-master-Linux/lucene/build/spatial-extras/test/temp/junit4-J2-20170901_144608_4273510156643890129707.syserr
   [junit4] >>> JVM J2 emitted unexpected output (verbatim) ----
   [junit4] Java HotSpot(TM) 64-Bit Server VM warning: Option UseConcMarkSweepGC was deprecated in version 9.0 and will likely be removed in a future release.
   [junit4] <<< JVM J2: EOF ----

   [junit4] JVM J1: stderr was not empty, see: /home/jenkins/workspace/Lucene-Solr-master-Linux/lucene/build/spatial-extras/test/temp/junit4-J1-20170901_144608_4277137318873700103278.syserr
   [junit4] >>> JVM J1 emitted unexpected output (verbatim) ----
   [junit4] Java HotSpot(TM) 64-Bit Server VM warning: Option UseConcMarkSweepGC was deprecated in version 9.0 and will likely be removed in a future release.
   [junit4] <<< JVM J1: EOF ----

[...truncated 148 lines...]
   [junit4] JVM J0: stderr was not empty, see: /home/jenkins/workspace/Lucene-Solr-master-Linux/lucene/build/spatial/test/temp/junit4-J0-20170901_144620_7543974167874115146027.syserr
   [junit4] >>> JVM J0 emitted unexpected output (verbatim) ----
   [junit4] Java HotSpot(TM) 64-Bit Server VM warning: Option UseConcMarkSweepGC was deprecated in version 9.0 and will likely be removed in a future release.
   [junit4] <<< JVM J0: EOF ----

[...truncated 174 lines...]
   [junit4] JVM J2: stderr was not empty, see: /home/jenkins/workspace/Lucene-Solr-master-Linux/lucene/build/spatial3d/test/temp/junit4-J2-20170901_144622_61715612506233378246154.syserr
   [junit4] >>> JVM J2 emitted unexpected output (verbatim) ----
   [junit4] Java HotSpot(TM) 64-Bit Server VM warning: Option UseConcMarkSweepGC was deprecated in version 9.0 and will likely be removed in a future release.
   [junit4] <<< JVM J2: EOF ----

[...truncated 3 lines...]
   [junit4] JVM J0: stderr was not empty, see: /home/jenkins/workspace/Lucene-Solr-master-Linux/lucene/build/spatial3d/test/temp/junit4-J0-20170901_144622_61716237739836618375623.syserr
   [junit4] >>> JVM J0 emitted unexpected output (verbatim) ----
   [junit4] Java HotSpot(TM) 64-Bit Server VM warning: Option UseConcMarkSweepGC was deprecated in version 9.0 and will likely be removed in a future release.
   [junit4] <<< JVM J0: EOF ----

[...truncated 5 lines...]
   [junit4] JVM J1: stderr was not empty, see: /home/jenkins/workspace/Lucene-Solr-master-Linux/lucene/build/spatial3d/test/temp/junit4-J1-20170901_144622_61715945394758914521778.syserr
   [junit4] >>> JVM J1 emitted unexpected output (verbatim) ----
   [junit4] Java HotSpot(TM) 64-Bit Server VM warning: Option UseConcMarkSweepGC was deprecated in version 9.0 and will likely be removed in a future release.
   [junit4] <<< JVM J1: EOF ----

[...truncated 250 lines...]
   [junit4] JVM J0: stderr was not empty, see: /home/jenkins/workspace/Lucene-Solr-master-Linux/lucene/build/suggest/test/temp/junit4-J0-20170901_144725_30412406599173883354795.syserr
   [junit4] >>> JVM J0 emitted unexpected output (verbatim) ----
   [junit4] Java HotSpot(TM) 64-Bit Server VM warning: Option UseConcMarkSweepGC was deprecated in version 9.0 and will likely be removed in a future release.
   [junit4] <<< JVM J0: EOF ----

[...truncated 3 lines...]
   [junit4] JVM J1: stderr was not empty, see: /home/jenkins/workspace/Lucene-Solr-master-Linux/lucene/build/suggest/test/temp/junit4-J1-20170901_144725_30417609029897273539281.syserr
   [junit4] >>> JVM J1 emitted unexpected output (verbatim) ----
   [junit4] Java HotSpot(TM) 64-Bit Server VM warning: Option UseConcMarkSweepGC was deprecated in version 9.0 and will likely be removed in a future release.
   [junit4] <<< JVM J1: EOF ----

[...truncated 3 lines...]
   [junit4] JVM J2: stderr was not empty, see: /home/jenkins/workspace/Lucene-Solr-master-Linux/lucene/build/suggest/test/temp/junit4-J2-20170901_144725_30417104343560903302598.syserr
   [junit4] >>> JVM J2 emitted unexpected output (verbatim) ----
   [junit4] Java HotSpot(TM) 64-Bit Server VM warning: Option UseConcMarkSweepGC was deprecated in version 9.0 and will likely be removed in a future release.
   [junit4] <<< JVM J2: EOF ----

[...truncated 2431 lines...]
   [junit4] Suite: org.apache.solr.search.QueryEqualityTest
   [junit4]   2> Creating dataDir: /home/jenkins/workspace/Lucene-Solr-master-Linux/solr/build/solr-core/test/J2/temp/solr.search.QueryEqualityTest_D8E4083C710F8437-001/init-core-data-001
   [junit4]   2> 1315593 WARN  (SUITE-QueryEqualityTest-seed#[D8E4083C710F8437]-worker) [    ] o.a.s.SolrTestCaseJ4 startTrackingSearchers: numOpens=7 numCloses=7
   [junit4]   2> 1315593 INFO  (SUITE-QueryEqualityTest-seed#[D8E4083C710F8437]-worker) [    ] o.a.s.SolrTestCaseJ4 Using PointFields (NUMERIC_POINTS_SYSPROP=true) w/NUMERIC_DOCVALUES_SYSPROP=false
   [junit4]   2> 1315593 INFO  (SUITE-QueryEqualityTest-seed#[D8E4083C710F8437]-worker) [    ] o.a.s.SolrTestCaseJ4 Randomized ssl (true) and clientAuth (false) via: @org.apache.solr.util.RandomizeSSL(reason="", value=0.0/0.0, ssl=0.0/0.0, clientAuth=0.0/0.0)
   [junit4]   2> 1315594 INFO  (SUITE-QueryEqualityTest-seed#[D8E4083C710F8437]-worker) [    ] o.a.s.SolrTestCaseJ4 SecureRandom sanity checks: test.solr.allowed.securerandom=null & java.security.egd=file:/dev/./urandom
   [junit4]   2> 1315594 INFO  (SUITE-QueryEqualityTest-seed#[D8E4083C710F8437]-worker) [    ] o.a.s.SolrTestCaseJ4 ####initCore
   [junit4]   2> 1315594 INFO  (SUITE-QueryEqualityTest-seed#[D8E4083C710F8437]-worker) [    ] o.a.s.c.SolrResourceLoader [null] Added 2 libs to classloader, from paths: [/home/jenkins/workspace/Lucene-Solr-master-Linux/solr/core/src/test-files/solr/collection1/lib, /home/jenkins/workspace/Lucene-Solr-master-Linux/solr/core/src/test-files/solr/collection1/lib/classes]
   [junit4]   2> 1315609 INFO  (SUITE-QueryEqualityTest-seed#[D8E4083C710F8437]-worker) [    ] o.a.s.c.SolrConfig Using Lucene MatchVersion: 8.0.0
   [junit4]   2> 1315627 INFO  (SUITE-QueryEqualityTest-seed#[D8E4083C710F8437]-worker) [    ] o.a.s.s.IndexSchema [null] Schema name=test
   [junit4]   2> 1315675 INFO  (SUITE-QueryEqualityTest-seed#[D8E4083C710F8437]-worker) [    ] o.a.s.s.IndexSchema Loaded schema test/1.6 with uniqueid field id
   [junit4]   2> 1315705 INFO  (SUITE-QueryEqualityTest-seed#[D8E4083C710F8437]-worker) [    ] o.a.s.m.r.SolrJmxReporter JMX monitoring for 'solr.node' (registry 'solr.node') enabled at server: com.sun.jmx.mbeanserver.JmxMBeanServer@6d3fd93c
   [junit4]   2> 1315711 INFO  (SUITE-QueryEqualityTest-seed#[D8E4083C710F8437]-worker) [    ] o.a.s.m.r.SolrJmxReporter JMX monitoring for 'solr.jvm' (registry 'solr.jvm') enabled at server: com.sun.jmx.mbeanserver.JmxMBeanServer@6d3fd93c
   [junit4]   2> 1315712 INFO  (SUITE-QueryEqualityTest-seed#[D8E4083C710F8437]-worker) [    ] o.a.s.m.r.SolrJmxReporter JMX monitoring for 'solr.jetty' (registry 'solr.jetty') enabled at server: com.sun.jmx.mbeanserver.JmxMBeanServer@6d3fd93c
   [junit4]   2> 1315713 INFO  (coreLoadExecutor-4142-thread-1) [    ] o.a.s.c.SolrResourceLoader [null] Added 2 libs to classloader, from paths: [/home/jenkins/workspace/Lucene-Solr-master-Linux/solr/core/src/test-files/solr/collection1/lib, /home/jenkins/workspace/Lucene-Solr-master-Linux/solr/core/src/test-files/solr/collection1/lib/classes]
   [junit4]   2> 1315729 INFO  (coreLoadExecutor-4142-thread-1) [    ] o.a.s.c.SolrConfig Using Lucene MatchVersion: 8.0.0
   [junit4]   2> 1315744 INFO  (coreLoadExecutor-4142-thread-1) [    ] o.a.s.s.IndexSchema [collection1] Schema name=test
   [junit4]   2> 1315798 INFO  (coreLoadExecutor-4142-thread-1) [    ] o.a.s.s.IndexSchema Loaded schema test/1.6 with uniqueid field id
   [junit4]   2> 1315803 INFO  (coreLoadExecutor-4142-thread-1) [    ] o.a.s.c.CoreContainer Creating SolrCore 'collection1' using configuration from instancedir /home/jenkins/workspace/Lucene-Solr-master-Linux/solr/core/src/test-files/solr/collection1, trusted=true
   [junit4]   2> 1315804 INFO  (coreLoadExecutor-4142-thread-1) [    ] o.a.s.m.r.SolrJmxReporter JMX monitoring for 'solr.core.collection1' (registry 'solr.core.collection1') enabled at server: com.sun.jmx.mbeanserver.JmxMBeanServer@6d3fd93c
   [junit4]   2> 1315804 INFO  (coreLoadExecutor-4142-thread-1) [    ] o.a.s.c.SolrCore solr.RecoveryStrategy.Builder
   [junit4]   2> 1315804 INFO  (coreLoadExecutor-4142-thread-1) [    ] o.a.s.c.SolrCore [[collection1] ] Opening new SolrCore at [/home/jenkins/workspace/Lucene-Solr-master-Linux/solr/core/src/test-files/solr/collection1], dataDir=[/home/jenkins/workspace/Lucene-Solr-master-Linux/solr/build/solr-core/test/J2/temp/solr.search.QueryEqualityTest_D8E4083C710F8437-001/init-core-data-001/]
   [junit4]   2> 1315806 INFO  (coreLoadExecutor-4142-thread-1) [    ] o.a.s.u.RandomMergePolicy RandomMergePolicy wrapping class org.apache.lucene.index.LogByteSizeMergePolicy: [LogByteSizeMergePolicy: minMergeSize=1677721, mergeFactor=30, maxMergeSize=2147483648, maxMergeSizeForForcedMerge=9223372036854775807, calibrateSizeByDeletes=true, maxMergeDocs=2147483647, maxCFSSegmentSizeMB=8.796093022207999E12, noCFSRatio=0.7951169798476325]
   [junit4]   2> 1315852 INFO  (coreLoadExecutor-4142-thread-1) [    ] o.a.s.u.UpdateHandler Using UpdateLog implementation: org.apache.solr.update.UpdateLog
   [junit4]   2> 1315852 INFO  (coreLoadExecutor-4142-thread-1) [    ] o.a.s.u.UpdateLog Initializing UpdateLog: dataDir= defaultSyncLevel=FLUSH numRecordsToKeep=100 maxNumLogsToKeep=10 numVersionBuckets=65536
   [junit4]   2> 1315852 INFO  (coreLoadExecutor-4142-thread-1) [    ] o.a.s.u.CommitTracker Hard AutoCommit: disabled
   [junit4]   2> 1315852 INFO  (coreLoadExecutor-4142-thread-1) [    ] o.a.s.u.CommitTracker Soft AutoCommit: disabled
   [junit4]   2> 1315853 INFO  (coreLoadExecutor-4142-thread-1) [    ] o.a.s.u.RandomMergePolicy RandomMergePolicy wrapping class org.apache.lucene.index.LogDocMergePolicy: [LogDocMergePolicy: minMergeSize=1000, mergeFactor=23, maxMergeSize=9223372036854775807, maxMergeSizeForForcedMerge=9223372036854775807, calibrateSizeByDeletes=false, maxMergeDocs=2147483647, maxCFSSegmentSizeMB=8.796093022207999E12, noCFSRatio=1.0]
   [junit4]   2> 1315853 INFO  (coreLoadExecutor-4142-thread-1) [    ] o.a.s.s.SolrIndexSearcher Opening [Searcher@13604cc9[collection1] main]
   [junit4]   2> 1315854 INFO  (coreLoadExecutor-4142-thread-1) [    ] o.a.s.h.c.SpellCheckComponent Initializing spell checkers
   [junit4]   2> 1315872 INFO  (coreLoadExecutor-4142-thread-1) [    ] o.a.s.s.DirectSolrSpellChecker init: {name=direct,classname=DirectSolrSpellChecker,field=lowerfilt,minQueryLength=3}
   [junit4]   2> 1315927 INFO  (coreLoadExecutor-4142-thread-1) [    ] o.a.s.h.ReplicationHandler Commits will be reserved for  10000
   [junit4]   2> 1315927 INFO  (searcherExecutor-4143-thread-1) [    ] o.a.s.h.c.SpellCheckComponent Loading spell index for spellchecker: default
   [junit4]   2> 1315927 INFO  (coreLoadExecutor-4142-thread-1) [    ] o.a.s.u.UpdateLog Could not find max version in index or recent updates, using new clock 1577350452406648832
   [junit4]   2> 1315928 INFO  (searcherExecutor-4143-thread-1) [    ] o.a.s.h.c.SpellCheckComponent Loading spell index for spellchecker: direct
   [junit4]   2> 1315928 INFO  (searcherExecutor-4143-thread-1) [    ] o.a.s.h.c.SpellCheckComponent Loading spell index for spellchecker: wordbreak
   [junit4]   2> 1315928 INFO  (searcherExecutor-4143-thread-1) [    ] o.a.s.h.c.SpellCheckComponent Loading spell index for spellchecker: multipleFields
   [junit4]   2> 1315928 INFO  (searcherExecutor-4143-thread-1) [    ] o.a.s.h.c.SpellCheckComponent Loading spell index for spellchecker: jarowinkler
   [junit4]   2> 1315928 INFO  (searcherExecutor-4143-thread-1) [    ] o.a.s.h.c.SpellCheckComponent Loading spell index for spellchecker: external
   [junit4]   2> 1315928 INFO  (searcherExecutor-4143-thread-1) [    ] o.a.s.h.c.SpellCheckComponent Loading spell index for spellchecker: freq
   [junit4]   2> 1315929 INFO  (searcherExecutor-4143-thread-1) [    ] o.a.s.h.c.SpellCheckComponent Loading spell index for spellchecker: fqcn
   [junit4]   2> 1315929 INFO  (searcherExecutor-4143-thread-1) [    ] o.a.s.h.c.SpellCheckComponent Loading spell index for spellchecker: perDict
   [junit4]   2> 1315930 INFO  (SUITE-QueryEqualityTest-seed#[D8E4083C710F8437]-worker) [    ] o.a.s.SolrTestCaseJ4 ####initCore end
   [junit4]   2> 1315930 INFO  (searcherExecutor-4143-thread-1) [    ] o.a.s.c.SolrCore [collection1] Registered new searcher Searcher@13604cc9[collection1] main{ExitableDirectoryReader(UninvertingDirectoryReader())}
   [junit4]   2> 1315931 INFO  (TEST-QueryEqualityTest.testFuncNorm-seed#[D8E4083C710F8437]) [    ] o.a.s.SolrTestCaseJ4 ###Starting testFuncNorm
   [junit4]   2> 1315932 INFO  (TEST-QueryEqualityTest.testFuncNorm-seed#[D8E4083C710F8437]) [    ] o.a.s.SolrTestCaseJ4 ###Ending testFuncNorm
   [junit4]   2> 1315933 INFO  (TEST-QueryEqualityTest.testQueryLucenePlusSort-seed#[D8E4083C710F8437]) [    ] o.a.s.SolrTestCaseJ4 ###Starting testQueryLucenePlusSort
   [junit4]   2> 1315934 INFO  (TEST-QueryEqualityTest.testQueryLucenePlusSort-seed#[D8E4083C710F8437]) [    ] o.a.s.SolrTestCaseJ4 ###Ending testQueryLucenePlusSort
   [junit4]   2> 1315936 INFO  (TEST-QueryEqualityTest.testFuncDoubleValueBools-seed#[D8E4083C710F8437]) [    ] o.a.s.SolrTestCaseJ4 ###Starting testFuncDoubleValueBools
   [junit4]   2> 1315938 INFO  (TEST-QueryEqualityTest.testFuncDoubleValueBools-seed#[D8E4083C710F8437]) [    ] o.a.s.SolrTestCaseJ4 ###Ending testFuncDoubleValueBools
   [junit4]   2> 1315939 INFO  (TEST-QueryEqualityTest.testQueryFunc-seed#[D8E4083C710F8437]) [    ] o.a.s.SolrTestCaseJ4 ###Starting testQueryFunc
   [junit4]   2> 1315940 INFO  (TEST-QueryEqualityTest.testQueryFunc-seed#[D8E4083C710F8437]) [    ] o.a.s.SolrTestCaseJ4 ###Ending testQueryFunc
   [junit4]   2> 1315941 INFO  (TEST-QueryEqualityTest.testFuncBools-seed#[D8E4083C710F8437]) [    ] o.a.s.SolrTestCaseJ4 ###Starting testFuncBools
   [junit4]   2> 1315941 INFO  (TEST-QueryEqualityTest.testFuncBools-seed#[D8E4083C710F8437]) [    ] o.a.s.SolrTestCaseJ4 ###Ending testFuncBools
   [junit4]   2> 1315942 INFO  (TEST-QueryEqualityTest.testFuncDef-seed#[D8E4083C710F8437]) [    ] o.a.s.SolrTestCaseJ4 ###Starting testFuncDef
   [junit4]   2> 1315943 INFO  (TEST-QueryEqualityTest.testFuncDef-seed#[D8E4083C710F8437]) [    ] o.a.s.SolrTestCaseJ4 ###Ending testFuncDef
   [junit4]   2> 1315944 INFO  (TEST-QueryEqualityTest.testField-seed#[D8E4083C710F8437]) [    ] o.a.s.SolrTestCaseJ4 ###Starting testField
   [junit4]   2> 1315945 INFO  (TEST-QueryEqualityTest.testField-seed#[D8E4083C710F8437]) [    ] o.a.s.SolrTestCaseJ4 ###Ending testField
   [junit4]   2> 1315946 INFO  (TEST-QueryEqualityTest.testQueryLucene-seed#[D8E4083C710F8437]) [    ] o.a.s.SolrTestCaseJ4 ###Starting testQueryLucene
   [junit4]   2> 1315946 INFO  (TEST-QueryEqualityTest.testQueryLucene-seed#[D8E4083C710F8437]) [    ] o.a.s.SolrTestCaseJ4 ###Ending testQueryLucene
   [junit4]   2> 1315947 INFO  (TEST-QueryEqualityTest.testQueryCollapse-seed#[D8E4083C710F8437]) [    ] o.a.s.SolrTestCaseJ4 ###Starting testQueryCollapse
   [junit4]   2> 1315950 INFO  (TEST-QueryEqualityTest.testQueryCollapse-seed#[D8E4083C710F8437]) [    ] o.a.s.SolrTestCaseJ4 ###Ending testQueryCollapse
   [junit4]   2> 1315951 INFO  (TEST-QueryEqualityTest.testFuncVector-seed#[D8E4083C710F8437]) [    ] o.a.s.SolrTestCaseJ4 ###Starting testFuncVector
   [junit4]   2> 1315953 INFO  (TEST-QueryEqualityTest.testFuncVector-seed#[D8E4083C710F8437]) [    ] o.a.s.SolrTestCaseJ4 ###Ending testFuncVector
   [junit4]   2> 1315954 INFO  (TEST-QueryEqualityTest.testQueryGeofilt-seed#[D8E4083C710F8437]) [    ] o.a.s.SolrTestCaseJ4 ###Starting testQueryGeofilt
   [junit4]   2> 1315959 INFO  (TEST-QueryEqualityTest.testQueryGeofilt-seed#[D8E4083C710F8437]) [    ] o.a.s.SolrTestCaseJ4 ###Ending testQueryGeofilt
   [junit4]   2> 1315960 INFO  (TEST-QueryEqualityTest.testQueryScoreJoin-seed#[D8E4083C710F8437]) [    ] o.a.s.SolrTestCaseJ4 ###Starting testQueryScoreJoin
   [junit4]   2> 1315960 INFO  (TEST-QueryEqualityTest.testQueryScoreJoin-seed#[D8E4083C710F8437]) [    ] o.a.s.SolrTestCaseJ4 ###Ending testQueryScoreJoin
   [junit4]   2> 1315962 INFO  (TEST-QueryEqualityTest.testFuncMod-seed#[D8E4083C710F8437]) [    ] o.a.s.SolrTestCaseJ4 ###Starting testFuncMod
   [junit4]   2> 1315962 INFO  (TEST-QueryEqualityTest.testFuncMod-seed#[D8E4083C710F8437]) [    ] o.a.s.SolrTestCaseJ4 ###Ending testFuncMod
   [junit4]   2> 1315963 INFO  (TEST-QueryEqualityTest.testPayloadFunction-seed#[D8E4083C710F8437]) [    ] o.a.s.SolrTestCaseJ4 ###Starting testPayloadFunction
   [junit4]   2> 1315967 INFO  (TEST-QueryEqualityTest.testPayloadFunction-seed#[D8E4083C710F8437]) [    ] o.a.s.SolrTestCaseJ4 ###Ending testPayloadFunction
   [junit4]   2> 1315969 INFO  (TEST-QueryEqualityTest.testFuncMathConsts-seed#[D8E4083C710F8437]) [    ] o.a.s.SolrTestCaseJ4 ###Starting testFuncMathConsts
   [junit4]   2> 1315969 INFO  (TEST-QueryEqualityTest.testFuncMathConsts-seed#[D8E4083C710F8437]) [    ] o.a.s.SolrTestCaseJ4 ###Ending testFuncMathConsts
   [junit4]   2> 1315971 INFO  (TEST-QueryEqualityTest.testFuncOrd-seed#[D8E4083C710F8437]) [    ] o.a.s.SolrTestCaseJ4 ###Starting testFuncOrd
   [junit4]   2> 1315972 INFO  (TEST-QueryEqualityTest.testFuncOrd-seed#[D8E4083C710F8437]) [    ] o.a.s.SolrTestCaseJ4 ###Ending testFuncOrd
   [junit4]   2> 1315973 INFO  (TEST-QueryEqualityTest.testFuncSqedist-seed#[D8E4083C710F8437]) [    ] o.a.s.SolrTestCaseJ4 ###Starting testFuncSqedist
   [junit4]   2> 1315974 INFO  (TEST-QueryEqualityTest.testFuncSqedist-seed#[D8E4083C710F8437]) [    ] o.a.s.SolrTestCaseJ4 ###Ending testFuncSqedist
   [junit4]   2> 1315975 INFO  (TEST-QueryEqualityTest.testFuncField-seed#[D8E4083C710F8437]) [    ] o.a.s.SolrTestCaseJ4 ###Starting testFuncField
   [junit4]   2> 1315976 INFO  (TEST-QueryEqualityTest.testFuncField-seed#[D8E4083C710F8437]) [    ] o.a.s.SolrTestCaseJ4 ###Ending testFuncField
   [junit4]   2> 1315977 INFO  (TEST-QueryEqualityTest.testGraphQuery-seed#[D8E4083C710F8437]) [    ] o.a.s.SolrTestCaseJ4 ###Starting testGraphQuery
   [junit4]   2> 1315981 INFO  (TEST-QueryEqualityTest.testGraphQuery-seed#[D8E4083C710F8437]) [    ] o.a.s.SolrTestCaseJ4 ###Ending testGraphQuery
   [junit4]   2> 1315983 INFO  (TEST-QueryEqualityTest.testQueryPrefix-seed#[D8E4083C710F8437]) [    ] o.a.s.SolrTestCaseJ4 ###Starting testQueryPrefix
   [junit4]   2> 1315986 INFO  (TEST-QueryEqualityTest.testQueryPrefix-seed#[D8E4083C710F8437]) [    ] o.a.s.SolrTestCaseJ4 ###Ending testQueryPrefix
   [junit4]   2> 1315987 INFO  (TEST-QueryEqualityTest.testFuncGhhsin-seed#[D8E4083C710F8437]) [    ] o.a.s.SolrTestCaseJ4 ###Starting testFuncGhhsin
   [junit4]   2> 1315988 INFO  (TEST-QueryEqualityTest.testFuncGhhsin-seed#[D8E4083C710F8437]) [    ] o.a.s.SolrTestCaseJ4 ###Ending testFuncGhhsin
   [junit4]   2> 1315989 INFO  (TEST-QueryEqualityTest.testFuncJoindf-seed#[D8E4083C710F8437]) [    ] o.a.s.SolrTestCaseJ4 ###Starting testFuncJoindf
   [junit4]   2> 1315989 INFO  (TEST-QueryEqualityTest.testFuncJoindf-seed#[D8E4083C710F8437]) [    ] o.a.s.SolrTestCaseJ4 ###Ending testFuncJoindf
   [junit4]   2> 1315990 INFO  (TEST-QueryEqualityTest.testFuncDoubleValueMathFuncs-seed#[D8E4083C710F8437]) [    ] o.a.s.SolrTestCaseJ4 ###Starting testFuncDoubleValueMathFuncs
   [junit4]   2> 1315992 INFO  (TEST-QueryEqualityTest.testFuncDoubleValueMathFuncs-seed#[D8E4083C710F8437]) [    ] o.a.s.SolrTestCaseJ4 ###Ending testFuncDoubleValueMathFuncs
   [junit4]   2> 1315993 INFO  (TEST-QueryEqualityTest.testQueryJoin-seed#[D8E4083C710F8437]) [    ] o.a.s.SolrTestCaseJ4 ###Starting testQueryJoin
   [junit4]   2> 1315995 INFO  (TEST-QueryEqualityTest.testQueryJoin-seed#[D8E4083C710F8437]) [    ] o.a.s.SolrTestCaseJ4 ###Ending testQueryJoin
   [junit4]   2> 1315997 INFO  (TEST-QueryEqualityTest.testFuncDiv-seed#[D8E4083C710F8437]) [    ] o.a.s.SolrTestCaseJ4 ###Starting testFuncDiv
   [junit4]   2> 1315997 INFO  (TEST-QueryEqualityTest.testFuncDiv-seed#[D8E4083C710F8437]) [    ] o.a.s.SolrTestCaseJ4 ###Ending testFuncDiv
   [junit4]   2> 1315998 INFO  (TEST-QueryEqualityTest.testQuerySurround-seed#[D8E4083C710F8437]) [    ] o.a.s.SolrTestCaseJ4 ###Starting testQuerySurround
   [junit4]   2> 1316012 INFO  (TEST-QueryEqualityTest.testQuerySurround-seed#[D8E4083C710F8437]) [    ] o.a.s.SolrTestCaseJ4 ###Ending testQuerySurround
   [junit4]   2> 1316013 INFO  (TEST-QueryEqualityTest.testFuncBoost-seed#[D8E4083C710F8437]) [    ] o.a.s.SolrTestCaseJ4 ###Starting testFuncBoost
   [junit4]   2> 1316014 INFO  (TEST-QueryEqualityTest.testFuncBoost-seed#[D8E4083C710F8437]) [    ] o.a.s.SolrTestCaseJ4 ###Ending testFuncBoost
   [junit4]   2> 1316015 INFO  (TEST-QueryEqualityTest.testFuncStrdist-seed#[D8E4083C710F8437]) [    ] o.a.s.SolrTestCaseJ4 ###Starting testFuncStrdist
   [junit4]   2> 1316016 INFO  (TEST-QueryEqualityTest.testFuncStrdist-seed#[D8E4083C710F8437]) [    ] o.a.s.SolrTestCaseJ4 ###Ending testFuncStrdist
   [junit4]   2> 1316017 INFO  (TEST-QueryEqualityTest.testFuncConcat-seed#[D8E4083C710F8437]) [    ] o.a.s.SolrTestCaseJ4 ###Starting testFuncConcat
   [junit4]   2> 1316021 INFO  (TEST-QueryEqualityTest.testFuncConcat-seed#[D8E4083C710F8437]) [    ] o.a.s.SolrTestCaseJ4 ###Ending testFuncConcat
   [junit4]   2> 1316022 INFO  (TEST-QueryEqualityTest.testAggs-seed#[D8E4083C710F8437]) [    ] o.a.s.SolrTestCaseJ4 ###Starting testAggs
   [junit4]   2> 1316031 INFO  (TEST-QueryEqualityTest.testAggs-seed#[D8E4083C710F8437]) [    ] o.a.s.SolrTestCaseJ4 ###Ending testAggs
   [junit4]   2> 1316032 INFO  (TEST-QueryEqualityTest.testQueryBoost-seed#[D8E4083C710F8437]) [    ] o.a.s.SolrTestCaseJ4 ###Starting testQueryBoost
   [junit4]   2> 1316033 INFO  (TEST-QueryEqualityTest.testQueryBoost-seed#[D8E4083C710F8437]) [    ] o.a.s.SolrTestCaseJ4 ###Ending testQueryBoost
   [junit4]   2> 1316035 INFO  (TEST-QueryEqualityTest.testQuerySimple-seed#[D8E4083C710F8437]) [    ] o.a.s.SolrTestCaseJ4 ###Starting testQuerySimple
   [junit4]   2> 1316038 INFO  (TEST-QueryEqualityTest.testQuerySimple-seed#[D8E4083C710F8437]) [    ] o.a.s.SolrTestCaseJ4 ###Ending testQuerySimple
   [junit4]   2> 1316039 INFO  (TEST-QueryEqualityTest.testChildField-seed#[D8E4083C710F8437]) [    ] o.a.s.SolrTestCaseJ4 ###Starting testChildField
   [junit4]   2> 1316043 INFO  (TEST-QueryEqualityTest.testChildField-seed#[D8E4083C710F8437]) [    ] o.a.s.SolrTestCaseJ4 ###Ending testChildField
   [junit4]   2> 1316044 INFO  (TEST-QueryEqualityTest.testQueryNested-seed#[D8E4083C710F8437]) [    ] o.a.s.SolrTestCaseJ4 ###Starting testQueryNested
   [junit4]   2> 1316044 INFO  (TEST-QueryEqualityTest.testQueryNested-seed#[D8E4083C710F8437]) [    ] o.a.s.SolrTestCaseJ4 ###Ending testQueryNested
   [junit4]   2> 1316045 INFO  (TEST-QueryEqualityTest.testSignificantTermsQuery-seed#[D8E4083C710F8437]) [    ] o.a.s.SolrTestCaseJ4 ###Starting testSignificantTermsQuery
   [junit4]   2> 1316047 INFO  (TEST-QueryEqualityTest.testSignificantTermsQuery-seed#[D8E4083C710F8437]) [    ] o.a.s.SolrTestCaseJ4 ###Ending testSignificantTermsQuery
   [junit4]   2> 1316048 INFO  (TEST-QueryEqualityTest.testFuncMs-seed#[D8E4083C710F8437]) [    ] o.a.s.SolrTestCaseJ4 ###Starting testFuncMs
   [junit4]   2> 1316049 INFO  (TEST-QueryEqualityTest.testFuncMs-seed#[D8E4083C710F8437]) [    ] o.a.s.SolrTestCaseJ4 ###Ending testFuncMs
   [junit4]   2> 1316050 INFO  (TEST-QueryEqualityTest.testQueryFrange-seed#[D8E4083C710F8437]) [    ] o.a.s.SolrTestCaseJ4 ###Starting testQueryFrange
   [junit4]   2> 1316050 INFO  (TEST-QueryEqualityTest.testQueryFrange-seed#[D8E4083C710F8437]) [    ] o.a.s.SolrTestCaseJ4 ###Ending testQueryFrange
   [junit4]   2> 1316051 INFO  (TEST-QueryEqualityTest.testFuncSum-seed#[D8E4083C710F8437]) [    ] o.a.s.SolrTestCaseJ4 ###Starting testFuncSum
   [junit4]   2> 1316052 INFO  (TEST-QueryEqualityTest.testFuncSum-seed#[D8E4083C710F8437]) [    ] o.a.s.SolrTestCaseJ4 ###Ending testFuncSum
   [junit4]   2> 1316053 INFO  (TEST-QueryEqualityTest.testFuncSingleValueMathFuncs-seed#[D8E4083C710F8437]) [    ] o.a.s.SolrTestCaseJ4 ###Starting testFuncSingleValueMathFuncs
   [junit4]   2> 1316055 INFO  (TEST-QueryEqualityTest.testFuncSingleValueMathFuncs-seed#[D8E4083C710F8437]) [    ] o.a.s.SolrTestCaseJ4 ###Ending testFuncSingleValueMathFuncs
   [junit4]   2> 1316058 INFO  (TEST-QueryEqualityTest.testLocalParamsWithRepeatingParam-seed#[D8E4083C710F8437]) [    ] o.a.s.SolrTestCaseJ4 ###Starting testLocalParamsWithRepeatingParam
   [junit4]   2> 1316060 INFO  (TEST-QueryEqualityTest.testLocalParamsWithRepeatingParam-seed#[D8E4083C710F8437]) [    ] o.a.s.SolrTestCaseJ4 ###Ending testLocalParamsWithRepeatingParam
   [junit4]   2> 1316061 INFO  (TEST-QueryEqualityTest.testQueryMLT-seed#[D8E4083C710F8437]) [    ] o.a.s.SolrTestCaseJ4 ###Starting testQueryMLT
   [junit4]   2> 1316062 INFO  (TEST-QueryEqualityTest.testQueryMLT-seed#[D8E4083C710F8437]) [    ] o.a.s.u.p.LogUpdateProcessorFactory [collection1]  webapp=null path=null params={}{add=[1 (1577350452548206592)]} 0 0
   [junit4]   2> 1316064 INFO  (TEST-QueryEqualityTest.testQueryMLT-seed#[D8E4083C710F8437]) [    ] o.a.s.u.DirectUpdateHandler2 start commit{_version_=1577350452550303744,optimize=false,openSearcher=true,waitSearcher=true,expungeDeletes=false,softCommit=false,prepareCommit=false}
   [junit4]   2> 1316064 INFO  (TEST-QueryEqualityTest.testQueryMLT-seed#[D8E4083C710F8437]) [    ] o.a.s.u.SolrIndexWriter Calling setCommitData with IW:org.apache.solr.update.SolrIndexWriter@53119262 commitCommandVersion:1577350452550303744
   [junit4]   2> 1316066 INFO  (TEST-QueryEqualityTest.testQueryMLT-seed#[D8E4083C710F8437]) [    ] o.a.s.s.SolrIndexSearcher Opening [Searcher@557f2412[collection1] main]
   [junit4]   2> 1316067 INFO  (TEST-QueryEqualityTest.testQueryMLT-seed#[D8E4083C710F8437]) [    ] o.a.s.u.DirectUpdateHandler2 end_commit_flush
   [junit4]   2> 1316068 INFO  (searcherExecutor-4143-thread-1) [    ] o.a.s.c.SolrCore [collection1] Registered new searcher Searcher@557f2412[collection1] main{ExitableDirectoryReader(UninvertingDirectoryReader(Uninverting(_0(8.0.0):c1)))}
   [junit4]   2> 1316068 INFO  (TEST-QueryEqualityTest.testQueryMLT-seed#[D8E4083C710F8437]) [    ] o.a.s.u.p.LogUpdateProcessorFactory [collection1]  webapp=null path=null params={}{commit=} 0 4
   [junit4]   2> 1316070 INFO  (TEST-QueryEqualityTest.testQueryMLT-seed#[D8E4083C710F8437]) [    ] o.a.s.u.DirectUpdateHandler2 start commit{_version_=1577350452556595200,optimize=false,openSearcher=true,waitSearcher=true,expungeDeletes=false,softCommit=false,prepareCommit=false}
   [junit4]   2> 1316070 INFO  (TEST-QueryEqualityTest.testQueryMLT-seed#[D8E4083C710F8437]) [    ] o.a.s.u.DirectUpdateHandler2 No uncommitted changes. Skipping IW.commit.
   [junit4]   2> 1316070 INFO  (TEST-QueryEqualityTest.testQueryMLT-seed#[D8E4083C710F8437]) [    ] o.a.s.u.DirectUpdateHandler2 end_commit_flush
   [junit4]   2> 1316070 INFO  (TEST-QueryEqualityTest.testQueryMLT-seed#[D8E4083C710F8437]) [    ] o.a.s.u.p.LogUpdateProcessorFactory [collection1]  webapp=null path=null params={}{commit=} 0 0
   [junit4]   2> 1316071 INFO  (TEST-QueryEqualityTest.testQueryMLT-seed#[D8E4083C710F8437]) [    ] o.a.s.SolrTestCaseJ4 ###Ending testQueryMLT
   [junit4]   2> 1316072 INFO  (TEST-QueryEqualityTest.testBlockJoin-seed#[D8E4083C710F8437]) [    ] o.a.s.SolrTestCaseJ4 ###Starting testBlockJoin
   [junit4]   2> 1316074 INFO  (TEST-QueryEqualityTest.testBlockJoin-seed#[D8E4083C710F8437]) [    ] o.a.s.SolrTestCaseJ4 ###Ending testBlockJoin
   [junit4]   2> 1316076 INFO  (TEST-QueryEqualityTest.testIGainQuery-seed#[D8E4083C710F8437]) [    ] o.a.s.SolrTestCaseJ4 ###Starting testIGainQuery
   [junit4]   2> 1316077 INFO  (TEST-QueryEqualityTest.testIGainQuery-seed#[D8E4083C710F8437]) [    ] o.a.s.SolrTestCaseJ4 ###Ending testIGainQuery
   [junit4]   2> 1316079 INFO  (TEST-QueryEqualityTest.testFuncLinear-seed#[D8E4083C710F8437]) [    ] o.a.s.SolrTestCaseJ4 ###Starting testFuncLinear
   [junit4]   2> 1316080 INFO  (TEST-QueryEqualityTest.testFuncLinear-seed#[D8E4083C710F8437]) [    ] o.a.s.SolrTestCaseJ4 ###Ending testFuncLinear
   [junit4]   2> 1316082 INFO  (TEST-QueryEqualityTest.testMatchAllDocsQueryXmlParser-seed#[D8E4083C710F8437]) [    ] o.a.s.SolrTestCaseJ4 ###Starting testMatchAllDocsQueryXmlParser
   [junit4]   2> 1316097 INFO  (TEST-QueryEqualityTest.testMatchAllDocsQueryXmlParser-seed#[D8E4083C710F8437]) [    ] o.a.s.SolrTestCaseJ4 ###Ending testMatchAllDocsQueryXmlParser
   [junit4]   2> 1316099 INFO  (TEST-QueryEqualityTest.testGraphTermsQuery-seed#[D8E4083C710F8437]) [    ] o.a.s.SolrTestCaseJ4 ###Starting testGraphTermsQuery
   [junit4]   2> 1316104 INFO  (TEST-QueryEqualityTest.testGraphTermsQuery-seed#[D8E4083C710F8437]) [    ] o.a.s.SolrTestCaseJ4 ###Ending testGraphTermsQuery
   [junit4]   2> 1316106 INFO  (TEST-QueryEqualityTest.testQueryComplexPhrase-seed#[D8E4083C710F8437]) [    ] o.a.s.SolrTestCaseJ4 ###Starting testQueryComplexPhrase
   [junit4]   2> 1316125 INFO  (TEST-QueryEqualityTest.testQueryComplexPhrase-seed#[D8E4083C710F8437]) [    ] o.a.s.SolrTestCaseJ4 ###Ending testQueryComplexPhrase
   [junit4]   2> 1316127 INFO  (TEST-QueryEqualityTest.testFuncTestfunc-seed#[D8E4083C710F8437]) [    ] o.a.s.SolrTestCaseJ4 ###Starting testFuncTestfunc
   [junit4]   2> 1316128 INFO  (TEST-QueryEqualityTest.testFuncTestfunc-seed#[D8E4083C710F8437]) [    ] o.a.s.SolrTestCaseJ4 ###Ending testFuncTestfunc
   [junit4]   2> 1316129 INFO  (TEST-QueryEqualityTest.testFuncDist-seed#[D8E4083C710F8437]) [    ] o.a.s.SolrTestCaseJ4 ###Starting testFuncDist
   [junit4]   2> 1316129 INFO  (TEST-QueryEqualityTest.testFuncDist-seed#[D8E4083C710F8437]) [    ] o.a.s.SolrTestCaseJ4 ###Ending testFuncDist
   [junit4]   2> 1316130 INFO  (TEST-QueryEqualityTest.testFuncCscore-seed#[D8E4083C710F8437]) [    ] o.a.s.SolrTestCaseJ4 ###Starting testFuncCscore
   [junit4]   2> 1316131 INFO  (TEST-QueryEqualityTest.testFuncCscore-seed#[D8E4083C710F8437]) [    ] o.a.s.SolrTestCaseJ4 ###Ending testFuncCscore
   [junit4]   2> 1316133 INFO  (TEST-QueryEqualityTest.testTerms-seed#[D8E4083C710F8437]) [    ] o.a.s.SolrTestCaseJ4 ###Starting testTerms
   [junit4]   2> 1316137 INFO  (TEST-QueryEqualityTest.testTerms-seed#[D8E4083C710F8437]) [    ] o.a.s.SolrTestCaseJ4 ###Ending testTerms
   [junit4]   2> 1316138 INFO  (TEST-QueryEqualityTest.testFuncTerms-seed#[D8E4083C710F8437]) [    ] o.a.s.SolrTestCaseJ4 ###Starting testFuncTerms
   [junit4]   2> 1316144 INFO  (TEST-QueryEqualityTest.testFuncTerms-seed#[D8E4083C710F8437]) [    ] o.a.s.SolrTestCaseJ4 ###Ending testFuncTerms
   [junit4]   2> 1316146 INFO  (TEST-QueryEqualityTest.testQueryDismax-seed#[D8E4083C710F8437]) [    ] o.a.s.SolrTestCaseJ4 ###Starting testQueryDismax
   [junit4]   2> 1316158 INFO  (TEST-QueryEqualityTest.testQueryDismax-seed#[D8E4083C710F8437]) [    ] o.a.s.SolrTestCaseJ4 ###Ending testQueryDismax
   [junit4]   2> 1316159 INFO  (TEST-QueryEqualityTest.testParserCoverage-seed#[D8E4083C710F8437]) [    ] o.a.s.SolrTestCaseJ4 ###Starting testParserCoverage
   [junit4]   2> 1316159 INFO  (TEST-QueryEqualityTest.testParserCoverage-seed#[D8E4083C710F8437]) [    ] o.a.s.SolrTestCaseJ4 ###Ending testParserCoverage
   [junit4]   2> 1316160 INFO  (TEST-QueryEqualityTest.testFuncMap-seed#[D8E4083C710F8437]) [    ] o.a.s.SolrTestCaseJ4 ###Starting testFuncMap
   [junit4]   2> 1316161 INFO  (TEST-QueryEqualityTest.testFuncMap-seed#[D8E4083C710F8437]) [    ] o.a.s.SolrTestCaseJ4 ###Ending testFuncMap
   [junit4]   2> 1316162 INFO  (TEST-QueryEqualityTest.testFuncQuery-seed#[D8E4083C710F8437]) [    ] o.a.s.SolrTestCaseJ4 ###Starting testFuncQuery
   [junit4]   2> 1316163 INFO  (TEST-QueryEqualityTest.testFuncQuery-seed#[D8E4083C710F8437]) [    ] o.a.s.SolrTestCaseJ4 ###Ending testFuncQuery
   [junit4]   2> 1316164 INFO  (TEST-QueryEqualityTest.testFuncScale-seed#[D8E4083C710F8437]) [    ] o.a.s.SolrTestCaseJ4 ###Starting testFuncScale
   [junit4]   2> 1316165 INFO  (TEST-QueryEqualityTest.testFuncScale-seed#[D8E4083C710F8437]) [    ] o.a.s.SolrTestCaseJ4 ###Ending testFuncScale
   [junit4]   2> 1316166 INFO  (TEST-QueryEqualityTest.testFuncSub-seed#[D8E4083C710F8437]) [    ] o.a.s.SolrTestCaseJ4 ###Starting testFuncSub
   [junit4]   2> 1316166 INFO  (TEST-QueryEqualityTest.testFuncSub-seed#[D8E4083C710F8437]) [    ] o.a.s.SolrTestCaseJ4 ###Ending testFuncSub
   [junit4]   2> 1316167 INFO  (TEST-QueryEqualityTest.testFuncCurrency-seed#[D8E4083C710F8437]) [    ] o.a.s.SolrTestCaseJ4 ###Starting testFuncCurrency
   [junit4]   2> 1316169 INFO  (TEST-QueryEqualityTest.testFuncCurrency-seed#[D8E4083C710F8437]) [    ] o.a.s.SolrTestCaseJ4 ###Ending testFuncCurrency
   [junit4]   2> 1316170 INFO  (TEST-QueryEqualityTest.testFuncIf-seed#[D8E4083C710F8437]) [    ] o.a.s.SolrTestCaseJ4 ###Starting testFuncIf
   [junit4]   2> 1316171 INFO  (TEST-QueryEqualityTest.testFuncIf-seed#[D8E4083C710F8437]) [    ] o.a.s.SolrTestCaseJ4 ###Ending testFuncIf
   [junit4]   2> 1316172 INFO  (TEST-QueryEqualityTest.testTlogitQuery-seed#[D8E4083C710F8437]) [    ] o.a.s.SolrTestCaseJ4 ###Starting testTlogitQuery
   [junit4]   2> 1316173 INFO  (TEST-QueryEqualityTest.testTlogitQuery-seed#[D8E4083C710F8437]) [    ] o.a.s.SolrTestCaseJ4 ###Ending testTlogitQuery
   [junit4]   2> 1316175 INFO  (TEST-QueryEqualityTest.testFuncProduct-seed#[D8E4083C710F8437]) [    ] o.a.s.SolrTestCaseJ4 ###Starting testFuncProduct
   [junit4]   2> 1316175 INFO  (TEST-QueryEqualityTest.testFuncProduct-seed#[D8E4083C710F8437]) [    ] o.a.s.SolrTestCaseJ4 ###Ending testFuncProduct
   [junit4]   2> 1316176 INFO  (TEST-QueryEqualityTest.testPayloadCheckQuery-seed#[D8E4083C710F8437]) [    ] o.a.s.SolrTestCaseJ4 ###Starting testPayloadCheckQuery
   [junit4]   2> 1316180 INFO  (TEST-QueryEqualityTest.testPayloadCheckQuery-seed#[D8E4083C710F8437]) [    ] o.a.s.SolrTestCaseJ4 ###Ending testPayloadCheckQuery
   [junit4]   2> 1316181 INFO  (TEST-QueryEqualityTest.testFuncMaxdoc-seed#[D8E4083C710F8437]) [    ] o.a.s.SolrTestCaseJ4 ###Starting testFuncMaxdoc
   [junit4]   2> 1316181 INFO  (TEST-QueryEqualityTest.testFuncMaxdoc-seed#[D8E4083C710F8437]) [    ] o.a.s.SolrTestCaseJ4 ###Ending testFuncMaxdoc
   [junit4]   2> 1316182 INFO  (TEST-QueryEqualityTest.testHash-seed#[D8E4083C710F8437]) [    ] o.a.s.SolrTestCaseJ4 ###Starting testHash
   [junit4]   2> 1316184 INFO  (TEST-QueryEqualityTest.testHash-seed#[D8E4083C710F8437]) [    ] o.a.s.SolrTestCaseJ4 ###Ending testHash
   [junit4]   2> 1316185 INFO  (TEST-QueryEqualityTest.testCompares-seed#[D8E4083C710F8437]) [    ] o.a.s.SolrTestCaseJ4 ###Starting testCompares
   [junit4]   2> 1316187 INFO  (TEST-QueryEqualityTest.testCompares-seed#[D8E4083C710F8437]) [    ] o.a.s.SolrTestCaseJ4 ###Ending testCompares
   [junit4]   2> 1316188 INFO  (TEST-QueryEqualityTest.testFuncExists-seed#[D8E4083C710F8437]) [    ] o.a.s.SolrTestCaseJ4 ###Starting testFuncExists
   [junit4]   2> 1316189 INFO  (TEST-QueryEqualityTest.testFuncExists-seed#[D8E4083C710F8437]) [    ] o.a.s.SolrTestCaseJ4 ###Ending testFuncExists
   [junit4]   2> 1316190 INFO  (TEST-QueryEqualityTest.testFuncGeohash-seed#[D8E4083C710F8437]) [    ] o.a.s.SolrTestCaseJ4 ###Starting testFuncGeohash
   [junit4]   2> 1316191 INFO  (TEST-QueryEqualityTest.testFuncGeohash-seed#[D8E4083C710F8437]) [    ] o.a.s.SolrTestCaseJ4 ###Ending testFuncGeohash
   [junit4]   2> 1316192 INFO  (TEST-QueryEqualityTest.testQueryRaw-seed#[D8E4083C710F8437]) [    ] o.a.s.SolrTestCaseJ4 ###Starting testQueryRaw
   [junit4]   2> 1316192 INFO  (TEST-QueryEqualityTest.testQueryRaw-seed#[D8E4083C710F8437]) [    ] o.a.s.SolrTestCaseJ4 ###Ending testQueryRaw
   [junit4]   2> 1316193 INFO  (TEST-QueryEqualityTest.testFuncTop-seed#[D8E4083C710F8437]) [    ] o.a.s.SolrTestCaseJ4 ###Starting testFuncTop
   [junit4]   2> 1316193 INFO  (TEST-QueryEqualityTest.testFuncTop-seed#[D8E4083C710F8437]) [    ] o.a.s.SolrTestCaseJ4 ###Ending testFuncTop
   [junit4]   2> 1316194 INFO  (TEST-QueryEqualityTest.testTestFuncs-seed#[D8E4083C710F8437]) [    ] o.a.s.SolrTestCaseJ4 ###Starting testTestFuncs
   [junit4]   2> 1316197 INFO  (TEST-QueryEqualityTest.testTestFuncs-seed#[D8E4083C710F8437]) [    ] o.a.s.SolrTestCaseJ4 ###Ending testTestFuncs
   [junit4]   2> 1316198 INFO  (TEST-QueryEqualityTest.testFuncHsin-seed#[D8E4083C710F8437]) [    ] o.a.s.SolrTestCaseJ4 ###Starting testFuncHsin
   [junit4]   2> 1316199 INFO  (TEST-QueryEqualityTest.testFuncHsin-seed#[D8E4083C710F8437]) [    ] o.a.s.SolrTestCaseJ4 ###Ending testFuncHsin
   [junit4]   2> 1316200 INFO  (TEST-QueryEqualityTest.testFuncRord-seed#[D8E4083C710F8437]) [    ] o.a.s.SolrTestCaseJ4 ###Starting testFuncRord
   [junit4]   2> 1316201 INFO  (TEST-QueryEqualityTest.testFuncRord-seed#[D8E4083C710F8437]) [    ] o.a.s.SolrTestCaseJ4 ###Ending testFuncRord
   [junit4]   2> 1316202 INFO  (TEST-QueryEqualityTest.testPayloadScoreQuery-seed#[D8E4083C710F8437]) [    ] o.a.s.SolrTestCaseJ4 ###Starting testPayloadScoreQuery
   [junit4]   2> 1316203 INFO  (TEST-QueryEqualityTest.testPayloadScoreQuery-seed#[D8E4083C710F8437]) [    ] o.a.s.SolrTestCaseJ4 ###Ending testPayloadScoreQuery
   [junit4]   2> 1316204 INFO  (TEST-QueryEqualityTest.testFuncGeodist-seed#[D8E4083C710F8437]) [    ] o.a.s.SolrTestCaseJ4 ###Starting testFuncGeodist
   [junit4]   2> 1316205 INFO  (TEST-QueryEqualityTest.testFuncGeodist-seed#[D8E4083C710F8437]) [    ] o.a.s.SolrTestCaseJ4 ###Ending testFuncGeodist
   [junit4]   2> 1316207 INFO  (TEST-QueryEqualityTest.testFuncSttf-seed#[D8E4083C710F8437]) [    ] o.a.s.SolrTestCaseJ4 ###Starting testFuncSttf
   [junit4]   2> 1316207 INFO  (TEST-QueryEqualityTest.testFuncSttf-seed#[D8E4083C710F8437]) [    ] o.a.s.SolrTestCaseJ4 ###Ending testFuncSttf
   [junit4]   2> 1316208 INFO  (TEST-QueryEqualityTest.testFuncMin-seed#[D8E4083C710F8437]) [    ] o.a.s.SolrTestCaseJ4 ###Starting testFuncMin
   [junit4]   2> 1316209 INFO  (TEST-QueryEqualityTest.testFuncMin-seed#[D8E4083C710F8437]) [    ] o.a.s.SolrTestCaseJ4 ###Ending testFuncMin
   [junit4]   2> 1316210 INFO  (TEST-QueryEqualityTest.testDateMathParsingEquality-seed#[D8E4083C710F8437]) [    ] o.a.s.SolrTestCaseJ4 ###Starting testDateMathParsingEquality
   [junit4]   2> 1316210 INFO  (TEST-QueryEqualityTest.testDateMathParsingEquality-seed#[D8E4083C710F8437]) [    ] o.a.s.SolrTestCaseJ4 ###Ending testDateMathParsingEquality
   [junit4]   2> 1316211 INFO  (TEST-QueryEqualityTest.testFuncRecip-seed#[D8E4083C710F8437]) [    ] o.a.s.SolrTestCaseJ4 ###Starting testFuncRecip
   [junit4]   2> 1316212 INFO  (TEST-QueryEqualityTest.testFuncRecip-seed#[D8E4083C710F8437]) [    ] o.a.s.SolrTestCaseJ4 ###Ending testFuncRecip
   [junit4]   2> 1316213 INFO  (TEST-QueryEqualityTest.testQueryTerm-seed#[D8E4083C710F8437]) [    ] o.a.s.SolrTestCaseJ4 ###Starting testQueryTerm
   [junit4]   2> 1316213 INFO  (TEST-QueryEqualityTest.testQueryTerm-seed#[D8E4083C710F8437]) [    ] o.a.s.SolrTestCaseJ4 ###Ending testQueryTerm
   [junit4]   2> 1316214 INFO  (TEST-QueryEqualityTest.testFuncMax-seed#[D8E4083C710F8437]) [    ] o.a.s.SolrTestCaseJ4 ###Starting testFuncMax
   [junit4]   2> 1316215 INFO  (TEST-QueryEqualityTest.testFuncMax-seed#[D8E4083C710F8437]) [    ] o.a.s.SolrTestCaseJ4 ###Ending testFuncMax
   [junit4]   2> 1316216 INFO  (TEST-QueryEqualityTest.testExportQuery-seed#[D8E4083C710F8437]) [    ] o.a.s.SolrTestCaseJ4 ###Starting testExportQuery
   [junit4]   2> 1316222 INFO  (TEST-QueryEqualityTest.testExportQuery-seed#[D8E4083C710F8437]) [    ] o.a.s.SolrTestCaseJ4 ###Ending testExportQuery
   [junit4]   2> 1316223 INFO  (TEST-QueryEqualityTest.testQueryBbox-seed#[D8E4083C710F8437]) [    ] o.a.s.SolrTestCaseJ4 ###Starting testQueryBbox
   [junit4]   2> 1316224 INFO  (TEST-QueryEqualityTest.testQueryBbox-seed#[D8E4083C710F8437]) [    ] o.a.s.SolrTestCaseJ4 ###Ending testQueryBbox
   [junit4]   2> 1316227 INFO  (TEST-QueryEqualityTest.testFuncLiteral-seed#[D8E4083C710F8437]) [    ] o.a.s.SolrTestCaseJ4 ###Starting testFuncLiteral
   [junit4]   2> 1316227 INFO  (TEST-QueryEqualityTest.testFuncLiteral-seed#[D8E4083C710F8437]) [    ] o.a.s.SolrTestCaseJ4 ###Ending testFuncLiteral
   [junit4]   2> 1316228 INFO  (TEST-QueryEqualityTest.testQueryMaxScore-seed#[D8E4083C710F8437]) [    ] o.a.s.SolrTestCaseJ4 ###Starting testQueryMaxScore
   [junit4]   2> 1316229 INFO  (TEST-QueryEqualityTest.testQueryMaxScore-seed#[D8E4083C710F8437]) [    ] o.a.s.SolrTestCaseJ4 ###Ending testQueryMaxScore
   [junit4]   2> 1316240 INFO  (TEST-QueryEqualityTest.testQuerySwitch-seed#[D8E4083C710F8437]) [    ] o.a.s.SolrTestCaseJ4 ###Starting testQuerySwitch
   [junit4]   2> 1316241 INFO  (TEST-QueryEqualityTest.testQuerySwitch-seed#[D8E4083C710F8437]) [    ] o.a.s.SolrTestCaseJ4 ###Ending testQuerySwitch
   [junit4]   2> 1316242 INFO  (TEST-QueryEqualityTest.testFuncNot-seed#[D8E4083C710F8437]) [    ] o.a.s.SolrTestCaseJ4 ###Starting testFuncNot
   [junit4]   2> 1316243 INFO  (TEST-QueryEqualityTest.testFuncNot-seed#[D8E4083C710F8437]) [    ] o.a.s.SolrTestCaseJ4 ###Ending testFuncNot
   [junit4]   2> 1316244 INFO  (TEST-QueryEqualityTest.testReRankQuery-seed#[D8E4083C710F8437]) [    ] o.a.s.SolrTestCaseJ4 ###Starting testReRankQuery
   [junit4]   2> 1316247 INFO  (TEST-QueryEqualityTest.testReRankQuery-seed#[D8E4083C710F8437]) [    ] o.a.s.SolrTestCaseJ4 ###Ending testReRankQuery
   [junit4]   2> 1316248 INFO  (TEST-QueryEqualityTest.testFuncNumdocs-seed#[D8E4083C710F8437]) [    ] o.a.s.SolrTestCaseJ4 ###Starting testFuncNumdocs
   [junit4]   2> 1316248 INFO  (TEST-QueryEqualityTest.testFuncNumdocs-seed#[D8E4083C710F8437]) [    ] o.a.s.SolrTestCaseJ4 ###Ending testFuncNumdocs
   [junit4]   2> 1316249 INFO  (SUITE-QueryEqualityTest-seed#[D8E4083C710F8437]-worker) [    ] o.a.s.SolrTestCaseJ4 ###deleteCore
   [junit4]   2> 1316249 INFO  (SUITE-QueryEqualityTest-seed#[D8E4083C710F8437]-worker) [    ] o.a.s.c.CoreContainer Shutting down CoreContainer instance=533943065
   [junit4]   2> 1316249 INFO  (SUITE-QueryEqualityTest-seed#[D8E4083C710F8437]-worker) [    ] o.a.s.m.SolrMetricManager Closing metric reporters for registry=solr.node, tag=null
   [junit4]   2> 1316249 INFO  (SUITE-QueryEqualityTest-seed#[D8E4083C710F8437]-worker) [    ] o.a.s.m.r.SolrJmxReporter Closing reporter [org.apache.solr.metrics.reporters.SolrJmxReporter@69888b01: rootName = null, domain = solr.node, service url = null, agent id = null] for registry solr.node / com.codahale.metrics.MetricRegistry@4f5cb012
   [junit4]   2> 1316252 INFO  (SUITE-QueryEqualityTest-seed#[D8E4083C710F8437]-worker) [    ] o.a.s.m.SolrMetricManager Closing metric reporters for registry=solr.jvm, tag=null
   [junit4]   2> 1316252 INFO  (SUITE-QueryEqualityTest-seed#[D8E4083C710F8437]-worker) [    ] o.a.s.m.r.SolrJmxReporter Closing reporter [org.apache.solr.metrics.reporters.SolrJmxReporter@7c510adb: rootName = null, domain = solr.jvm, service url = null, agent id = null] for registry solr.jvm / com.codahale.metrics.MetricRegistry@238ddf8d
   [junit4]   2> 1316255 INFO  (SUITE-QueryEqualityTest-seed#[D8E4083C710F8437]-worker) [    ] o.a.s.m.SolrMetricManager Closing metric reporters for registry=solr.jetty, tag=null
   [junit4]   2> 1316255 INFO  (SUITE-QueryEqualityTest-seed#[D8E4083C710F8437]-worker) [    ] o.a.s.m.r.SolrJmxReporter Closing reporter [org.apache.solr.metrics.reporters.SolrJmxReporter@755417ef: rootName = null, domain = solr.jetty, service url = null, agent id = null] for registry solr.jetty / com.codahale.metrics.MetricRegistry@55a96200
   [junit4]   2> 1316255 INFO  (SUITE-QueryEqualityTest-seed#[D8E4083C710F8437]-worker) [    ] o.a.s.c.TransientSolrCoreCacheDefault Allocating transient cache for 2147483647 transient cores
   [junit4]   2> 1316255 INFO  (coreCloseExecutor-4148-thread-1) [    ] o.a.s.c.SolrCore [collection1]  CLOSING SolrCore org.apache.solr.core.SolrCore@41d934c2
   [junit4]   2> 1316255 INFO  (coreCloseExecutor-4148-thread-1) [    ] o.a.s.m.SolrMetricManager Closing metric reporters for registry=solr.core.collection1, tag=1104753858
   [junit4]   2> 1316255 INFO  (coreCloseExecutor-4148-thread-1) [    ] o.a.s.m.r.SolrJmxReporter Closing reporter [org.apache.solr.metrics.reporters.SolrJmxReporter@376a3b68: rootName = null, domain = solr.core.collection1, service url = null, agent id = null] for registry solr.core.collection1 / com.codahale.metrics.MetricRegistry@4a1883f5
   [junit4]   2> 1316264 INFO  (SUITE-QueryEqualityTest-seed#[D8E4083C710F8437]-worker) [    ] o.a.s.SolrTestCaseJ4 ------------------------------------------------------- Done waiting for tracked resources to be released
   [junit4]   2> NOTE: test params are: codec=Asserting(Lucene70): {lowerfilt=Lucene50(blocksize=128), id=Lucene50(blocksize=128)}, docValues:{_version_=DocValuesFormat(name=Asserting)}, maxPointsInLeafNode=1976, maxMBSortInHeap=5.8053030901735765, sim=RandomSimilarity(queryNorm=true): {}, locale=sbp-TZ, timezone=Atlantic/St_Helena
   [junit4]   2> NOTE: Linux 4.10.0-33-generic amd64/Oracle Corporation 9 (64-bit)/cpus=8,threads=1,free=170929616,total=518979584
   [junit4]   2> NOTE: All tests run in this JVM: [LeaderElectionTest, ConjunctionSolrSpellCheckerTest, TestDocTermOrds, LeaderInitiatedRecoveryOnShardRestartTest, TestStandardQParsers, TestLeaderElectionWithEmptyReplica, TestExceedMaxTermLength, CheckHdfsIndexTest, ActionThrottleTest, TestSort, SolrXmlInZkTest, MultiThreadedOCPTest, CdcrBootstrapTest, TestCloudSchemaless, TestSystemCollAutoCreate, TestHighFrequencyDictionaryFactory, CoreSorterTest, ParsingFieldUpdateProcessorsTest, CopyFieldTest, TestOnReconnectListenerSupport, PrimitiveFieldTypeTest, CdcrRequestHandlerTest, TestTolerantSearch, DeleteShardTest, TestTolerantUpdateProcessorCloud, TestScoreJoinQPScore, TestTrie, UUIDUpdateProcessorFallbackTest, ZkStateReaderTest, TestCodecSupport, ShardSplitTest, TestRequestStatusCollectionAPI, TermVectorComponentDistributedTest, DistributedQueryComponentCustomSortTest, SimpleCollectionCreateDeleteTest, TestCloudInspectUtil, SpellPossibilityIteratorTest, ResponseLogComponentTest, TestTestInjection, SimpleFacetsTest, SolrTestCaseJ4Test, DirectUpdateHandlerTest, TestConfigOverlay, SmileWriterTest, TestZkAclsWithHadoopAuth, AddSchemaFieldsUpdateProcessorFactoryTest, ExplicitHLLTest, BasicDistributedZk2Test, TestRawTransformer, TestLFUCache, HdfsRecoveryZkTest, UnloadDistributedZkTest, TestManagedSchema, TestClusterProperties, CoreAdminCreateDiscoverTest, TestConfigReload, CircularListTest, HdfsDirectoryFactoryTest, HLLUtilTest, TestRecovery, SimplePostToolTest, TestQuerySenderListener, TestInitParams, RequiredFieldsTest, StatsComponentTest, NotRequiredUniqueKeyTest, TestFastWriter, TestPKIAuthenticationPlugin, TestSortByMinMaxFunction, TestInPlaceUpdatesStandalone, ChaosMonkeySafeLeaderWithPullReplicasTest, TestSQLHandlerNonCloud, TestSlowCompositeReaderWrapper, BooleanFieldTest, TestAnalyzedSuggestions, OverseerRolesTest, TestStressReorder, TestSolrDeletionPolicy2, TestConfigSetsAPI, BasicAuthStandaloneTest, DocumentBuilderTest, HdfsBasicDistributedZkTest, TestNumericTerms64, TestAddFieldRealTimeGet, AutoCommitTest, BadIndexSchemaTest, TestPseudoReturnFields, SuggestComponentTest, TestMissingGroups, SuggesterFSTTest, QueryEqualityTest]
   [junit4]   2> NOTE: reproduce with: ant test  -Dtestcase=QueryEqualityTest -Dtests.seed=D8E4083C710F8437 -Dtests.multiplier=3 -Dtests.slow=true -Dtests.locale=sbp-TZ -Dtests.timezone=Atlantic/St_Helena -Dtests.asserts=true -Dtests.file.encoding=US-ASCII
   [junit4] ERROR   0.00s J2 | QueryEqualityTest (suite) <<<
   [junit4]    > Throwable #1: java.lang.AssertionError: testParserCoverage was run w/o any other method explicitly testing qparser: bool
   [junit4]    > 	at __randomizedtesting.SeedInfo.seed([D8E4083C710F8437]:0)
   [junit4]    > 	at org.apache.solr.search.QueryEqualityTest.afterClassParserCoverageTest(QueryEqualityTest.java:59)
   [junit4]    > 	at java.base/jdk.internal.reflect.NativeMethodAccessorImpl.invoke0(Native Method)
   [junit4]    > 	at java.base/jdk.internal.reflect.NativeMethodAccessorImpl.invoke(NativeMethodAccessorImpl.java:62)
   [junit4]    > 	at java.base/jdk.internal.reflect.DelegatingMethodAccessorImpl.invoke(DelegatingMethodAccessorImpl.java:43)
   [junit4]    > 	at java.base/java.lang.reflect.Method.invoke(Method.java:564)
   [junit4]    > 	at java.base/java.lang.Thread.run(Thread.java:844)
   [junit4] Completed [302/732 (1!)] on J2 in 0.68s, 89 tests, 1 failure <<< FAILURES!

[...truncated 1508 lines...]
   [junit4] JVM J1: stderr was not empty, see: /home/jenkins/workspace/Lucene-Solr-master-Linux/solr/build/solr-core/test/temp/junit4-J1-20170901_144816_8256802361315459935119.syserr
   [junit4] >>> JVM J1 emitted unexpected output (verbatim) ----
   [junit4] Java HotSpot(TM) 64-Bit Server VM warning: Option UseConcMarkSweepGC was deprecated in version 9.0 and will likely be removed in a future release.
   [junit4] <<< JVM J1: EOF ----

[...truncated 3 lines...]
   [junit4] JVM J0: stderr was not empty, see: /home/jenkins/workspace/Lucene-Solr-master-Linux/solr/build/solr-core/test/temp/junit4-J0-20170901_144816_82512657909447046166573.syserr
   [junit4] >>> JVM J0 emitted unexpected output (verbatim) ----
   [junit4] Java HotSpot(TM) 64-Bit Server VM warning: Option UseConcMarkSweepGC was deprecated in version 9.0 and will likely be removed in a future release.
   [junit4] <<< JVM J0: EOF ----

[...truncated 6 lines...]
   [junit4] JVM J2: stderr was not empty, see: /home/jenkins/workspace/Lucene-Solr-master-Linux/solr/build/solr-core/test/temp/junit4-J2-20170901_144816_825873941286861778537.syserr
   [junit4] >>> JVM J2 emitted unexpected output (verbatim) ----
   [junit4] Java HotSpot(TM) 64-Bit Server VM warning: Option UseConcMarkSweepGC was deprecated in version 9.0 and will likely be removed in a future release.
   [junit4] <<< JVM J2: EOF ----

[...truncated 880 lines...]
   [junit4] JVM J2: stderr was not empty, see: /home/jenkins/workspace/Lucene-Solr-master-Linux/solr/build/solr-solrj/test/temp/junit4-J2-20170901_153522_45412055127044521396212.syserr
   [junit4] >>> JVM J2 emitted unexpected output (verbatim) ----
   [junit4] Java HotSpot(TM) 64-Bit Server VM warning: Option UseConcMarkSweepGC was deprecated in version 9.0 and will likely be removed in a future release.
   [junit4] <<< JVM J2: EOF ----

[...truncated 3 lines...]
   [junit4] JVM J1: stderr was not empty, see: /home/jenkins/workspace/Lucene-Solr-master-Linux/solr/build/solr-solrj/test/temp/junit4-J1-20170901_153522_4549752124208546265700.syserr
   [junit4] >>> JVM J1 emitted unexpected output (verbatim) ----
   [junit4] Java HotSpot(TM) 64-Bit Server VM warning: Option UseConcMarkSweepGC was deprecated in version 9.0 and will likely be removed in a future release.
   [junit4] <<< JVM J1: EOF ----

[...truncated 21 lines...]
   [junit4] JVM J0: stderr was not empty, see: /home/jenkins/workspace/Lucene-Solr-master-Linux/solr/build/solr-solrj/test/temp/junit4-J0-20170901_153522_4549067888550275211259.syserr
   [junit4] >>> JVM J0 emitted unexpected output (verbatim) ----
   [junit4] Java HotSpot(TM) 64-Bit Server VM warning: Option UseConcMarkSweepGC was deprecated in version 9.0 and will likely be removed in a future release.
   [junit4] <<< JVM J0: EOF ----

[...truncated 1351 lines...]
   [junit4] JVM J0: stderr was not empty, see: /home/jenkins/workspace/Lucene-Solr-master-Linux/solr/build/contrib/solr-analysis-extras/test/temp/junit4-J0-20170901_153825_04214966609752292659544.syserr
   [junit4] >>> JVM J0 emitted unexpected output (verbatim) ----
   [junit4] Java HotSpot(TM) 64-Bit Server VM warning: Option UseConcMarkSweepGC was deprecated in version 9.0 and will likely be removed in a future release.
   [junit4] <<< JVM J0: EOF ----

[...truncated 3 lines...]
   [junit4] JVM J1: stde

[...truncated too long message...]

pace/Lucene-Solr-master-Linux/solr/build/contrib/solr-analytics/test/temp/junit4-J0-20170901_153833_2097771300542085506923.syserr
   [junit4] >>> JVM J0 emitted unexpected output (verbatim) ----
   [junit4] Java HotSpot(TM) 64-Bit Server VM warning: Option UseConcMarkSweepGC was deprecated in version 9.0 and will likely be removed in a future release.
   [junit4] <<< JVM J0: EOF ----

[...truncated 3 lines...]
   [junit4] JVM J2: stderr was not empty, see: /home/jenkins/workspace/Lucene-Solr-master-Linux/solr/build/contrib/solr-analytics/test/temp/junit4-J2-20170901_153833_20923892703174349123.syserr
   [junit4] >>> JVM J2 emitted unexpected output (verbatim) ----
   [junit4] Java HotSpot(TM) 64-Bit Server VM warning: Option UseConcMarkSweepGC was deprecated in version 9.0 and will likely be removed in a future release.
   [junit4] <<< JVM J2: EOF ----

[...truncated 545 lines...]
   [junit4] JVM J2: stderr was not empty, see: /home/jenkins/workspace/Lucene-Solr-master-Linux/solr/build/contrib/solr-clustering/test/temp/junit4-J2-20170901_153917_57914180242279126264041.syserr
   [junit4] >>> JVM J2 emitted unexpected output (verbatim) ----
   [junit4] Java HotSpot(TM) 64-Bit Server VM warning: Option UseConcMarkSweepGC was deprecated in version 9.0 and will likely be removed in a future release.
   [junit4] <<< JVM J2: EOF ----

[...truncated 3 lines...]
   [junit4] JVM J1: stderr was not empty, see: /home/jenkins/workspace/Lucene-Solr-master-Linux/solr/build/contrib/solr-clustering/test/temp/junit4-J1-20170901_153917_57912276638941340489016.syserr
   [junit4] >>> JVM J1 emitted unexpected output (verbatim) ----
   [junit4] Java HotSpot(TM) 64-Bit Server VM warning: Option UseConcMarkSweepGC was deprecated in version 9.0 and will likely be removed in a future release.
   [junit4] <<< JVM J1: EOF ----

[...truncated 3 lines...]
   [junit4] JVM J0: stderr was not empty, see: /home/jenkins/workspace/Lucene-Solr-master-Linux/solr/build/contrib/solr-clustering/test/temp/junit4-J0-20170901_153917_57913265255408745917256.syserr
   [junit4] >>> JVM J0 emitted unexpected output (verbatim) ----
   [junit4] Java HotSpot(TM) 64-Bit Server VM warning: Option UseConcMarkSweepGC was deprecated in version 9.0 and will likely be removed in a future release.
   [junit4] <<< JVM J0: EOF ----

[...truncated 1239 lines...]
   [junit4] JVM J1: stderr was not empty, see: /home/jenkins/workspace/Lucene-Solr-master-Linux/solr/build/contrib/solr-dataimporthandler-extras/test/temp/junit4-J1-20170901_153934_55914542941942157507274.syserr
   [junit4] >>> JVM J1 emitted unexpected output (verbatim) ----
   [junit4] Java HotSpot(TM) 64-Bit Server VM warning: Option UseConcMarkSweepGC was deprecated in version 9.0 and will likely be removed in a future release.
   [junit4] <<< JVM J1: EOF ----

[...truncated 3 lines...]
   [junit4] JVM J0: stderr was not empty, see: /home/jenkins/workspace/Lucene-Solr-master-Linux/solr/build/contrib/solr-dataimporthandler-extras/test/temp/junit4-J0-20170901_153934_55912722747114810258365.syserr
   [junit4] >>> JVM J0 emitted unexpected output (verbatim) ----
   [junit4] Java HotSpot(TM) 64-Bit Server VM warning: Option UseConcMarkSweepGC was deprecated in version 9.0 and will likely be removed in a future release.
   [junit4] <<< JVM J0: EOF ----

[...truncated 639 lines...]
   [junit4] JVM J2: stderr was not empty, see: /home/jenkins/workspace/Lucene-Solr-master-Linux/solr/build/contrib/solr-dataimporthandler/test/temp/junit4-J2-20170901_153940_49013540789033463301416.syserr
   [junit4] >>> JVM J2 emitted unexpected output (verbatim) ----
   [junit4] Java HotSpot(TM) 64-Bit Server VM warning: Option UseConcMarkSweepGC was deprecated in version 9.0 and will likely be removed in a future release.
   [junit4] <<< JVM J2: EOF ----

   [junit4] JVM J1: stderr was not empty, see: /home/jenkins/workspace/Lucene-Solr-master-Linux/solr/build/contrib/solr-dataimporthandler/test/temp/junit4-J1-20170901_153940_49011037033309327423344.syserr
   [junit4] >>> JVM J1 emitted unexpected output (verbatim) ----
   [junit4] Java HotSpot(TM) 64-Bit Server VM warning: Option UseConcMarkSweepGC was deprecated in version 9.0 and will likely be removed in a future release.
   [junit4] <<< JVM J1: EOF ----

[...truncated 3 lines...]
   [junit4] JVM J0: stderr was not empty, see: /home/jenkins/workspace/Lucene-Solr-master-Linux/solr/build/contrib/solr-dataimporthandler/test/temp/junit4-J0-20170901_153940_49010720829537783726331.syserr
   [junit4] >>> JVM J0 emitted unexpected output (verbatim) ----
   [junit4] Java HotSpot(TM) 64-Bit Server VM warning: Option UseConcMarkSweepGC was deprecated in version 9.0 and will likely be removed in a future release.
   [junit4] <<< JVM J0: EOF ----

[...truncated 549 lines...]
   [junit4] JVM J0: stderr was not empty, see: /home/jenkins/workspace/Lucene-Solr-master-Linux/solr/build/contrib/solr-cell/test/temp/junit4-J0-20170901_153959_92710441158314421111436.syserr
   [junit4] >>> JVM J0 emitted unexpected output (verbatim) ----
   [junit4] Java HotSpot(TM) 64-Bit Server VM warning: Option UseConcMarkSweepGC was deprecated in version 9.0 and will likely be removed in a future release.
   [junit4] <<< JVM J0: EOF ----

[...truncated 3 lines...]
   [junit4] JVM J2: stderr was not empty, see: /home/jenkins/workspace/Lucene-Solr-master-Linux/solr/build/contrib/solr-cell/test/temp/junit4-J2-20170901_153959_92712288006119948682402.syserr
   [junit4] >>> JVM J2 emitted unexpected output (verbatim) ----
   [junit4] Java HotSpot(TM) 64-Bit Server VM warning: Option UseConcMarkSweepGC was deprecated in version 9.0 and will likely be removed in a future release.
   [junit4] <<< JVM J2: EOF ----

[...truncated 3 lines...]
   [junit4] JVM J1: stderr was not empty, see: /home/jenkins/workspace/Lucene-Solr-master-Linux/solr/build/contrib/solr-cell/test/temp/junit4-J1-20170901_153959_9273357253823966106238.syserr
   [junit4] >>> JVM J1 emitted unexpected output (verbatim) ----
   [junit4] Java HotSpot(TM) 64-Bit Server VM warning: Option UseConcMarkSweepGC was deprecated in version 9.0 and will likely be removed in a future release.
   [junit4] <<< JVM J1: EOF ----

[...truncated 555 lines...]
   [junit4] JVM J1: stderr was not empty, see: /home/jenkins/workspace/Lucene-Solr-master-Linux/solr/build/contrib/solr-langid/test/temp/junit4-J1-20170901_154011_16815312998272632902751.syserr
   [junit4] >>> JVM J1 emitted unexpected output (verbatim) ----
   [junit4] Java HotSpot(TM) 64-Bit Server VM warning: Option UseConcMarkSweepGC was deprecated in version 9.0 and will likely be removed in a future release.
   [junit4] <<< JVM J1: EOF ----

   [junit4] JVM J0: stderr was not empty, see: /home/jenkins/workspace/Lucene-Solr-master-Linux/solr/build/contrib/solr-langid/test/temp/junit4-J0-20170901_154011_1685184536616080182241.syserr
   [junit4] >>> JVM J0 emitted unexpected output (verbatim) ----
   [junit4] Java HotSpot(TM) 64-Bit Server VM warning: Option UseConcMarkSweepGC was deprecated in version 9.0 and will likely be removed in a future release.
   [junit4] <<< JVM J0: EOF ----

[...truncated 632 lines...]
   [junit4] JVM J1: stderr was not empty, see: /home/jenkins/workspace/Lucene-Solr-master-Linux/solr/build/contrib/solr-ltr/test/temp/junit4-J1-20170901_154017_20316809015315355043756.syserr
   [junit4] >>> JVM J1 emitted unexpected output (verbatim) ----
   [junit4] Java HotSpot(TM) 64-Bit Server VM warning: Option UseConcMarkSweepGC was deprecated in version 9.0 and will likely be removed in a future release.
   [junit4] <<< JVM J1: EOF ----

[...truncated 3 lines...]
   [junit4] JVM J2: stderr was not empty, see: /home/jenkins/workspace/Lucene-Solr-master-Linux/solr/build/contrib/solr-ltr/test/temp/junit4-J2-20170901_154017_20315391538504382674792.syserr
   [junit4] >>> JVM J2 emitted unexpected output (verbatim) ----
   [junit4] Java HotSpot(TM) 64-Bit Server VM warning: Option UseConcMarkSweepGC was deprecated in version 9.0 and will likely be removed in a future release.
   [junit4] <<< JVM J2: EOF ----

[...truncated 9 lines...]
   [junit4] JVM J0: stderr was not empty, see: /home/jenkins/workspace/Lucene-Solr-master-Linux/solr/build/contrib/solr-ltr/test/temp/junit4-J0-20170901_154017_20310412985354016621455.syserr
   [junit4] >>> JVM J0 emitted unexpected output (verbatim) ----
   [junit4] Java HotSpot(TM) 64-Bit Server VM warning: Option UseConcMarkSweepGC was deprecated in version 9.0 and will likely be removed in a future release.
   [junit4] <<< JVM J0: EOF ----

[...truncated 588 lines...]
   [junit4] JVM J1: stderr was not empty, see: /home/jenkins/workspace/Lucene-Solr-master-Linux/solr/build/contrib/solr-uima/test/temp/junit4-J1-20170901_154052_959357506459440377450.syserr
   [junit4] >>> JVM J1 emitted unexpected output (verbatim) ----
   [junit4] Java HotSpot(TM) 64-Bit Server VM warning: Option UseConcMarkSweepGC was deprecated in version 9.0 and will likely be removed in a future release.
   [junit4] <<< JVM J1: EOF ----

[...truncated 3 lines...]
   [junit4] JVM J0: stderr was not empty, see: /home/jenkins/workspace/Lucene-Solr-master-Linux/solr/build/contrib/solr-uima/test/temp/junit4-J0-20170901_154052_9595344159149785957610.syserr
   [junit4] >>> JVM J0 emitted unexpected output (verbatim) ----
   [junit4] Java HotSpot(TM) 64-Bit Server VM warning: Option UseConcMarkSweepGC was deprecated in version 9.0 and will likely be removed in a future release.
   [junit4] <<< JVM J0: EOF ----

[...truncated 540 lines...]
   [junit4] JVM J0: stderr was not empty, see: /home/jenkins/workspace/Lucene-Solr-master-Linux/solr/build/contrib/solr-velocity/test/temp/junit4-J0-20170901_154103_6614095774711703194547.syserr
   [junit4] >>> JVM J0 emitted unexpected output (verbatim) ----
   [junit4] Java HotSpot(TM) 64-Bit Server VM warning: Option UseConcMarkSweepGC was deprecated in version 9.0 and will likely be removed in a future release.
   [junit4] <<< JVM J0: EOF ----

[...truncated 30861 lines...]

Mime
View raw message