maven-notifications mailing list archives

Site index · List index
Message view « Date » · « Thread »
Top « Date » · « Thread »
From Hudson <Hud...@sonatype.org>
Subject Build failed in Hudson: maven-3.0.x-ITs » ubuntu #162
Date Fri, 22 Jan 2010 17:23:47 GMT
See <http://grid.sonatype.org/ci/job/maven-3.0.x-ITs/./label=ubuntu/162/>

------------------------------------------
[...truncated 1040 lines...]
  Nexus (http://repository.sonatype.org:8081/content/groups/sonatype-public-grid, releases=true,
snapshots=true)
Path to dependency: 
	1) org.apache.maven.its.it0041:test:pom:pom:1.0-SNAPSHOT
	2) org.apache.maven:maven-core-it-support:it-artifact:it:1.2
	at org.apache.maven.artifact.resolver.DefaultArtifactResolver.resolve(DefaultArtifactResolver.java:268)
	at org.apache.maven.artifact.resolver.DefaultArtifactResolver.access$000(DefaultArtifactResolver.java:73)
	at org.apache.maven.artifact.resolver.DefaultArtifactResolver$ResolveTask.run(DefaultArtifactResolver.java:686)
	at java.util.concurrent.ThreadPoolExecutor$Worker.runTask(ThreadPoolExecutor.java:885)
	at java.util.concurrent.ThreadPoolExecutor$Worker.run(ThreadPoolExecutor.java:907)
	at java.lang.Thread.run(Thread.java:619)
Caused by: org.apache.maven.wagon.TransferFailedException: Error transferring file: Connection
refused
	at org.apache.maven.wagon.providers.http.LightweightHttpWagon.fillInputData(LightweightHttpWagon.java:143)
	at org.apache.maven.wagon.StreamWagon.getInputStream(StreamWagon.java:116)
	at org.apache.maven.wagon.StreamWagon.getIfNewer(StreamWagon.java:88)
	at org.apache.maven.wagon.StreamWagon.get(StreamWagon.java:61)
	at org.apache.maven.repository.legacy.DefaultWagonManager.getRemoteFile(DefaultWagonManager.java:309)
	at org.apache.maven.repository.legacy.DefaultWagonManager.getArtifact(DefaultWagonManager.java:98)
	at org.apache.maven.repository.legacy.DefaultWagonManager.getArtifact(DefaultWagonManager.java:129)
	at org.apache.maven.artifact.resolver.DefaultArtifactResolver.resolve(DefaultArtifactResolver.java:251)
	... 5 more
Caused by: java.net.ConnectException: Connection refused
	at java.net.PlainSocketImpl.socketConnect(Native Method)
	at java.net.PlainSocketImpl.doConnect(PlainSocketImpl.java:333)
	at java.net.PlainSocketImpl.connectToAddress(PlainSocketImpl.java:195)
	at java.net.PlainSocketImpl.connect(PlainSocketImpl.java:182)
	at java.net.Socket.connect(Socket.java:518)
	at java.net.Socket.connect(Socket.java:468)
	at sun.net.NetworkClient.doConnect(NetworkClient.java:157)
	at sun.net.www.http.HttpClient.openServer(HttpClient.java:389)
	at sun.net.www.http.HttpClient.openServer(HttpClient.java:516)
	at sun.net.www.http.HttpClient.<init>(HttpClient.java:233)
	at sun.net.www.http.HttpClient.New(HttpClient.java:306)
	at sun.net.www.http.HttpClient.New(HttpClient.java:318)
	at sun.net.www.protocol.http.HttpURLConnection.getNewHttpClient(HttpURLConnection.java:788)
	at sun.net.www.protocol.http.HttpURLConnection.plainConnect(HttpURLConnection.java:729)
	at sun.net.www.protocol.http.HttpURLConnection.connect(HttpURLConnection.java:654)
	at sun.net.www.protocol.http.HttpURLConnection.getInputStream(HttpURLConnection.java:977)
	at java.net.HttpURLConnection.getResponseCode(HttpURLConnection.java:373)
	at org.apache.maven.wagon.providers.http.LightweightHttpWagon.fillInputData(LightweightHttpWagon.java:115)
	... 12 more
[ERROR] 
[ERROR] Re-run Maven using the -X switch to enable full debug logging.
[ERROR] 
[ERROR] For more information about the errors and possible solutions, please read the following
articles:
[ERROR] [Help 1] http://cwiki.apache.org/confluence/display/MAVEN/ArtifactResolutionException
EMMA: locking coverage output file [/home/hudson/workspace/maven-3.0.x-ITs/label/ubuntu/core-integration-tests/target/test-classes/it0041/coverage.ec]
...
EMMA: runtime coverage data merged into [/home/hudson/workspace/maven-3.0.x-ITs/label/ubuntu/core-integration-tests/target/test-classes/it0041/coverage.ec]
{in 20 ms}
	at org.apache.maven.it.Verifier.executeGoals(Verifier.java:1326)
	at org.apache.maven.it.Verifier.executeGoal(Verifier.java:1164)
	at org.apache.maven.it.Verifier.executeGoal(Verifier.java:1158)
	at org.apache.maven.it.MavenIT0041ArtifactTypeFromPluginExtensionTest.testit0041(MavenIT0041ArtifactTypeFromPluginExtensionTest.java:52)
	at sun.reflect.NativeMethodAccessorImpl.invoke0(Native Method)
	at sun.reflect.NativeMethodAccessorImpl.invoke(NativeMethodAccessorImpl.java:39)
	at sun.reflect.DelegatingMethodAccessorImpl.invoke(DelegatingMethodAccessorImpl.java:25)
	at java.lang.reflect.Method.invoke(Method.java:597)
	at junit.framework.TestCase.runTest(TestCase.java:164)
	at org.apache.maven.it.AbstractMavenIntegrationTestCase.runTest(AbstractMavenIntegrationTestCase.java:198)
	at junit.framework.TestCase.runBare(TestCase.java:130)
	at junit.framework.TestResult$1.protect(TestResult.java:106)
	at junit.framework.TestResult.runProtected(TestResult.java:124)
	at junit.framework.TestResult.run(TestResult.java:109)
	at junit.framework.TestCase.run(TestCase.java:120)
	at junit.framework.TestSuite.runTest(TestSuite.java:230)
	at junit.framework.TestSuite.run(TestSuite.java:225)
	at junit.framework.TestSuite.runTest(TestSuite.java:230)
	at junit.framework.TestSuite.run(TestSuite.java:225)
	at sun.reflect.NativeMethodAccessorImpl.invoke0(Native Method)
	at sun.reflect.NativeMethodAccessorImpl.invoke(NativeMethodAccessorImpl.java:39)
	at sun.reflect.DelegatingMethodAccessorImpl.invoke(DelegatingMethodAccessorImpl.java:25)
	at java.lang.reflect.Method.invoke(Method.java:597)
	at org.apache.maven.surefire.junit.JUnitTestSet.execute(JUnitTestSet.java:213)
	at org.apache.maven.surefire.suite.AbstractDirectoryTestSuite.executeTestSet(AbstractDirectoryTestSuite.java:140)
	at org.apache.maven.surefire.suite.AbstractDirectoryTestSuite.execute(AbstractDirectoryTestSuite.java:127)
	at org.apache.maven.surefire.Surefire.run(Surefire.java:177)
	at sun.reflect.NativeMethodAccessorImpl.invoke0(Native Method)
	at sun.reflect.NativeMethodAccessorImpl.invoke(NativeMethodAccessorImpl.java:39)
	at sun.reflect.DelegatingMethodAccessorImpl.invoke(DelegatingMethodAccessorImpl.java:25)
	at java.lang.reflect.Method.invoke(Method.java:597)
	at org.apache.maven.surefire.booter.SurefireBooter.runSuitesInProcess(SurefireBooter.java:345)
	at org.apache.maven.surefire.booter.SurefireBooter.run(SurefireBooter.java:241)
	at org.apache.maven.plugin.surefire.SurefirePlugin.execute(SurefirePlugin.java:537)
	at org.apache.maven.plugin.DefaultBuildPluginManager.executeMojo(DefaultBuildPluginManager.java:105)
	at org.apache.maven.lifecycle.DefaultLifecycleExecutor.execute(DefaultLifecycleExecutor.java:562)
	at org.apache.maven.lifecycle.DefaultLifecycleExecutor.execute(DefaultLifecycleExecutor.java:317)
	at org.apache.maven.DefaultMaven.doExecute(DefaultMaven.java:247)
	at org.apache.maven.DefaultMaven.execute(DefaultMaven.java:104)
	at org.apache.maven.cli.MavenCli.execute(MavenCli.java:427)
	at org.apache.maven.cli.MavenCli.doMain(MavenCli.java:157)
	at org.apache.maven.cli.MavenCli.main(MavenCli.java:121)
	at sun.reflect.NativeMethodAccessorImpl.invoke0(Native Method)
	at sun.reflect.NativeMethodAccessorImpl.invoke(NativeMethodAccessorImpl.java:39)
	at sun.reflect.DelegatingMethodAccessorImpl.invoke(DelegatingMethodAccessorImpl.java:25)
	at java.lang.reflect.Method.invoke(Method.java:597)
	at org.codehaus.plexus.classworlds.launcher.Launcher.launchEnhanced(Launcher.java:290)
	at org.codehaus.plexus.classworlds.launcher.Launcher.launch(Launcher.java:230)
	at org.codehaus.plexus.classworlds.launcher.Launcher.mainWithExitCode(Launcher.java:409)
	at org.codehaus.plexus.classworlds.launcher.Launcher.main(Launcher.java:352)
Caused by: org.apache.maven.artifact.resolver.ArtifactResolutionException: Error transferring
file: Connection refused
  org.apache.maven:maven-core-it-support:it-artifact:1.2
from the specified remote repositories:
  Nexus (http://repository.sonatype.org:8081/content/groups/sonatype-public-grid, releases=true,
snapshots=true)
Path to dependency: 
	1) org.apache.maven.its.it0041:test:pom:pom:1.0-SNAPSHOT
	2) org.apache.maven:maven-core-it-support:it-artifact:it:1.2
	at org.apache.maven.artifact.resolver.DefaultArtifactResolver.resolve(DefaultArtifactResolver.java:268)
	at org.apache.maven.artifact.resolver.DefaultArtifactResolver.access$000(DefaultArtifactResolver.java:73)
	at org.apache.maven.artifact.resolver.DefaultArtifactResolver$ResolveTask.run(DefaultArtifactResolver.java:686)
	at java.util.concurrent.ThreadPoolExecutor$Worker.runTask(ThreadPoolExecutor.java:885)
	at java.util.concurrent.ThreadPoolExecutor$Worker.run(ThreadPoolExecutor.java:907)
	at java.lang.Thread.run(Thread.java:619)
Caused by: org.apache.maven.wagon.TransferFailedException: Error transferring file: Connection
refused
	at org.apache.maven.wagon.providers.http.LightweightHttpWagon.fillInputData(LightweightHttpWagon.java:143)
	at org.apache.maven.wagon.StreamWagon.getInputStream(StreamWagon.java:116)
	at org.apache.maven.wagon.StreamWagon.getIfNewer(StreamWagon.java:88)
	at org.apache.maven.wagon.StreamWagon.get(StreamWagon.java:61)
	at org.apache.maven.repository.legacy.DefaultWagonManager.getRemoteFile(DefaultWagonManager.java:309)
	at org.apache.maven.repository.legacy.DefaultWagonManager.getArtifact(DefaultWagonManager.java:98)
	at org.apache.maven.repository.legacy.DefaultWagonManager.getArtifact(DefaultWagonManager.java:129)
	at org.apache.maven.artifact.resolver.DefaultArtifactResolver.resolve(DefaultArtifactResolver.java:251)
	... 5 more
Caused by: java.net.ConnectException: Connection refused
	at java.net.PlainSocketImpl.socketConnect(Native Method)
	at java.net.PlainSocketImpl.doConnect(PlainSocketImpl.java:333)
	at java.net.PlainSocketImpl.connectToAddress(PlainSocketImpl.java:195)
	at java.net.PlainSocketImpl.connect(PlainSocketImpl.java:182)
	at java.net.Socket.connect(Socket.java:518)
	at java.net.Socket.connect(Socket.java:468)
	at sun.net.NetworkClient.doConnect(NetworkClient.java:157)
	at sun.net.www.http.HttpClient.openServer(HttpClient.java:389)
	at sun.net.www.http.HttpClient.openServer(HttpClient.java:516)
	at sun.net.www.http.HttpClient.<init>(HttpClient.java:233)
	at sun.net.www.http.HttpClient.New(HttpClient.java:306)
	at sun.net.www.http.HttpClient.New(HttpClient.java:318)
	at sun.net.www.protocol.http.HttpURLConnection.getNewHttpClient(HttpURLConnection.java:788)
	at sun.net.www.protocol.http.HttpURLConnection.plainConnect(HttpURLConnection.java:729)
	at sun.net.www.protocol.http.HttpURLConnection.connect(HttpURLConnection.java:654)
	at sun.net.www.protocol.http.HttpURLConnection.getInputStream(HttpURLConnection.java:977)
	at java.net.HttpURLConnection.getResponseCode(HttpURLConnection.java:373)
	at org.apache.maven.wagon.providers.http.LightweightHttpWagon.fillInputData(LightweightHttpWagon.java:115)
	... 12 more
[ERROR] 
[ERROR] Re-run Maven using the -X switch to enable full debug logging.
[ERROR] 
[ERROR] For more information about the errors and possible solutions, please read the following
articles:
[ERROR] [Help 1] http://cwiki.apache.org/confluence/display/MAVEN/ArtifactResolutionException
EMMA: locking coverage output file [/home/hudson/workspace/maven-3.0.x-ITs/label/ubuntu/core-integration-tests/target/test-classes/it0041/coverage.ec]
...
EMMA: runtime coverage data merged into [/home/hudson/workspace/maven-3.0.x-ITs/label/ubuntu/core-integration-tests/target/test-classes/it0041/coverage.ec]
{in 20 ms}
	at org.apache.maven.it.Verifier.executeGoals(Verifier.java:1326)
	at org.apache.maven.it.Verifier.executeGoal(Verifier.java:1164)
	at org.apache.maven.it.Verifier.executeGoal(Verifier.java:1158)
	at org.apache.maven.it.MavenIT0041ArtifactTypeFromPluginExtensionTest.testit0041(MavenIT0041ArtifactTypeFromPluginExtensionTest.java:52)
	at sun.reflect.NativeMethodAccessorImpl.invoke0(Native Method)
	at sun.reflect.NativeMethodAccessorImpl.invoke(NativeMethodAccessorImpl.java:39)
	at sun.reflect.DelegatingMethodAccessorImpl.invoke(DelegatingMethodAccessorImpl.java:25)
	at java.lang.reflect.Method.invoke(Method.java:597)
	at junit.framework.TestCase.runTest(TestCase.java:164)
	at org.apache.maven.it.AbstractMavenIntegrationTestCase.runTest(AbstractMavenIntegrationTestCase.java:198)
	at junit.framework.TestCase.runBare(TestCase.java:130)
	at junit.framework.TestResult$1.protect(TestResult.java:106)
	at junit.framework.TestResult.runProtected(TestResult.java:124)
	at junit.framework.TestResult.run(TestResult.java:109)
	at junit.framework.TestCase.run(TestCase.java:120)
	at junit.framework.TestSuite.runTest(TestSuite.java:230)
	at junit.framework.TestSuite.run(TestSuite.java:225)
	at junit.framework.TestSuite.runTest(TestSuite.java:230)
	at junit.framework.TestSuite.run(TestSuite.java:225)
	at sun.reflect.NativeMethodAccessorImpl.invoke0(Native Method)
	at sun.reflect.NativeMethodAccessorImpl.invoke(NativeMethodAccessorImpl.java:39)
	at sun.reflect.DelegatingMethodAccessorImpl.invoke(DelegatingMethodAccessorImpl.java:25)
	at java.lang.reflect.Method.invoke(Method.java:597)
	at org.apache.maven.surefire.junit.JUnitTestSet.execute(JUnitTestSet.java:213)
	at org.apache.maven.surefire.suite.AbstractDirectoryTestSuite.executeTestSet(AbstractDirectoryTestSuite.java:140)
	at org.apache.maven.surefire.suite.AbstractDirectoryTestSuite.execute(AbstractDirectoryTestSuite.java:127)
	at org.apache.maven.surefire.Surefire.run(Surefire.java:177)
	at sun.reflect.NativeMethodAccessorImpl.invoke0(Native Method)
	at sun.reflect.NativeMethodAccessorImpl.invoke(NativeMethodAccessorImpl.java:39)
	at sun.reflect.DelegatingMethodAccessorImpl.invoke(DelegatingMethodAccessorImpl.java:25)
	at java.lang.reflect.Method.invoke(Method.java:597)
	at org.apache.maven.surefire.booter.SurefireBooter.runSuitesInProcess(SurefireBooter.java:345)
	at org.apache.maven.surefire.booter.SurefireBooter.run(SurefireBooter.java:241)
	at org.apache.maven.plugin.surefire.SurefirePlugin.execute(SurefirePlugin.java:537)
	at org.apache.maven.plugin.DefaultBuildPluginManager.executeMojo(DefaultBuildPluginManager.java:105)
	at org.apache.maven.lifecycle.DefaultLifecycleExecutor.execute(DefaultLifecycleExecutor.java:562)
	at org.apache.maven.lifecycle.DefaultLifecycleExecutor.execute(DefaultLifecycleExecutor.java:317)
	at org.apache.maven.DefaultMaven.doExecute(DefaultMaven.java:247)
	at org.apache.maven.DefaultMaven.execute(DefaultMaven.java:104)
	at org.apache.maven.cli.MavenCli.execute(MavenCli.java:427)
	at org.apache.maven.cli.MavenCli.doMain(MavenCli.java:157)
	at org.apache.maven.cli.MavenCli.main(MavenCli.java:121)
	at sun.reflect.NativeMethodAccessorImpl.invoke0(Native Method)
	at sun.reflect.NativeMethodAccessorImpl.invoke(NativeMethodAccessorImpl.java:39)
	at sun.reflect.DelegatingMethodAccessorImpl.invoke(DelegatingMethodAccessorImpl.java:25)
	at java.lang.reflect.Method.invoke(Method.java:597)
	at org.codehaus.plexus.classworlds.launcher.Launcher.launchEnhanced(Launcher.java:290)
	at org.codehaus.plexus.classworlds.launcher.Launcher.launch(Launcher.java:230)
	at org.codehaus.plexus.classworlds.launcher.Launcher.mainWithExitCode(Launcher.java:409)
	at org.codehaus.plexus.classworlds.launcher.Launcher.main(Launcher.java:352)


Results :

Tests in error: 
  testitMNG507(org.apache.maven.it.MavenITmng0507ArtifactRelocationTest)
  testit0041(org.apache.maven.it.MavenIT0041ArtifactTypeFromPluginExtensionTest)

Tests run: 543, Failures: 0, Errors: 2, Skipped: 0

[INFO] ------------------------------------------------------------------------
[INFO] BUILD FAILURE
[INFO] ------------------------------------------------------------------------
[INFO] Total time: 34:50.244s
[INFO] Finished at: Fri Jan 22 11:23:47 CST 2010
[INFO] Final Memory: 7M/47M
[INFO] ------------------------------------------------------------------------
[ERROR] Failed to execute goal org.apache.maven.plugins:maven-surefire-plugin:2.4.3:test (default-test)
on project core-it-suite: There are test failures.

Please refer to /home/hudson/workspace/maven-3.0.x-ITs/label/ubuntu/core-integration-tests/target/surefire-reports
for the individual test results.
-> [Help 1]
org.apache.maven.lifecycle.LifecycleExecutionException: Failed to execute goal org.apache.maven.plugins:maven-surefire-plugin:2.4.3:test
(default-test) on project core-it-suite: There are test failures.

Please refer to /home/hudson/workspace/maven-3.0.x-ITs/label/ubuntu/core-integration-tests/target/surefire-reports
for the individual test results.
	at org.apache.maven.lifecycle.DefaultLifecycleExecutor.execute(DefaultLifecycleExecutor.java:566)
	at org.apache.maven.lifecycle.DefaultLifecycleExecutor.execute(DefaultLifecycleExecutor.java:317)
	at org.apache.maven.DefaultMaven.doExecute(DefaultMaven.java:247)
	at org.apache.maven.DefaultMaven.execute(DefaultMaven.java:104)
	at org.apache.maven.cli.MavenCli.execute(MavenCli.java:427)
	at org.apache.maven.cli.MavenCli.doMain(MavenCli.java:157)
	at org.apache.maven.cli.MavenCli.main(MavenCli.java:121)
	at sun.reflect.NativeMethodAccessorImpl.invoke0(Native Method)
	at sun.reflect.NativeMethodAccessorImpl.invoke(NativeMethodAccessorImpl.java:39)
	at sun.reflect.DelegatingMethodAccessorImpl.invoke(DelegatingMethodAccessorImpl.java:25)
	at java.lang.reflect.Method.invoke(Method.java:597)
	at org.codehaus.plexus.classworlds.launcher.Launcher.launchEnhanced(Launcher.java:290)
	at org.codehaus.plexus.classworlds.launcher.Launcher.launch(Launcher.java:230)
	at org.codehaus.plexus.classworlds.launcher.Launcher.mainWithExitCode(Launcher.java:409)
	at org.codehaus.plexus.classworlds.launcher.Launcher.main(Launcher.java:352)
Caused by: org.apache.maven.plugin.MojoFailureException: There are test failures.

Please refer to /home/hudson/workspace/maven-3.0.x-ITs/label/ubuntu/core-integration-tests/target/surefire-reports
for the individual test results.
	at org.apache.maven.plugin.surefire.SurefirePlugin.execute(SurefirePlugin.java:575)
	at org.apache.maven.plugin.DefaultBuildPluginManager.executeMojo(DefaultBuildPluginManager.java:105)
	at org.apache.maven.lifecycle.DefaultLifecycleExecutor.execute(DefaultLifecycleExecutor.java:562)
	... 14 more
[ERROR] 
[ERROR] Re-run Maven using the -X switch to enable full debug logging.
[ERROR] 
[ERROR] For more information about the errors and possible solutions, please read the following
articles:
[ERROR] [Help 1] http://cwiki.apache.org/confluence/display/MAVEN/MojoFailureException
Recording Emma reports core-integration-tests/target/site/emma/coverage.xml


Mime
View raw message