maven-notifications mailing list archives

Site index · List index
Message view « Date » · « Thread »
Top « Date » · « Thread »
From Hudson <Hud...@sonatype.org>
Subject Build failed in Hudson: surefire » ubuntu #50
Date Mon, 18 Jan 2010 07:04:48 GMT
See <http://grid.sonatype.org/ci/job/surefire/./label=ubuntu/50/changes>

Changes:

[stephenc] switch to the latest release versions of surefire and failsafe

------------------------------------------
[...truncated 421 lines...]
[INFO] 
[INFO] --- maven-clean-plugin:2.4:clean (default-clean) @ surefire-api ---
[INFO] Deleting /home/hudson/workspace/surefire/label/ubuntu/trunk/surefire-api/target
[INFO] 
[INFO] --- maven-remote-resources-plugin:1.0:process (default) @ surefire-api ---
[INFO] 
[INFO] --- maven-resources-plugin:2.3:resources (default-resources) @ surefire-api ---
Downloading: http://repository.sonatype.org:8081/content/groups/sonatype-public-grid/org/apache/maven/plugins/maven-resources-plugin/2.3/maven-resources-plugin-2.3.pom
5 KB downloaded at 73.8 KB/sec
Downloading: http://repository.sonatype.org:8081/content/groups/sonatype-public-grid/org/apache/maven/plugins/maven-plugins/12/maven-plugins-12.pom
12 KB downloaded at 234.1 KB/sec
Downloading: http://repository.sonatype.org:8081/content/groups/sonatype-public-grid/org/apache/maven/maven-parent/9/maven-parent-9.pom
33 KB downloaded at 654.4 KB/sec
Downloading: http://repository.sonatype.org:8081/content/groups/sonatype-public-grid/org/apache/maven/shared/maven-filtering/1.0-beta-2/maven-filtering-1.0-beta-2.pom
4 KB downloaded at 80.3 KB/sec
Downloading: http://repository.sonatype.org:8081/content/groups/sonatype-public-grid/org/apache/maven/shared/maven-shared-components/10/maven-shared-components-10.pom
9 KB downloaded at 149.7 KB/sec
Downloading: http://repository.sonatype.org:8081/content/groups/sonatype-public-grid/org/codehaus/plexus/plexus-interpolation/1.6/plexus-interpolation-1.6.pom
3 KB downloaded at 45.1 KB/sec
Downloading: http://repository.sonatype.org:8081/content/groups/sonatype-public-grid/org/apache/maven/shared/maven-filtering/1.0-beta-2/maven-filtering-1.0-beta-2.jar
33 KB downloaded at 11.2 KB/sec
Downloading: http://repository.sonatype.org:8081/content/groups/sonatype-public-grid/org/codehaus/plexus/plexus-interpolation/1.6/plexus-interpolation-1.6.jar
50 KB downloaded at 151.9 KB/sec
[INFO] Using 'UTF-8' encoding to copy filtered resources.
[INFO] Copying 1 resource
[INFO] Copying 3 resources
[INFO] 
[INFO] --- maven-compiler-plugin:2.0.2:compile (default-compile) @ surefire-api ---
Downloading: http://repository.sonatype.org:8081/content/groups/sonatype-public-grid/org/apache/maven/plugins/maven-compiler-plugin/2.0.2/maven-compiler-plugin-2.0.2.pom
3 KB downloaded at 41.3 KB/sec
Downloading: http://repository.sonatype.org:8081/content/groups/sonatype-public-grid/org/apache/maven/maven-plugin-api/2.0/maven-plugin-api-2.0.pom
601 B downloaded at 7.4 KB/sec
Downloading: http://repository.sonatype.org:8081/content/groups/sonatype-public-grid/org/codehaus/plexus/plexus-compiler-api/1.5.3/plexus-compiler-api-1.5.3.pom
624 B downloaded at 11.5 KB/sec
Downloading: http://repository.sonatype.org:8081/content/groups/sonatype-public-grid/org/codehaus/plexus/plexus-compiler/1.5.3/plexus-compiler-1.5.3.pom
2 KB downloaded at 20.9 KB/sec
Downloading: http://repository.sonatype.org:8081/content/groups/sonatype-public-grid/org/codehaus/plexus/plexus-compiler-manager/1.5.3/plexus-compiler-manager-1.5.3.pom
634 B downloaded at 8.8 KB/sec
Downloading: http://repository.sonatype.org:8081/content/groups/sonatype-public-grid/org/codehaus/plexus/plexus-compiler-javac/1.5.3/plexus-compiler-javac-1.5.3.pom
797 B downloaded at 14.4 KB/sec
Downloading: http://repository.sonatype.org:8081/content/groups/sonatype-public-grid/org/codehaus/plexus/plexus-compilers/1.5.3/plexus-compilers-1.5.3.pom
8 KB downloaded at 140.9 KB/sec
Downloading: http://repository.sonatype.org:8081/content/groups/sonatype-public-grid/org/codehaus/plexus/plexus-utils/1.0.5/plexus-utils-1.0.5.pom
918 B downloaded at 14.7 KB/sec
Downloading: http://repository.sonatype.org:8081/content/groups/sonatype-public-grid/org/codehaus/plexus/plexus-utils/1.0.4/plexus-utils-1.0.4.jar
160 KB downloaded at 612.9 KB/sec
Downloading: http://repository.sonatype.org:8081/content/groups/sonatype-public-grid/org/codehaus/plexus/plexus-compiler-api/1.5.3/plexus-compiler-api-1.5.3.jar
20 KB downloaded at 81.9 KB/sec
Downloading: http://repository.sonatype.org:8081/content/groups/sonatype-public-grid/org/codehaus/plexus/plexus-compiler-manager/1.5.3/plexus-compiler-manager-1.5.3.jar
6 KB downloaded at 95.8 KB/sec
Downloading: http://repository.sonatype.org:8081/content/groups/sonatype-public-grid/org/codehaus/plexus/plexus-compiler-javac/1.5.3/plexus-compiler-javac-1.5.3.jar
14 KB downloaded at 181.0 KB/sec
[INFO] Compiling 34 source files to /home/hudson/workspace/surefire/label/ubuntu/trunk/surefire-api/target/classes
[INFO] 
[INFO] --- maven-resources-plugin:2.3:testResources (default-testResources) @ surefire-api
---
[INFO] Using 'UTF-8' encoding to copy filtered resources.
[INFO] skip non existing resourceDirectory /home/hudson/workspace/surefire/label/ubuntu/trunk/surefire-api/src/test/resources
[INFO] Copying 3 resources
[INFO] 
[INFO] --- maven-compiler-plugin:2.0.2:testCompile (default-testCompile) @ surefire-api ---
[INFO] Compiling 11 source files to /home/hudson/workspace/surefire/label/ubuntu/trunk/surefire-api/target/test-classes
[INFO] 
[INFO] --- maven-surefire-plugin:2.5:test (default-test) @ surefire-api ---
Downloading: http://repository.sonatype.org:8081/content/groups/sonatype-public-grid/org/apache/maven/plugins/maven-surefire-plugin/2.5/maven-surefire-plugin-2.5.pom
8 KB downloaded at 2.7 KB/sec
Downloading: http://repository.sonatype.org:8081/content/groups/sonatype-public-grid/org/apache/maven/surefire/surefire/2.5/surefire-2.5.pom
7 KB downloaded at 1.0 KB/sec
Downloading: http://repository.sonatype.org:8081/content/groups/sonatype-public-grid/org/apache/maven/maven-plugin-api/2.0.9/maven-plugin-api-2.0.9.pom
2 KB downloaded at 18.5 KB/sec
Downloading: http://repository.sonatype.org:8081/content/groups/sonatype-public-grid/org/apache/maven/maven/2.0.9/maven-2.0.9.pom
19 KB downloaded at 96.7 KB/sec
Downloading: http://repository.sonatype.org:8081/content/groups/sonatype-public-grid/org/apache/maven/surefire/surefire-booter/2.5/surefire-booter-2.5.pom
2 KB downloaded at 2.4 KB/sec
Downloading: http://repository.sonatype.org:8081/content/groups/sonatype-public-grid/org/apache/maven/surefire/surefire-api/2.5/surefire-api-2.5.pom
3 KB downloaded at 2.8 KB/sec
Downloading: http://repository.sonatype.org:8081/content/groups/sonatype-public-grid/org/apache/maven/maven-artifact/2.0.9/maven-artifact-2.0.9.pom
2 KB downloaded at 14.9 KB/sec
Downloading: http://repository.sonatype.org:8081/content/groups/sonatype-public-grid/org/apache/maven/maven-project/2.0.9/maven-project-2.0.9.pom
3 KB downloaded at 31.9 KB/sec
Downloading: http://repository.sonatype.org:8081/content/groups/sonatype-public-grid/org/apache/maven/maven-settings/2.0.9/maven-settings-2.0.9.pom
3 KB downloaded at 7.6 KB/sec
Downloading: http://repository.sonatype.org:8081/content/groups/sonatype-public-grid/org/apache/maven/maven-model/2.0.9/maven-model-2.0.9.pom
4 KB downloaded at 6.2 KB/sec
Downloading: http://repository.sonatype.org:8081/content/groups/sonatype-public-grid/org/apache/maven/maven-profile/2.0.9/maven-profile-2.0.9.pom
3 KB downloaded at 11.7 KB/sec
Downloading: http://repository.sonatype.org:8081/content/groups/sonatype-public-grid/org/apache/maven/maven-artifact-manager/2.0.9/maven-artifact-manager-2.0.9.pom
3 KB downloaded at 22.0 KB/sec
Downloading: http://repository.sonatype.org:8081/content/groups/sonatype-public-grid/org/apache/maven/maven-repository-metadata/2.0.9/maven-repository-metadata-2.0.9.pom
2 KB downloaded at 11.4 KB/sec
Downloading: http://repository.sonatype.org:8081/content/groups/sonatype-public-grid/org/apache/maven/maven-plugin-registry/2.0.9/maven-plugin-registry-2.0.9.pom
2 KB downloaded at 8.9 KB/sec
Downloading: http://repository.sonatype.org:8081/content/groups/sonatype-public-grid/org/apache/maven/maven-core/2.0.9/maven-core-2.0.9.pom
8 KB downloaded at 46.1 KB/sec
Downloading: http://repository.sonatype.org:8081/content/groups/sonatype-public-grid/org/apache/maven/maven-plugin-parameter-documenter/2.0.9/maven-plugin-parameter-documenter-2.0.9.pom
2 KB downloaded at 13.8 KB/sec
Downloading: http://repository.sonatype.org:8081/content/groups/sonatype-public-grid/org/apache/maven/wagon/wagon-webdav/1.0-beta-2/wagon-webdav-1.0-beta-2.pom
2 KB downloaded at 2.7 KB/sec
Downloading: http://repository.sonatype.org:8081/content/groups/sonatype-public-grid/slide/slide-webdavlib/2.1/slide-webdavlib-2.1.pom
648 B downloaded at 2.1 KB/sec
Downloading: http://repository.sonatype.org:8081/content/groups/sonatype-public-grid/commons-httpclient/commons-httpclient/2.0.2/commons-httpclient-2.0.2.pom
7 KB downloaded at 29.5 KB/sec
Downloading: http://repository.sonatype.org:8081/content/groups/sonatype-public-grid/commons-logging/commons-logging/1.0.3/commons-logging-1.0.3.pom
866 B downloaded at 6.3 KB/sec
Downloading: http://repository.sonatype.org:8081/content/groups/sonatype-public-grid/jdom/jdom/1.0/jdom-1.0.pom
2 KB downloaded at 0.8 KB/sec
Downloading: http://repository.sonatype.org:8081/content/groups/sonatype-public-grid/de/zeigermann/xml/xml-im-exporter/1.1/xml-im-exporter-1.1.pom
248 B downloaded at 0.3 KB/sec
Downloading: http://repository.sonatype.org:8081/content/groups/sonatype-public-grid/commons-logging/commons-logging/1.0.4/commons-logging-1.0.4.pom
6 KB downloaded at 54.7 KB/sec
Downloading: http://repository.sonatype.org:8081/content/groups/sonatype-public-grid/org/apache/maven/reporting/maven-reporting-api/2.0.9/maven-reporting-api-2.0.9.pom
2 KB downloaded at 11.5 KB/sec
Downloading: http://repository.sonatype.org:8081/content/groups/sonatype-public-grid/org/apache/maven/reporting/maven-reporting/2.0.9/maven-reporting-2.0.9.pom
2 KB downloaded at 9.6 KB/sec
Downloading: http://repository.sonatype.org:8081/content/groups/sonatype-public-grid/org/apache/maven/doxia/doxia-sink-api/1.0-alpha-10/doxia-sink-api-1.0-alpha-10.pom
2 KB downloaded at 5.8 KB/sec
Downloading: http://repository.sonatype.org:8081/content/groups/sonatype-public-grid/org/apache/maven/doxia/doxia/1.0-alpha-10/doxia-1.0-alpha-10.pom
9 KB downloaded at 79.9 KB/sec
Downloading: http://repository.sonatype.org:8081/content/groups/sonatype-public-grid/org/apache/maven/maven-error-diagnostics/2.0.9/maven-error-diagnostics-2.0.9.pom
2 KB downloaded at 8.6 KB/sec
Downloading: http://repository.sonatype.org:8081/content/groups/sonatype-public-grid/org/apache/maven/maven-plugin-descriptor/2.0.9/maven-plugin-descriptor-2.0.9.pom
3 KB downloaded at 13.7 KB/sec
Downloading: http://repository.sonatype.org:8081/content/groups/sonatype-public-grid/org/apache/maven/maven-monitor/2.0.9/maven-monitor-2.0.9.pom
2 KB downloaded at 11.6 KB/sec
Downloading: http://repository.sonatype.org:8081/content/groups/sonatype-public-grid/org/apache/maven/maven-toolchain/2.0.9/maven-toolchain-2.0.9.pom
4 KB downloaded at 39.9 KB/sec
Downloading: http://repository.sonatype.org:8081/content/groups/sonatype-public-grid/org/apache/maven/surefire/surefire-booter/2.5/surefire-booter-2.5.jar
314 KB downloaded at 434.1 KB/sec
Downloading: http://repository.sonatype.org:8081/content/groups/sonatype-public-grid/org/apache/maven/surefire/surefire-api/2.5/surefire-api-2.5.jar
558 KB downloaded at 227.9 KB/sec
Downloading: http://repository.sonatype.org:8081/content/groups/sonatype-public-grid/org/apache/maven/wagon/wagon-webdav/1.0-beta-2/wagon-webdav-1.0-beta-2.jar
17 KB downloaded at 5.3 KB/sec
Downloading: http://repository.sonatype.org:8081/content/groups/sonatype-public-grid/slide/slide-webdavlib/2.1/slide-webdavlib-2.1.jar
169 KB downloaded at 223.7 KB/sec
Downloading: http://repository.sonatype.org:8081/content/groups/sonatype-public-grid/commons-httpclient/commons-httpclient/2.0.2/commons-httpclient-2.0.2.jar
221 KB downloaded at 366.8 KB/sec
Downloading: http://repository.sonatype.org:8081/content/groups/sonatype-public-grid/commons-logging/commons-logging/1.0.4/commons-logging-1.0.4.jar
38 KB downloaded at 408.0 KB/sec
Downloading: http://repository.sonatype.org:8081/content/groups/sonatype-public-grid/jdom/jdom/1.0/jdom-1.0.jar
150 KB downloaded at 1160.2 KB/sec
Downloading: http://repository.sonatype.org:8081/content/groups/sonatype-public-grid/de/zeigermann/xml/xml-im-exporter/1.1/xml-im-exporter-1.1.jar
24 KB downloaded at 71.7 KB/sec
Downloading: http://repository.sonatype.org:8081/content/groups/sonatype-public-grid/org/apache/maven/reporting/maven-reporting-api/2.0.9/maven-reporting-api-2.0.9.jar
10 KB downloaded at 10.4 KB/sec
Downloading: http://repository.sonatype.org:8081/content/groups/sonatype-public-grid/org/apache/maven/doxia/doxia-sink-api/1.0-alpha-10/doxia-sink-api-1.0-alpha-10.jar
10 KB downloaded at 101.8 KB/sec
Downloading: http://repository.sonatype.org:8081/content/groups/sonatype-public-grid/org/apache/maven/surefire/surefire-junit/2.5/surefire-junit-2.5.pom
2 KB downloaded at 0.5 KB/sec
Downloading: http://repository.sonatype.org:8081/content/groups/sonatype-public-grid/org/apache/maven/surefire/surefire-providers/2.5/surefire-providers-2.5.pom
2 KB downloaded at 2.0 KB/sec
Downloading: http://repository.sonatype.org:8081/content/groups/sonatype-public-grid/org/apache/maven/surefire/surefire-junit/2.5/surefire-junit-2.5.jar
16 KB downloaded at 5.8 KB/sec
[INFO] Surefire report directory: /home/hudson/workspace/surefire/label/ubuntu/trunk/surefire-api/target/surefire-reports

-------------------------------------------------------
 T E S T S
-------------------------------------------------------
Running org.apache.maven.surefire.report.XMLReporterTest
Tests run: 2, Failures: 0, Errors: 2, Skipped: 0, Time elapsed: 0.076 sec <<< FAILURE!
testTestError(org.apache.maven.surefire.report.XMLReporterTest)  Time elapsed: 0.028 sec 
<<< ERROR!
java.lang.ClassCastException: org.apache.maven.surefire.shade.org.codehaus.plexus.util.xml.Xpp3Dom
cannot be cast to org.codehaus.plexus.util.xml.Xpp3Dom
	at org.apache.maven.surefire.report.XMLReporterTest.assertResult(XMLReporterTest.java:66)
	at org.apache.maven.surefire.report.XMLReporterTest.testTestError(XMLReporterTest.java:52)

testTestFailed(org.apache.maven.surefire.report.XMLReporterTest)  Time elapsed: 0.006 sec
 <<< ERROR!
java.lang.ClassCastException: org.apache.maven.surefire.shade.org.codehaus.plexus.util.xml.Xpp3Dom
cannot be cast to org.codehaus.plexus.util.xml.Xpp3Dom
	at org.apache.maven.surefire.report.XMLReporterTest.assertResult(XMLReporterTest.java:66)
	at org.apache.maven.surefire.report.XMLReporterTest.testTestFailed(XMLReporterTest.java:61)

Running org.apache.maven.surefire.util.UrlUtilsTest
Tests run: 3, Failures: 0, Errors: 0, Skipped: 0, Time elapsed: 0.018 sec
Running org.apache.maven.surefire.report.PojoStackTraceWriterTest
Tests run: 2, Failures: 0, Errors: 0, Skipped: 0, Time elapsed: 0.008 sec
Running org.apache.maven.surefire.assertion.ComparisonToolTest
Tests run: 16, Failures: 0, Errors: 0, Skipped: 0, Time elapsed: 0.062 sec
Running org.apache.maven.surefire.report.ForkingConsoleReporterTest
Running name (of group)
Tests run: 4, Failures: 0, Errors: 0, Skipped: 0, Time elapsed: 0.025 sec
Running org.apache.maven.surefire.util.SurefireDirectoryScannerTest
Tests run: 1, Failures: 0, Errors: 0, Skipped: 0, Time elapsed: 0.502 sec
Running org.apache.maven.surefire.assertion.SurefireAssertTest
Tests run: 96, Failures: 0, Errors: 0, Skipped: 0, Time elapsed: 0.063 sec

Results :

Tests in error: 
  testTestError(org.apache.maven.surefire.report.XMLReporterTest)
  testTestFailed(org.apache.maven.surefire.report.XMLReporterTest)

Tests run: 124, Failures: 0, Errors: 2, Skipped: 0

[INFO] ------------------------------------------------------------------------
[INFO] Reactor Summary:
[INFO] 
[INFO] SureFire .......................................... SUCCESS [1:00.872s]
[INFO] SureFire API ...................................... FAILURE [59.087s]
[INFO] SureFire Booter ................................... SKIPPED
[INFO] SureFire Providers ................................ SKIPPED
[INFO] SureFire JUnit Runner ............................. SKIPPED
[INFO] SureFire JUnit4 Runner ............................ SKIPPED
[INFO] SureFire JUnitCore Runner ......................... SKIPPED
[INFO] SureFire TestNG Runner ............................ SKIPPED
[INFO] Maven Surefire Plugin ............................. SKIPPED
[INFO] Maven Failsafe Plugin ............................. SKIPPED
[INFO] Maven Surefire Report Plugin ...................... SKIPPED
[INFO] Maven Surefire Integration Tests .................. SKIPPED
[INFO] ------------------------------------------------------------------------
[INFO] BUILD FAILURE
[INFO] ------------------------------------------------------------------------
[INFO] Total time: 2:01.387s
[INFO] Finished at: Mon Jan 18 00:53:28 CST 2010
[INFO] Final Memory: 10M/67M
[INFO] ------------------------------------------------------------------------
[ERROR] Failed to execute goal org.apache.maven.plugins:maven-surefire-plugin:2.5:test (default-test)
on project surefire-api: There are test failures.

Please refer to /home/hudson/workspace/surefire/label/ubuntu/trunk/surefire-api/target/surefire-reports
for the individual test results.
-> [Help 1]
org.apache.maven.lifecycle.LifecycleExecutionException: Failed to execute goal org.apache.maven.plugins:maven-surefire-plugin:2.5:test
(default-test) on project surefire-api: There are test failures.

Please refer to /home/hudson/workspace/surefire/label/ubuntu/trunk/surefire-api/target/surefire-reports
for the individual test results.
	at org.apache.maven.lifecycle.DefaultLifecycleExecutor.execute(DefaultLifecycleExecutor.java:566)
	at org.apache.maven.lifecycle.DefaultLifecycleExecutor.execute(DefaultLifecycleExecutor.java:317)
	at org.apache.maven.DefaultMaven.doExecute(DefaultMaven.java:247)
	at org.apache.maven.DefaultMaven.execute(DefaultMaven.java:104)
	at org.apache.maven.cli.MavenCli.execute(MavenCli.java:423)
	at org.apache.maven.cli.MavenCli.doMain(MavenCli.java:158)
	at org.apache.maven.cli.MavenCli.main(MavenCli.java:123)
	at sun.reflect.NativeMethodAccessorImpl.invoke0(Native Method)
	at sun.reflect.NativeMethodAccessorImpl.invoke(NativeMethodAccessorImpl.java:39)
	at sun.reflect.DelegatingMethodAccessorImpl.invoke(DelegatingMethodAccessorImpl.java:25)
	at java.lang.reflect.Method.invoke(Method.java:597)
	at org.codehaus.plexus.classworlds.launcher.Launcher.launchEnhanced(Launcher.java:290)
	at org.codehaus.plexus.classworlds.launcher.Launcher.launch(Launcher.java:230)
	at org.codehaus.plexus.classworlds.launcher.Launcher.mainWithExitCode(Launcher.java:409)
	at org.codehaus.plexus.classworlds.launcher.Launcher.main(Launcher.java:352)
Caused by: org.apache.maven.plugin.MojoFailureException: There are test failures.

Please refer to /home/hudson/workspace/surefire/label/ubuntu/trunk/surefire-api/target/surefire-reports
for the individual test results.
	at org.apache.maven.plugin.surefire.SurefirePlugin.execute(SurefirePlugin.java:629)
	at org.apache.maven.plugin.DefaultBuildPluginManager.executeMojo(DefaultBuildPluginManager.java:105)
	at org.apache.maven.lifecycle.DefaultLifecycleExecutor.execute(DefaultLifecycleExecutor.java:562)
	... 14 more
[ERROR] 
[ERROR] Re-run Maven using the -X switch to enable full debug logging.
[ERROR] 
[ERROR] For more information about the errors and possible solutions, please read the following
articles:
[ERROR] [Help 1] http://cwiki.apache.org/confluence/display/MAVEN/MojoFailureException
[ERROR] 
[ERROR] After correcting the problems, you can resume the build with the command
[ERROR]   mvn <goals> -rf :surefire-api


Mime
View raw message