maven-notifications mailing list archives

Site index · List index
Message view « Date » · « Thread »
Top « Date » · « Thread »
From Apache Jenkins Server <jenk...@builds.apache.org>
Subject Build failed in Jenkins: maven-plugins-ITs-m3 #383
Date Thu, 08 Mar 2012 21:53:08 GMT
See <https://builds.apache.org/job/maven-plugins-ITs-m3/383/changes>

Changes:

[olamy] [MSHADE-105] Classes processed by the relocator still have references to the original
classes in their constant pools.
Submitted by Andreas Veithen.

------------------------------------------
[...truncated 9520 lines...]
[INFO] Working on model: src/main/mdo/supplemental-model.mdo
[INFO] Generating current version: 1.0.0
[INFO] 
[INFO] --- maven-plugin-plugin:2.7:descriptor (default-descriptor) @ maven-remote-resources-plugin
---
[INFO] Using 'UTF-8' encoding to read mojo metadata.
[INFO] Applying mojo extractor for language: java
[INFO] Mojo extractor for language: java found 3 mojo descriptors.
[INFO] Applying mojo extractor for language: bsh
[INFO] Mojo extractor for language: bsh found 0 mojo descriptors.
[INFO] 
[INFO] --- maven-remote-resources-plugin:1.1:process (default) @ maven-remote-resources-plugin
---
[INFO] 
[INFO] --- maven-resources-plugin:2.4.3:resources (default-resources) @ maven-remote-resources-plugin
---
[INFO] Using 'UTF-8' encoding to copy filtered resources.
[INFO] Copying 1 resource
[INFO] Copying 3 resources
[INFO] 
[INFO] --- maven-compiler-plugin:2.3.2:compile (default-compile) @ maven-remote-resources-plugin
---
[INFO] Compiling 11 source files to <https://builds.apache.org/job/maven-plugins-ITs-m3/ws/maven-remote-resources-plugin/target/classes>
[INFO] 
[INFO] --- maven-resources-plugin:2.4.3:testResources (default-testResources) @ maven-remote-resources-plugin
---
[INFO] Using 'UTF-8' encoding to copy filtered resources.
[INFO] Copying 7 resources
[INFO] Copying 46 resources
[INFO] ..SUCCESS (2.9 s)
[INFO] Building: skip-install/pom.xml
[INFO] Copying 1 resource
[INFO] Copying 3 resources
[INFO] 
[INFO] --- maven-compiler-plugin:2.3.2:testCompile (default-testCompile) @ maven-remote-resources-plugin
---
[INFO] Compiling 18 source files to <https://builds.apache.org/job/maven-plugins-ITs-m3/ws/maven-remote-resources-plugin/target/test-classes>
[INFO] 
[INFO] --- maven-surefire-plugin:2.7.2:test (default-test) @ maven-remote-resources-plugin
---
[INFO] Surefire report directory: <https://builds.apache.org/job/maven-plugins-ITs-m3/ws/maven-remote-resources-plugin/target/surefire-reports>

-------------------------------------------------------
 T E S T S
-------------------------------------------------------
Running org.apache.maven.plugin.resources.remote.RemoteResourcesMojoTest
[INFO] ..SUCCESS (5.1 s)
[INFO] Building: MSITE-507/pom.xml
Tests run: 10, Failures: 0, Errors: 0, Skipped: 0, Time elapsed: 1.509 sec

Results :

Tests run: 10, Failures: 0, Errors: 0, Skipped: 0

[INFO] 
[INFO] --- maven-jar-plugin:2.3.1:jar (default-jar) @ maven-remote-resources-plugin ---
[INFO] Building jar: <https://builds.apache.org/job/maven-plugins-ITs-m3/ws/maven-remote-resources-plugin/target/maven-remote-resources-plugin-1.3-SNAPSHOT.jar>
[INFO] 
[INFO] --- maven-plugin-plugin:2.7:addPluginArtifactMetadata (default-addPluginArtifactMetadata)
@ maven-remote-resources-plugin ---
[INFO] 
[INFO] --- maven-invoker-plugin:1.5:install (install-descriptor) @ maven-remote-resources-plugin
---
[INFO] ..SUCCESS (3.0 s)
[INFO] Building: local-repo-url/pom.xml
[INFO] Installing <https://builds.apache.org/job/maven-plugins-ITs-m3/ws/maven-remote-resources-plugin/pom.xml>
to <https://builds.apache.org/job/maven-plugins-ITs-m3/ws/maven-remote-resources-plugin/target/it-repo/org/apache/maven/plugins/maven-remote-resources-plugin/1.3-SNAPSHOT/maven-remote-resources-plugin-1.3-SNAPSHOT.pom>
[INFO] Installing <https://builds.apache.org/job/maven-plugins-ITs-m3/ws/maven-remote-resources-plugin/target/maven-remote-resources-plugin-1.3-SNAPSHOT.jar>
to <https://builds.apache.org/job/maven-plugins-ITs-m3/ws/maven-remote-resources-plugin/target/it-repo/org/apache/maven/plugins/maven-remote-resources-plugin/1.3-SNAPSHOT/maven-remote-resources-plugin-1.3-SNAPSHOT.jar>
[INFO] 
[INFO] --- maven-failsafe-plugin:2.9:integration-test (integration-tests) @ maven-remote-resources-plugin
---
[INFO] Failsafe report directory: <https://builds.apache.org/job/maven-plugins-ITs-m3/ws/maven-remote-resources-plugin/target/failsafe-reports>

-------------------------------------------------------
 T E S T S
-------------------------------------------------------
Running org.apache.maven.plugin.resources.remote.it.IT_GenerateFromBundleWithTypeAndClassifier
[INFO] ..SUCCESS (4.6 s)
[INFO] Building: project-setup/pom.xml
[INFO] ..SUCCESS (9.2 s)
[INFO] Building: settings-auto-exclude/pom.xml
[INFO] ..SUCCESS (4.0 s)
[INFO] Building: project-cloning-reactor/pom.xml
[INFO] ..SUCCESS (4.0 s)
[INFO] Building: script-accessibility/pom.xml
[INFO] ..SUCCESS (6.6 s)
[INFO] Building: project-cloning/pom.xml
[INFO] ..SUCCESS (6.8 s)
[INFO] Building: fail-ignore/pom.xml
[INFO] ..SUCCESS (4.1 s)
[INFO] Building: invocation-spaces/pom.xml
[INFO] ..SUCCESS (5.8 s)
[INFO] Building: local-repo-default/pom.xml
[INFO] ..SUCCESS (10.6 s)
[INFO] Building: script-classpath-duplicates/pom.xml
[INFO] ..SUCCESS (6.4 s)
[INFO] Building: integration-test-never-fails/pom.xml
[INFO] ..SUCCESS (4.1 s)
[INFO] Building: invoker-report/pom.xml
[INFO] ..SUCCESS (77.0 s)
[INFO] Building: no-version/pom.xml
[INFO] ..SUCCESS (11.4 s)
[INFO] Building: fail-ignore-with-verify/pom.xml
[INFO] ..SUCCESS (5.6 s)
[INFO] Building: MSITE-456/pom.xml
[INFO] ..SUCCESS (4.9 s)
[INFO] Building: fail-postbuild/pom.xml
[INFO] ..SUCCESS (4.8 s)
[INFO] Building: surefire-report/pom.xml
[INFO] ..SUCCESS (4.4 s)
[INFO] Building: selector-conditions/pom.xml
[INFO] ..SUCCESS (7.2 s)
[INFO] Building: invocation-multiple/pom.xml
[INFO] ..SUCCESS (8.7 s)
[INFO] 
[INFO] --- maven-invoker-plugin:1.5:verify (integration-test) @ maven-site-plugin ---
[INFO] -------------------------------------------------
[INFO] Build Summary:
[INFO]   Passed: 39, Failed: 0, Errors: 0, Skipped: 1
[INFO] -------------------------------------------------
[INFO] 
[INFO] --- maven-install-plugin:2.3.1:install (default-install) @ maven-site-plugin ---
[INFO] Installing <https://builds.apache.org/job/maven-plugins-ITs-m3/ws/maven-site-plugin/target/maven-site-plugin-3.1-SNAPSHOT.jar>
to /home/jenkins/.m2/repository/org/apache/maven/plugins/maven-site-plugin/3.1-SNAPSHOT/maven-site-plugin-3.1-SNAPSHOT.jar
[INFO] Installing <https://builds.apache.org/job/maven-plugins-ITs-m3/ws/maven-site-plugin/dependency-reduced-pom.xml>
to /home/jenkins/.m2/repository/org/apache/maven/plugins/maven-site-plugin/3.1-SNAPSHOT/maven-site-plugin-3.1-SNAPSHOT.pom
[INFO]                                                                         
[INFO] ------------------------------------------------------------------------
[INFO] Building Maven Plugins Aggregator 1-SNAPSHOT
[INFO] ------------------------------------------------------------------------
[WARNING] *****************************************************************
[WARNING] * Your build is requesting parallel execution, but project      *
[WARNING] * contains the following plugin(s) that are not marked as       *
[WARNING] * @threadSafe to support parallel building.                     *
[WARNING] * While this /may/ work fine, please look for plugin updates    *
[WARNING] * and/or request plugins be made thread-safe.                   *
[WARNING] * If reporting an issue, report it against the plugin in        *
[WARNING] * question, not against maven-core                              *
[WARNING] *****************************************************************
[WARNING] The following plugins are not marked @threadSafe in Maven Plugins Aggregator:
[WARNING] org.apache.maven.plugins:maven-remote-resources-plugin:1.1
[WARNING] *****************************************************************
[INFO] 
[INFO] --- maven-clean-plugin:2.4.1:clean (default-clean) @ maven-plugins-aggregator ---
[INFO] Deleting <https://builds.apache.org/job/maven-plugins-ITs-m3/ws/target>
[INFO] 
[INFO] --- maven-remote-resources-plugin:1.1:process (default) @ maven-plugins-aggregator
---
[INFO] 
[INFO] --- maven-install-plugin:2.3.1:install (default-install) @ maven-plugins-aggregator
---
[INFO] Installing <https://builds.apache.org/job/maven-plugins-ITs-m3/ws/pom.xml> to
/home/jenkins/.m2/repository/org/apache/maven/plugins/maven-plugins-aggregator/1-SNAPSHOT/maven-plugins-aggregator-1-SNAPSHOT.pom
[INFO] ..SUCCESS (17.6 s)
[INFO] Building: selector-scripts/pom.xml
[INFO] ..SUCCESS (5.8 s)
[INFO] Building: fail-build/pom.xml
[INFO] ..SUCCESS (4.2 s)
[INFO] Building: staging-pom/pom.xml
[INFO] ..SUCCESS (2.8 s)
[INFO] -------------------------------------------------
[INFO] Build Summary:
[INFO]   Passed: 40, Failed: 0, Errors: 0, Skipped: 0
[INFO] -------------------------------------------------
[INFO] 
[INFO] --- maven-install-plugin:2.3.1:install (default-install) @ maven-invoker-plugin ---
[INFO] Installing <https://builds.apache.org/job/maven-plugins-ITs-m3/ws/maven-invoker-plugin/target/maven-invoker-plugin-1.6-SNAPSHOT.jar>
to /home/jenkins/.m2/repository/org/apache/maven/plugins/maven-invoker-plugin/1.6-SNAPSHOT/maven-invoker-plugin-1.6-SNAPSHOT.jar
[INFO] Installing <https://builds.apache.org/job/maven-plugins-ITs-m3/ws/maven-invoker-plugin/pom.xml>
to /home/jenkins/.m2/repository/org/apache/maven/plugins/maven-invoker-plugin/1.6-SNAPSHOT/maven-invoker-plugin-1.6-SNAPSHOT.pom
Tests run: 1, Failures: 0, Errors: 0, Skipped: 0, Time elapsed: 130.946 sec
Running org.apache.maven.plugin.resources.remote.it.IT_RunOnlyAtExecutionRoot
Tests run: 1, Failures: 0, Errors: 0, Skipped: 0, Time elapsed: 6.154 sec
Running org.apache.maven.plugin.resources.remote.it.IT_CustomFilterDelimiter
Tests run: 1, Failures: 0, Errors: 0, Skipped: 0, Time elapsed: 2.436 sec
Running org.apache.maven.plugin.resources.remote.it.IT_BadDependencyPoms
Tests run: 1, Failures: 0, Errors: 0, Skipped: 0, Time elapsed: 2.573 sec
Running org.apache.maven.plugin.resources.remote.it.IT_GetDependencyProjects
Tests run: 1, Failures: 0, Errors: 0, Skipped: 0, Time elapsed: 5.867 sec
Running org.apache.maven.plugin.resources.remote.it.IT_GenerateFromBundle
Tests run: 1, Failures: 0, Errors: 0, Skipped: 0, Time elapsed: 2.363 sec
Running org.apache.maven.plugin.resources.remote.it.IT_GenerateFromOverride
Tests run: 1, Failures: 0, Errors: 0, Skipped: 0, Time elapsed: 2.385 sec
Running org.apache.maven.plugin.resources.remote.it.IT_SupplementalArtifact
Tests run: 1, Failures: 0, Errors: 0, Skipped: 0, Time elapsed: 6.235 sec
Running org.apache.maven.plugin.resources.remote.it.IT_FilterLocalOverride
Tests run: 1, Failures: 0, Errors: 0, Skipped: 0, Time elapsed: 2.32 sec

Results :

Tests run: 9, Failures: 0, Errors: 0, Skipped: 0

[WARNING] File encoding has not been set, using platform encoding ANSI_X3.4-1968, i.e. build
is platform dependent!
[INFO] 
[INFO] --- maven-failsafe-plugin:2.9:verify (integration-tests) @ maven-remote-resources-plugin
---
[INFO] Failsafe report directory: <https://builds.apache.org/job/maven-plugins-ITs-m3/ws/maven-remote-resources-plugin/target/failsafe-reports>
[WARNING] File encoding has not been set, using platform encoding ANSI_X3.4-1968, i.e. build
is platform dependent!
[INFO] 
[INFO] --- maven-install-plugin:2.3.1:install (default-install) @ maven-remote-resources-plugin
---
[INFO] Installing <https://builds.apache.org/job/maven-plugins-ITs-m3/ws/maven-remote-resources-plugin/target/maven-remote-resources-plugin-1.3-SNAPSHOT.jar>
to /home/jenkins/.m2/repository/org/apache/maven/plugins/maven-remote-resources-plugin/1.3-SNAPSHOT/maven-remote-resources-plugin-1.3-SNAPSHOT.jar
[INFO] Installing <https://builds.apache.org/job/maven-plugins-ITs-m3/ws/maven-remote-resources-plugin/pom.xml>
to /home/jenkins/.m2/repository/org/apache/maven/plugins/maven-remote-resources-plugin/1.3-SNAPSHOT/maven-remote-resources-plugin-1.3-SNAPSHOT.pom
[INFO] ------------------------------------------------------------------------
[INFO] Reactor Summary:
[INFO] 
[INFO] Maven Plugins ..................................... SUCCESS [16.563s]
[INFO] Maven ACR Plugin .................................. SUCCESS [40.899s]
[INFO] Maven Ant Plugin .................................. SUCCESS [1:38.570s]
[INFO] Maven AntRun Plugin ............................... SUCCESS [1:04.403s]
[INFO] Maven Eclipse Plugin .............................. SUCCESS [11:33.282s]
[INFO] Maven Assembly Plugin ............................. SUCCESS [13:25.901s]
[INFO] Maven Changelog Plugin ............................ SUCCESS [49.899s]
[INFO] Maven Changes Report Plugin ....................... SUCCESS [1:03.197s]
[INFO] Maven Checkstyle Plugin ........................... SUCCESS [1:44.830s]
[INFO] Maven Clean Plugin ................................ SUCCESS [19.598s]
[INFO] Maven Compiler Plugin ............................. SUCCESS [23.537s]
[INFO] Maven Dependency Plugin ........................... SUCCESS [2:33.890s]
[INFO] Maven Deploy Plugin ............................... SUCCESS [1:09.542s]
[INFO] Maven DOAP Plugin ................................. SUCCESS [20.728s]
[INFO] Maven Documentation Checker Plugin ................ SUCCESS [8.678s]
[INFO] Maven EAR Plugin .................................. SUCCESS [4:04.105s]
[INFO] Maven EJB Plugin .................................. SUCCESS [32.848s]
[INFO] Maven GPG Plugin .................................. SUCCESS [41.251s]
[INFO] Maven Help Plugin ................................. SUCCESS [40.598s]
[INFO] Maven IDEA Plugin ................................. SUCCESS [7.634s]
[INFO] Maven Install Plugin .............................. SUCCESS [41.942s]
[INFO] Maven JAR Plugin .................................. SUCCESS [1:16.799s]
[INFO] Maven Jarsigner Plugin ............................ SUCCESS [27.114s]
[INFO] Maven Javadoc Plugin .............................. SUCCESS [8:26.189s]
[INFO] Maven Linkcheck Plugin ............................ SUCCESS [2.467s]
[INFO] Maven One Plugin .................................. SUCCESS [2.430s]
[INFO] Maven Patch Plugin ................................ SUCCESS [14.765s]
[INFO] Maven PDF Plugin .................................. FAILURE [3:27.923s]
[INFO] Maven PMD Plugin .................................. SUCCESS [35.780s]
[INFO] Maven RAR Plugin .................................. SUCCESS [7.405s]
[INFO] Maven Reactor Plugin .............................. SUCCESS [2.672s]
[INFO] Maven Repository Plugin ........................... SUCCESS [2:46.028s]
[INFO] Maven Resources Plugin ............................ SUCCESS [58.806s]
[INFO] Maven Shade Plugin ................................ SUCCESS [2:09.066s]
[INFO] Maven Site Plugin 3 ............................... SUCCESS [7:09.129s]
[INFO] Maven Source Plugin ............................... SUCCESS [39.769s]
[INFO] Maven Stage Plugin ................................ SUCCESS [2.210s]
[INFO] Maven Toolchains Plugin ........................... SUCCESS [1.846s]
[INFO] Maven Verifier Plugin ............................. SUCCESS [11.380s]
[INFO] Maven WAR Plugin .................................. SUCCESS [1:25.451s]
[INFO] Maven Invoker Plugin .............................. SUCCESS [4:13.895s]
[INFO] Maven Project Info Reports Plugin ................. SUCCESS [1:52.016s]
[INFO] Maven Remote Resources Plugin ..................... SUCCESS [2:48.661s]
[INFO] Maven Plugins Aggregator .......................... SUCCESS [0.058s]
[INFO] ------------------------------------------------------------------------
[INFO] BUILD FAILURE
[INFO] ------------------------------------------------------------------------
[INFO] Total time: 28:18.752s (Wall Clock)
[INFO] Finished at: Thu Mar 08 21:53:07 UTC 2012
[INFO] Final Memory: 72M/1003M
[INFO] ------------------------------------------------------------------------
[WARNING] The requested profile "apache.snapshots" could not be activated because it does
not exist.
[ERROR] Failed to execute goal org.apache.maven.plugins:maven-invoker-plugin:1.5:run (integration-test)
on project maven-pdf-plugin: 1 build failed. -> [Help 1]
[ERROR] 
[ERROR] To see the full stack trace of the errors, re-run Maven with the -e switch.
[ERROR] Re-run Maven using the -X switch to enable full debug logging.
[ERROR] 
[ERROR] For more information about the errors and possible solutions, please read the following
articles:
[ERROR] [Help 1] http://cwiki.apache.org/confluence/display/MAVEN/MojoFailureException
[ERROR] 
[ERROR] After correcting the problems, you can resume the build with the command
[ERROR]   mvn <goals> -rf :maven-pdf-plugin
Build step 'Invoke top-level Maven targets' marked build as failure


Mime
View raw message