maven-notifications mailing list archives

Site index · List index
Message view « Date » · « Thread »
Top « Date » · « Thread »
From Apache Jenkins Server <jenk...@builds.apache.org>
Subject Build failed in Jenkins: Maven TLP » maven-surefire » empty_element_on_failure_with_ParameterizedTest #3
Date Tue, 09 Jun 2020 22:56:56 GMT
See https://builds.apache.org/job/maven-box/job/maven-surefire/job/empty_element_on_failure_with_ParameterizedTest/3/

Changes:

* Exclude H23
* [INFRA-20239] H23 should be ok now
* Revert: Use Java 7 JDK for all released Maven versions (135a0e16) due to
* Update Maven versions
* There's no M3.6.3 for Windows

All tests passed

Build log:
[...truncated 29966 lines...]
[2020-06-09T22:54:11.980Z]     at sun.reflect.NativeMethodAccessorImpl.invoke0 (Native Method)
[2020-06-09T22:54:11.980Z]     at sun.reflect.NativeMethodAccessorImpl.invoke (NativeMethodAccessorImpl.java:62)
[2020-06-09T22:54:11.980Z]     at sun.reflect.DelegatingMethodAccessorImpl.invoke (DelegatingMethodAccessorImpl.java:43)
[2020-06-09T22:54:11.980Z]     at java.lang.reflect.Method.invoke (Method.java:498)
[2020-06-09T22:54:11.980Z]     at org.codehaus.plexus.classworlds.launcher.Launcher.launchEnhanced
(Launcher.java:282)
[2020-06-09T22:54:11.980Z]     at org.codehaus.plexus.classworlds.launcher.Launcher.launch
(Launcher.java:225)
[2020-06-09T22:54:11.980Z]     at org.codehaus.plexus.classworlds.launcher.Launcher.mainWithExitCode
(Launcher.java:406)
[2020-06-09T22:54:11.980Z]     at org.codehaus.plexus.classworlds.launcher.Launcher.main (Launcher.java:347)
[2020-06-09T22:54:11.980Z] Caused by: org.apache.maven.plugin.MojoFailureException: There
are test failures.
[2020-06-09T22:54:11.980Z] 
[2020-06-09T22:54:11.980Z] Please refer to C:\Windows\System32\config\systemprofile\AppData\Local\Temp\jenkins-maven-box-maven-surefire-empty_element_on_failure_with_ParameterizedTest-3@2\surefire-its\target\failsafe-reports
for the individual test results.
[2020-06-09T22:54:11.980Z] Please refer to dump files (if any exist) [date].dump, [date]-jvmRun[N].dump
and [date].dumpstream.
[2020-06-09T22:54:11.980Z]     at org.apache.maven.plugin.surefire.SurefireHelper.throwException
(SurefireHelper.java:271)
[2020-06-09T22:54:11.980Z]     at org.apache.maven.plugin.surefire.SurefireHelper.reportExecution
(SurefireHelper.java:159)
[2020-06-09T22:54:11.980Z]     at org.apache.maven.plugin.failsafe.VerifyMojo.execute (VerifyMojo.java:192)
[2020-06-09T22:54:11.980Z]     at org.apache.maven.plugin.DefaultBuildPluginManager.executeMojo
(DefaultBuildPluginManager.java:137)
[2020-06-09T22:54:11.980Z]     at org.apache.maven.lifecycle.internal.MojoExecutor.execute
(MojoExecutor.java:210)
[2020-06-09T22:54:11.980Z]     at org.apache.maven.lifecycle.internal.MojoExecutor.execute
(MojoExecutor.java:156)
[2020-06-09T22:54:11.980Z]     at org.apache.maven.lifecycle.internal.MojoExecutor.execute
(MojoExecutor.java:148)
[2020-06-09T22:54:11.980Z]     at org.apache.maven.lifecycle.internal.LifecycleModuleBuilder.buildProject
(LifecycleModuleBuilder.java:117)
[2020-06-09T22:54:11.980Z]     at org.apache.maven.lifecycle.internal.LifecycleModuleBuilder.buildProject
(LifecycleModuleBuilder.java:81)
[2020-06-09T22:54:11.980Z]     at org.apache.maven.lifecycle.internal.builder.singlethreaded.SingleThreadedBuilder.build
(SingleThreadedBuilder.java:56)
[2020-06-09T22:54:11.980Z]     at org.apache.maven.lifecycle.internal.LifecycleStarter.execute
(LifecycleStarter.java:128)
[2020-06-09T22:54:11.980Z]     at org.apache.maven.DefaultMaven.doExecute (DefaultMaven.java:305)
[2020-06-09T22:54:11.980Z]     at org.apache.maven.DefaultMaven.doExecute (DefaultMaven.java:192)
[2020-06-09T22:54:11.980Z]     at org.apache.maven.DefaultMaven.execute (DefaultMaven.java:105)
[2020-06-09T22:54:11.980Z]     at org.apache.maven.cli.MavenCli.execute (MavenCli.java:956)
[2020-06-09T22:54:11.980Z]     at org.apache.maven.cli.MavenCli.doMain (MavenCli.java:288)
[2020-06-09T22:54:11.980Z]     at org.apache.maven.cli.MavenCli.main (MavenCli.java:192)
[2020-06-09T22:54:11.980Z]     at sun.reflect.NativeMethodAccessorImpl.invoke0 (Native Method)
[2020-06-09T22:54:11.980Z]     at sun.reflect.NativeMethodAccessorImpl.invoke (NativeMethodAccessorImpl.java:62)
[2020-06-09T22:54:11.980Z]     at sun.reflect.DelegatingMethodAccessorImpl.invoke (DelegatingMethodAccessorImpl.java:43)
[2020-06-09T22:54:11.981Z]     at java.lang.reflect.Method.invoke (Method.java:498)
[2020-06-09T22:54:11.981Z]     at org.codehaus.plexus.classworlds.launcher.Launcher.launchEnhanced
(Launcher.java:282)
[2020-06-09T22:54:11.981Z]     at org.codehaus.plexus.classworlds.launcher.Launcher.launch
(Launcher.java:225)
[2020-06-09T22:54:11.981Z]     at org.codehaus.plexus.classworlds.launcher.Launcher.mainWithExitCode
(Launcher.java:406)
[2020-06-09T22:54:11.981Z]     at org.codehaus.plexus.classworlds.launcher.Launcher.main (Launcher.java:347)
[2020-06-09T22:54:11.981Z] [ERROR] 
[2020-06-09T22:54:11.981Z] [ERROR] Re-run Maven using the -X switch to enable full debug logging.
[2020-06-09T22:54:11.981Z] [ERROR] 
[2020-06-09T22:54:11.981Z] [ERROR] For more information about the errors and possible solutions,
please read the following articles:
[2020-06-09T22:54:11.981Z] [ERROR] [Help 1] http://cwiki.apache.org/confluence/display/MAVEN/MojoFailureException
[2020-06-09T22:54:11.981Z] [ERROR] 
[2020-06-09T22:54:11.981Z] [ERROR] After correcting the problems, you can resume the build
with the command
[2020-06-09T22:54:11.981Z] [ERROR]   mvn <args> -rf :surefire-its
[Pipeline] }
[Pipeline] // withEnv
[Pipeline] }
[Pipeline] // stage
[Pipeline] fileExists
[Pipeline] zip
[2020-06-09T22:54:12.208Z] Writing zip file of C:\Windows\system32\config\systemprofile\AppData\Local\Temp\jenkins-maven-box-maven-surefire-empty_element_on_failure_with_ParameterizedTest-3@2\maven-failsafe-plugin\target\it
to C:\Windows\system32\config\systemprofile\AppData\Local\Temp\jenkins-maven-box-maven-surefire-empty_element_on_failure_with_ParameterizedTest-3@2\maven-failsafe-plugin--windows-jdk14-maven3.6.x.zip
[2020-06-09T22:54:12.431Z] Zipped 78 entries.
[2020-06-09T22:54:12.431Z] Archiving C:\Windows\system32\config\systemprofile\AppData\Local\Temp\jenkins-maven-box-maven-surefire-empty_element_on_failure_with_ParameterizedTest-3@2\maven-failsafe-plugin--windows-jdk14-maven3.6.x.zip
[2020-06-09T22:54:12.431Z] [Fast Archiver] No prior successful build to compare, so performing
full copy of artifacts
[Pipeline] fileExists
[Pipeline] zip
[2020-06-09T22:54:12.547Z] Writing zip file of C:\Windows\system32\config\systemprofile\AppData\Local\Temp\jenkins-maven-box-maven-surefire-empty_element_on_failure_with_ParameterizedTest-3@2\surefire-its\target
to C:\Windows\system32\config\systemprofile\AppData\Local\Temp\jenkins-maven-box-maven-surefire-empty_element_on_failure_with_ParameterizedTest-3@2\surefire-its--windows-jdk14-maven3.6.x.zip
[2020-06-09T22:54:20.975Z] [INFO] Tests run: 7, Failures: 0, Errors: 0, Skipped: 0, Time elapsed:
41.369 s - in org.apache.maven.surefire.its.jiras.Surefire995CategoryInheritanceIT
[2020-06-09T22:54:20.975Z] [INFO] 
[2020-06-09T22:54:20.975Z] [INFO] Results:
[2020-06-09T22:54:20.975Z] [INFO] 
[2020-06-09T22:54:20.975Z] [ERROR] Errors: 
[2020-06-09T22:54:20.975Z] [ERROR]   TestMultipleMethodPatternsTestNGIT>AbstractTestMultipleMethodPatterns.shouldNotRunExcludedClassesIfIncluded:452
» SurefireVerifier
[2020-06-09T22:54:20.975Z] [ERROR]   TestMultipleMethodPatternsTestNGIT>AbstractTestMultipleMethodPatterns.simpleNameTestWithJavaExtWildcardPkg:158
» SurefireVerifier
[2020-06-09T22:54:20.975Z] [ERROR]   Surefire1534ReuseForksFalseWithJavaModuleIT.testExecuteWithReuseForksFalseWithJavaModuleWithFilter:67
» SurefireVerifier
[2020-06-09T22:54:20.975Z] [INFO] 
[2020-06-09T22:54:20.975Z] [ERROR] Tests run: 960, Failures: 0, Errors: 3, Skipped: 138
[2020-06-09T22:54:20.975Z] [INFO] 
[2020-06-09T22:54:20.975Z] [INFO] 
[2020-06-09T22:54:20.975Z] [INFO] --- maven-checkstyle-plugin:3.0.0:check (checkstyle-check)
@ surefire-its ---
[2020-06-09T22:54:20.975Z] [INFO] 
[2020-06-09T22:54:20.975Z] [INFO] --- maven-failsafe-plugin:3.0.0-M4:verify (default) @ surefire-its
---
[2020-06-09T22:54:20.975Z] [INFO] Failsafe report directory: C:\Windows\System32\config\systemprofile\AppData\Local\Temp\jenkins-maven-box-maven-surefire-empty_element_on_failure_with_ParameterizedTest-3\surefire-its\target\failsafe-reports
[2020-06-09T22:54:20.975Z] [INFO] ------------------------------------------------------------------------
[2020-06-09T22:54:20.975Z] [INFO] Reactor Summary for Apache Maven Surefire 3.0.0-SNAPSHOT:
[2020-06-09T22:54:20.975Z] [INFO] 
[2020-06-09T22:54:20.975Z] [INFO] Apache Maven Surefire .............................. SUCCESS
[ 49.961 s]
[2020-06-09T22:54:20.975Z] [INFO] SureFire Logger API ................................ SUCCESS
[ 19.096 s]
[2020-06-09T22:54:20.975Z] [INFO] SureFire API ....................................... SUCCESS
[ 21.578 s]
[2020-06-09T22:54:20.975Z] [INFO] Surefire Extensions API ............................ SUCCESS
[  6.725 s]
[2020-06-09T22:54:20.975Z] [INFO] Surefire Extensions SPI ............................ SUCCESS
[  2.258 s]
[2020-06-09T22:54:20.975Z] [INFO] SureFire Booter .................................... SUCCESS
[ 22.385 s]
[2020-06-09T22:54:20.975Z] [INFO] Maven Surefire Test-Grouping Support ............... SUCCESS
[  9.927 s]
[2020-06-09T22:54:20.975Z] [INFO] SureFire Providers ................................. SUCCESS
[  0.934 s]
[2020-06-09T22:54:20.975Z] [INFO] Shared JUnit3 Provider Code ........................ SUCCESS
[  4.495 s]
[2020-06-09T22:54:20.975Z] [INFO] Shared Java 5 Provider Base ........................ SUCCESS
[  5.233 s]
[2020-06-09T22:54:20.975Z] [INFO] Shared JUnit4 Provider Code ........................ SUCCESS
[  5.884 s]
[2020-06-09T22:54:20.975Z] [INFO] Shared JUnit48 Provider Code ....................... SUCCESS
[  9.638 s]
[2020-06-09T22:54:20.975Z] [INFO] SureFire JUnit Runner .............................. SUCCESS
[  4.769 s]
[2020-06-09T22:54:20.975Z] [INFO] SureFire JUnit4 Runner ............................. SUCCESS
[  5.044 s]
[2020-06-09T22:54:20.975Z] [INFO] Maven Surefire Common .............................. SUCCESS
[01:00 min]
[2020-06-09T22:54:20.975Z] [INFO] SureFire JUnitCore Runner .......................... SUCCESS
[02:16 min]
[2020-06-09T22:54:20.975Z] [INFO] SureFire JUnit Platform Runner ..................... SUCCESS
[ 11.595 s]
[2020-06-09T22:54:20.976Z] [INFO] SureFire TestNG Utils .............................. SUCCESS
[  4.924 s]
[2020-06-09T22:54:20.976Z] [INFO] SureFire TestNG Runner ............................. SUCCESS
[  7.570 s]
[2020-06-09T22:54:20.976Z] [INFO] ShadeFire JUnit3 Provider .......................... SUCCESS
[  2.254 s]
[2020-06-09T22:54:20.976Z] [INFO] Surefire Report Parser ............................. SUCCESS
[  7.387 s]
[2020-06-09T22:54:20.976Z] [INFO] Maven Surefire Plugin .............................. SUCCESS
[ 12.218 s]
[2020-06-09T22:54:20.976Z] [INFO] Maven Failsafe Plugin .............................. SUCCESS
[01:15 min]
[2020-06-09T22:54:20.976Z] [INFO] Maven Surefire Report Plugin ....................... SUCCESS
[ 17.562 s]
[2020-06-09T22:54:20.976Z] [INFO] Maven Surefire Integration Tests ................... FAILURE
[  01:37 h]
[2020-06-09T22:54:20.976Z] [INFO] Surefire Shared Utils .............................. SKIPPED
[2020-06-09T22:54:20.976Z] [INFO] ------------------------------------------------------------------------
[2020-06-09T22:54:20.976Z] [INFO] BUILD FAILURE
[2020-06-09T22:54:20.976Z] [INFO] ------------------------------------------------------------------------
[2020-06-09T22:54:20.976Z] [INFO] Total time:  01:45 h
[2020-06-09T22:54:20.976Z] [INFO] Finished at: 2020-06-09T15:54:16-07:00
[2020-06-09T22:54:20.976Z] [INFO] ------------------------------------------------------------------------
[2020-06-09T22:54:20.976Z] [ERROR] Failed to execute goal org.apache.maven.plugins:maven-failsafe-plugin:3.0.0-M4:verify
(default) on project surefire-its: There are test failures.
[2020-06-09T22:54:20.976Z] [ERROR] 
[2020-06-09T22:54:20.976Z] [ERROR] Please refer to C:\Windows\System32\config\systemprofile\AppData\Local\Temp\jenkins-maven-box-maven-surefire-empty_element_on_failure_with_ParameterizedTest-3\surefire-its\target\failsafe-reports
for the individual test results.
[2020-06-09T22:54:20.976Z] [ERROR] Please refer to dump files (if any exist) [date].dump,
[date]-jvmRun[N].dump and [date].dumpstream.
[2020-06-09T22:54:20.976Z] [ERROR] -> [Help 1]
[2020-06-09T22:54:20.976Z] org.apache.maven.lifecycle.LifecycleExecutionException: Failed
to execute goal org.apache.maven.plugins:maven-failsafe-plugin:3.0.0-M4:verify (default) on
project surefire-its: There are test failures.
[2020-06-09T22:54:20.976Z] 
[2020-06-09T22:54:20.976Z] Please refer to C:\Windows\System32\config\systemprofile\AppData\Local\Temp\jenkins-maven-box-maven-surefire-empty_element_on_failure_with_ParameterizedTest-3\surefire-its\target\failsafe-reports
for the individual test results.
[2020-06-09T22:54:20.976Z] Please refer to dump files (if any exist) [date].dump, [date]-jvmRun[N].dump
and [date].dumpstream.
[2020-06-09T22:54:20.976Z]     at org.apache.maven.lifecycle.internal.MojoExecutor.execute
(MojoExecutor.java:215)
[2020-06-09T22:54:20.976Z]     at org.apache.maven.lifecycle.internal.MojoExecutor.execute
(MojoExecutor.java:156)
[2020-06-09T22:54:20.976Z]     at org.apache.maven.lifecycle.internal.MojoExecutor.execute
(MojoExecutor.java:148)
[2020-06-09T22:54:20.976Z]     at org.apache.maven.lifecycle.internal.LifecycleModuleBuilder.buildProject
(LifecycleModuleBuilder.java:117)
[2020-06-09T22:54:20.976Z]     at org.apache.maven.lifecycle.internal.LifecycleModuleBuilder.buildProject
(LifecycleModuleBuilder.java:81)
[2020-06-09T22:54:20.976Z]     at org.apache.maven.lifecycle.internal.builder.singlethreaded.SingleThreadedBuilder.build
(SingleThreadedBuilder.java:56)
[2020-06-09T22:54:20.976Z]     at org.apache.maven.lifecycle.internal.LifecycleStarter.execute
(LifecycleStarter.java:128)
[2020-06-09T22:54:20.976Z]     at org.apache.maven.DefaultMaven.doExecute (DefaultMaven.java:305)
[2020-06-09T22:54:20.976Z]     at org.apache.maven.DefaultMaven.doExecute (DefaultMaven.java:192)
[2020-06-09T22:54:20.976Z]     at org.apache.maven.DefaultMaven.execute (DefaultMaven.java:105)
[2020-06-09T22:54:20.976Z]     at org.apache.maven.cli.MavenCli.execute (MavenCli.java:956)
[2020-06-09T22:54:20.976Z]     at org.apache.maven.cli.MavenCli.doMain (MavenCli.java:288)
[2020-06-09T22:54:20.976Z]     at org.apache.maven.cli.MavenCli.main (MavenCli.java:192)
[2020-06-09T22:54:20.976Z]     at sun.reflect.NativeMethodAccessorImpl.invoke0 (Native Method)
[2020-06-09T22:54:20.976Z]     at sun.reflect.NativeMethodAccessorImpl.invoke (NativeMethodAccessorImpl.java:62)
[2020-06-09T22:54:20.976Z]     at sun.reflect.DelegatingMethodAccessorImpl.invoke (DelegatingMethodAccessorImpl.java:43)
[2020-06-09T22:54:20.976Z]     at java.lang.reflect.Method.invoke (Method.java:498)
[2020-06-09T22:54:20.976Z]     at org.codehaus.plexus.classworlds.launcher.Launcher.launchEnhanced
(Launcher.java:282)
[2020-06-09T22:54:20.976Z]     at org.codehaus.plexus.classworlds.launcher.Launcher.launch
(Launcher.java:225)
[2020-06-09T22:54:20.976Z]     at org.codehaus.plexus.classworlds.launcher.Launcher.mainWithExitCode
(Launcher.java:406)
[2020-06-09T22:54:20.976Z]     at org.codehaus.plexus.classworlds.launcher.Launcher.main (Launcher.java:347)
[2020-06-09T22:54:20.976Z] Caused by: org.apache.maven.plugin.MojoFailureException: There
are test failures.
[2020-06-09T22:54:20.976Z] 
[2020-06-09T22:54:20.976Z] Please refer to C:\Windows\System32\config\systemprofile\AppData\Local\Temp\jenkins-maven-box-maven-surefire-empty_element_on_failure_with_ParameterizedTest-3\surefire-its\target\failsafe-reports
for the individual test results.
[2020-06-09T22:54:20.976Z] Please refer to dump files (if any exist) [date].dump, [date]-jvmRun[N].dump
and [date].dumpstream.
[2020-06-09T22:54:20.976Z]     at org.apache.maven.plugin.surefire.SurefireHelper.throwException
(SurefireHelper.java:271)
[2020-06-09T22:54:20.976Z]     at org.apache.maven.plugin.surefire.SurefireHelper.reportExecution
(SurefireHelper.java:159)
[2020-06-09T22:54:20.976Z]     at org.apache.maven.plugin.failsafe.VerifyMojo.execute (VerifyMojo.java:192)
[2020-06-09T22:54:20.976Z]     at org.apache.maven.plugin.DefaultBuildPluginManager.executeMojo
(DefaultBuildPluginManager.java:137)
[2020-06-09T22:54:20.976Z]     at org.apache.maven.lifecycle.internal.MojoExecutor.execute
(MojoExecutor.java:210)
[2020-06-09T22:54:20.976Z]     at org.apache.maven.lifecycle.internal.MojoExecutor.execute
(MojoExecutor.java:156)
[2020-06-09T22:54:20.976Z]     at org.apache.maven.lifecycle.internal.MojoExecutor.execute
(MojoExecutor.java:148)
[2020-06-09T22:54:20.976Z]     at org.apache.maven.lifecycle.internal.LifecycleModuleBuilder.buildProject
(LifecycleModuleBuilder.java:117)
[2020-06-09T22:54:20.976Z]     at org.apache.maven.lifecycle.internal.LifecycleModuleBuilder.buildProject
(LifecycleModuleBuilder.java:81)
[2020-06-09T22:54:20.977Z]     at org.apache.maven.lifecycle.internal.builder.singlethreaded.SingleThreadedBuilder.build
(SingleThreadedBuilder.java:56)
[2020-06-09T22:54:20.977Z]     at org.apache.maven.lifecycle.internal.LifecycleStarter.execute
(LifecycleStarter.java:128)
[2020-06-09T22:54:20.977Z]     at org.apache.maven.DefaultMaven.doExecute (DefaultMaven.java:305)
[2020-06-09T22:54:20.977Z]     at org.apache.maven.DefaultMaven.doExecute (DefaultMaven.java:192)
[2020-06-09T22:54:20.977Z]     at org.apache.maven.DefaultMaven.execute (DefaultMaven.java:105)
[2020-06-09T22:54:20.977Z]     at org.apache.maven.cli.MavenCli.execute (MavenCli.java:956)
[2020-06-09T22:54:20.977Z]     at org.apache.maven.cli.MavenCli.doMain (MavenCli.java:288)
[2020-06-09T22:54:20.977Z]     at org.apache.maven.cli.MavenCli.main (MavenCli.java:192)
[2020-06-09T22:54:20.977Z]     at sun.reflect.NativeMethodAccessorImpl.invoke0 (Native Method)
[2020-06-09T22:54:20.977Z]     at sun.reflect.NativeMethodAccessorImpl.invoke (NativeMethodAccessorImpl.java:62)
[2020-06-09T22:54:20.977Z]     at sun.reflect.DelegatingMethodAccessorImpl.invoke (DelegatingMethodAccessorImpl.java:43)
[2020-06-09T22:54:20.977Z]     at java.lang.reflect.Method.invoke (Method.java:498)
[2020-06-09T22:54:20.977Z]     at org.codehaus.plexus.classworlds.launcher.Launcher.launchEnhanced
(Launcher.java:282)
[2020-06-09T22:54:20.977Z]     at org.codehaus.plexus.classworlds.launcher.Launcher.launch
(Launcher.java:225)
[2020-06-09T22:54:20.977Z]     at org.codehaus.plexus.classworlds.launcher.Launcher.mainWithExitCode
(Launcher.java:406)
[2020-06-09T22:54:20.977Z]     at org.codehaus.plexus.classworlds.launcher.Launcher.main (Launcher.java:347)
[2020-06-09T22:54:20.977Z] [ERROR] 
[2020-06-09T22:54:20.977Z] [ERROR] Re-run Maven using the -X switch to enable full debug logging.
[2020-06-09T22:54:20.977Z] [ERROR] 
[2020-06-09T22:54:20.977Z] [ERROR] For more information about the errors and possible solutions,
please read the following articles:
[2020-06-09T22:54:20.977Z] [ERROR] [Help 1] http://cwiki.apache.org/confluence/display/MAVEN/MojoFailureException
[2020-06-09T22:54:20.977Z] [ERROR] 
[2020-06-09T22:54:20.977Z] [ERROR] After correcting the problems, you can resume the build
with the command
[2020-06-09T22:54:20.977Z] [ERROR]   mvn <args> -rf :surefire-its
[Pipeline] }
[Pipeline] // withEnv
[Pipeline] }
[Pipeline] // stage
[Pipeline] fileExists
[Pipeline] zip
[2020-06-09T22:54:21.189Z] Writing zip file of C:\Windows\system32\config\systemprofile\AppData\Local\Temp\jenkins-maven-box-maven-surefire-empty_element_on_failure_with_ParameterizedTest-3\maven-failsafe-plugin\target\it
to C:\Windows\system32\config\systemprofile\AppData\Local\Temp\jenkins-maven-box-maven-surefire-empty_element_on_failure_with_ParameterizedTest-3\maven-failsafe-plugin--windows-jdk11-maven3.6.x.zip
[2020-06-09T22:54:21.539Z] Zipped 78 entries.
[2020-06-09T22:54:21.539Z] Archiving C:\Windows\system32\config\systemprofile\AppData\Local\Temp\jenkins-maven-box-maven-surefire-empty_element_on_failure_with_ParameterizedTest-3\maven-failsafe-plugin--windows-jdk11-maven3.6.x.zip
[2020-06-09T22:54:21.539Z] [Fast Archiver] No prior successful build to compare, so performing
full copy of artifacts
[Pipeline] fileExists
[Pipeline] zip
[2020-06-09T22:54:21.664Z] Writing zip file of C:\Windows\system32\config\systemprofile\AppData\Local\Temp\jenkins-maven-box-maven-surefire-empty_element_on_failure_with_ParameterizedTest-3\surefire-its\target
to C:\Windows\system32\config\systemprofile\AppData\Local\Temp\jenkins-maven-box-maven-surefire-empty_element_on_failure_with_ParameterizedTest-3\surefire-its--windows-jdk11-maven3.6.x.zip
[2020-06-09T22:54:58.340Z] Zipped 19116 entries.
[2020-06-09T22:54:58.340Z] Archiving C:\Windows\system32\config\systemprofile\AppData\Local\Temp\jenkins-maven-box-maven-surefire-empty_element_on_failure_with_ParameterizedTest-3\surefire-its--windows-jdk15-maven3.6.x.zip
[2020-06-09T22:54:58.340Z] [Fast Archiver] No prior successful build to compare, so performing
full copy of artifacts
[Pipeline] archiveArtifacts
[2020-06-09T22:55:16.165Z] Archiving artifacts
[2020-06-09T22:55:16.241Z] [Fast Archiver] No prior successful build to compare, so performing
full copy of artifacts
[Pipeline] cleanWs
[2020-06-09T22:55:40.547Z] [WS-CLEANUP] Deleting project workspace...
[2020-06-09T22:55:40.547Z] [WS-CLEANUP] Deferred wipeout is used...
[2020-06-09T22:55:40.693Z] [WS-CLEANUP] done
[Pipeline] }
[Pipeline] // ws
[Pipeline] }
[Pipeline] // timestamps
[Pipeline] }
[Pipeline] // node
[Pipeline] }
[2020-06-09T22:55:51.222Z] Zipped 19103 entries.
[2020-06-09T22:55:51.222Z] Archiving C:\Windows\system32\config\systemprofile\AppData\Local\Temp\jenkins-maven-box-maven-surefire-empty_element_on_failure_with_ParameterizedTest-3@2\surefire-its--windows-jdk14-maven3.6.x.zip
[2020-06-09T22:55:51.223Z] [Fast Archiver] No prior successful build to compare, so performing
full copy of artifacts
[2020-06-09T22:56:16.142Z] Zipped 19137 entries.
[2020-06-09T22:56:16.142Z] Archiving C:\Windows\system32\config\systemprofile\AppData\Local\Temp\jenkins-maven-box-maven-surefire-empty_element_on_failure_with_ParameterizedTest-3\surefire-its--windows-jdk11-maven3.6.x.zip
[2020-06-09T22:56:16.142Z] [Fast Archiver] No prior successful build to compare, so performing
full copy of artifacts
[Pipeline] archiveArtifacts
[2020-06-09T22:56:18.844Z] Archiving artifacts
[2020-06-09T22:56:18.855Z] [Fast Archiver] No prior successful build to compare, so performing
full copy of artifacts
[Pipeline] archiveArtifacts
[2020-06-09T22:56:37.012Z] Archiving artifacts
[2020-06-09T22:56:37.023Z] [Fast Archiver] No prior successful build to compare, so performing
full copy of artifacts
[Pipeline] cleanWs
[2020-06-09T22:56:47.855Z] [WS-CLEANUP] Deleting project workspace...
[2020-06-09T22:56:47.855Z] [WS-CLEANUP] Deferred wipeout is used...
[2020-06-09T22:56:48.014Z] [WS-CLEANUP] done
[Pipeline] }
[Pipeline] // ws
[Pipeline] }
[Pipeline] // timestamps
[Pipeline] }
[Pipeline] // node
[Pipeline] }
[Pipeline] cleanWs
[2020-06-09T22:56:55.365Z] [WS-CLEANUP] Deleting project workspace...
[2020-06-09T22:56:55.365Z] [WS-CLEANUP] Deferred wipeout is used...
[2020-06-09T22:56:55.497Z] [WS-CLEANUP] done
[Pipeline] }
[Pipeline] // ws
[Pipeline] }
[Pipeline] // timestamps
[Pipeline] }
[Pipeline] // node
[Pipeline] }
[Pipeline] // parallel
[Pipeline] echo
Build result: FAILURE
[Pipeline] jiraIssueSelector
[Pipeline] echo
The authors of changes [rfscholte, hboutemy, slachiewicz].
[Pipeline] echo
Sending email ...
[Pipeline] emailext
Mime
  • Unnamed multipart/mixed (inline, None, 0 bytes)
View raw message