maven-notifications mailing list archives

Site index · List index
Message view « Date » · « Thread »
Top « Date » · « Thread »
From Apache Jenkins Server <jenk...@builds.apache.org>
Subject Build failed in Jenkins: Maven TLP » maven-invoker-plugin » MINVOKER-255 #10
Date Fri, 05 Jun 2020 19:12:50 GMT
See https://builds.apache.org/job/maven-box/job/maven-invoker-plugin/job/MINVOKER-255/10/

Changes:

* Use Java 7 JDK for all released Maven versions and 8 for planned 3.7.x

All tests passed

Build log:
[...truncated 39748 lines...]
[ERROR] Failed to execute goal org.apache.maven.plugins:maven-invoker-plugin:3.2.1:verify
(integration-test) on project maven-invoker-plugin: 1 build failed. See console output above
for details. -> [Help 1]
org.apache.maven.lifecycle.LifecycleExecutionException: Failed to execute goal org.apache.maven.plugins:maven-invoker-plugin:3.2.1:verify
(integration-test) on project maven-invoker-plugin: 1 build failed. See console output above
for details.
    at org.apache.maven.lifecycle.internal.MojoExecutor.execute (MojoExecutor.java:215)
    at org.apache.maven.lifecycle.internal.MojoExecutor.execute (MojoExecutor.java:156)
    at org.apache.maven.lifecycle.internal.MojoExecutor.execute (MojoExecutor.java:148)
    at org.apache.maven.lifecycle.internal.LifecycleModuleBuilder.buildProject (LifecycleModuleBuilder.java:117)
    at org.apache.maven.lifecycle.internal.LifecycleModuleBuilder.buildProject (LifecycleModuleBuilder.java:81)
    at org.apache.maven.lifecycle.internal.builder.singlethreaded.SingleThreadedBuilder.build
(SingleThreadedBuilder.java:56)
    at org.apache.maven.lifecycle.internal.LifecycleStarter.execute (LifecycleStarter.java:128)
    at org.apache.maven.DefaultMaven.doExecute (DefaultMaven.java:305)
    at org.apache.maven.DefaultMaven.doExecute (DefaultMaven.java:192)
    at org.apache.maven.DefaultMaven.execute (DefaultMaven.java:105)
    at org.apache.maven.cli.MavenCli.execute (MavenCli.java:956)
    at org.apache.maven.cli.MavenCli.doMain (MavenCli.java:288)
    at org.apache.maven.cli.MavenCli.main (MavenCli.java:192)
    at sun.reflect.NativeMethodAccessorImpl.invoke0 (Native Method)
    at sun.reflect.NativeMethodAccessorImpl.invoke (NativeMethodAccessorImpl.java:57)
    at sun.reflect.DelegatingMethodAccessorImpl.invoke (DelegatingMethodAccessorImpl.java:43)
    at java.lang.reflect.Method.invoke (Method.java:606)
    at org.codehaus.plexus.classworlds.launcher.Launcher.launchEnhanced (Launcher.java:282)
    at org.codehaus.plexus.classworlds.launcher.Launcher.launch (Launcher.java:225)
    at org.codehaus.plexus.classworlds.launcher.Launcher.mainWithExitCode (Launcher.java:406)
    at org.codehaus.plexus.classworlds.launcher.Launcher.main (Launcher.java:347)
Caused by: org.apache.maven.plugin.MojoFailureException: 1 build failed. See console output
above for details.
    at org.apache.maven.plugins.invoker.InvokerSession.handleFailures (InvokerSession.java:259)
    at org.apache.maven.plugins.invoker.VerifyMojo.execute (VerifyMojo.java:140)
    at org.apache.maven.plugin.DefaultBuildPluginManager.executeMojo (DefaultBuildPluginManager.java:137)
    at org.apache.maven.lifecycle.internal.MojoExecutor.execute (MojoExecutor.java:210)
    at org.apache.maven.lifecycle.internal.MojoExecutor.execute (MojoExecutor.java:156)
    at org.apache.maven.lifecycle.internal.MojoExecutor.execute (MojoExecutor.java:148)
    at org.apache.maven.lifecycle.internal.LifecycleModuleBuilder.buildProject (LifecycleModuleBuilder.java:117)
    at org.apache.maven.lifecycle.internal.LifecycleModuleBuilder.buildProject (LifecycleModuleBuilder.java:81)
    at org.apache.maven.lifecycle.internal.builder.singlethreaded.SingleThreadedBuilder.build
(SingleThreadedBuilder.java:56)
    at org.apache.maven.lifecycle.internal.LifecycleStarter.execute (LifecycleStarter.java:128)
    at org.apache.maven.DefaultMaven.doExecute (DefaultMaven.java:305)
    at org.apache.maven.DefaultMaven.doExecute (DefaultMaven.java:192)
    at org.apache.maven.DefaultMaven.execute (DefaultMaven.java:105)
    at org.apache.maven.cli.MavenCli.execute (MavenCli.java:956)
    at org.apache.maven.cli.MavenCli.doMain (MavenCli.java:288)
    at org.apache.maven.cli.MavenCli.main (MavenCli.java:192)
    at sun.reflect.NativeMethodAccessorImpl.invoke0 (Native Method)
    at sun.reflect.NativeMethodAccessorImpl.invoke (NativeMethodAccessorImpl.java:57)
    at sun.reflect.DelegatingMethodAccessorImpl.invoke (DelegatingMethodAccessorImpl.java:43)
    at java.lang.reflect.Method.invoke (Method.java:606)
    at org.codehaus.plexus.classworlds.launcher.Launcher.launchEnhanced (Launcher.java:282)
    at org.codehaus.plexus.classworlds.launcher.Launcher.launch (Launcher.java:225)
    at org.codehaus.plexus.classworlds.launcher.Launcher.mainWithExitCode (Launcher.java:406)
    at org.codehaus.plexus.classworlds.launcher.Launcher.main (Launcher.java:347)
[ERROR] 
[ERROR] 
[ERROR] For more information about the errors and possible solutions, please read the following
articles:
[ERROR] [Help 1] http://cwiki.apache.org/confluence/display/MAVEN/MojoFailureException
Picked up JAVA_TOOL_OPTIONS: -Dmaven.ext.class.path="f:\jenkins\jenkins-slave\workspace\aven-invoker-plugin_MINVOKER-255@2@tmp\withMavenab347f6e\pipeline-maven-spy.jar"
-Dorg.jenkinsci.plugins.pipeline.maven.reportsFolder="f:\jenkins\jenkins-slave\workspace\aven-invoker-plugin_MINVOKER-255@2@tmp\withMavenab347f6e"

[Pipeline] }
[Pipeline] // dir
[INFO] run post-build script verify.bsh
[INFO]           skip-run\pom.xml ................................. SUCCESS (3.5 s)
[INFO] Building: spaces-should-work_non-windows\pom.xml
[INFO]           spaces-should-work_non-windows\pom.xml ........... SKIPPED due to OS
[INFO] Building: spaces-should-work_windows\pom.xml
[INFO] run pre-build script setup.groovy
[Pipeline] }
[Fast Archiver] No prior successful build to compare, so performing full copy of artifacts
[withMaven] junitPublisher - Archive test results for Maven artifact org.apache.maven.plugins:maven-invoker-plugin:maven-plugin:3.2.2-SNAPSHOT
generated by maven-surefire-plugin:test (default-test): windows-jdk7-m3.6.x_build\target\surefire-reports\*.xml
Recording test results
[withMaven] openTasksPublisher - Scan Tasks for Maven artifact org.apache.maven.plugins:maven-invoker-plugin:maven-plugin:3.2.2-SNAPSHOT
in source directory windows-jdk7-m3.6.x_build\src\main\java
[TASKS] Scanning folder 'f:\jenkins\jenkins-slave\workspace\aven-invoker-plugin_MINVOKER-255@2'
for files matching the pattern 'windows-jdk7-m3.6.x_build\src\main\java\**\*' - excludes:
null
[TASKS] Found 17 files to scan for tasks
[TASKS] Found 8 open tasks.
Skipping warnings blame since pipelines do not have an SCM link.%n
[withMaven] invokerPublisher - Archive invoker results for Maven artifact MavenArtifact{org.apache.maven.plugins:maven-invoker-plugin:maven-plugin:3.2.2-SNAPSHOT(version:
3.2.2-SNAPSHOT, snapshot:false) } generated by PluginInvocation{org.apache.maven.plugins:maven-invoker-plugin:3.2.1@integration-test
 integration-test}: windows-jdk7-m3.6.x_build\target\invoker-reports\*.xml
[INFO]           spaces-should-work_windows\pom.xml ............... SUCCESS (7.0 s)
[INFO] Building: special-characters-should-work\pom.xml
[INFO] run pre-build script setup.groovy
[INFO]           wrongPropertyInterpolation\pom.xml ............... SUCCESS (19.7 s)
[INFO] 
[INFO] --- maven-checkstyle-plugin:3.0.0:check (checkstyle-check) @ maven-invoker-plugin ---
[INFO] There are 4 errors reported by Checkstyle 6.18 with config/maven_checks.xml ruleset.
[INFO] Ignored 4 errors, 0 violation remaining.
[INFO] 
[INFO] --- maven-invoker-plugin:3.2.1:verify (integration-test) @ maven-invoker-plugin ---
[INFO] -------------------------------------------------
[INFO] Build Summary:
[INFO]   Passed: 71, Failed: 0, Errors: 0, Skipped: 2
[INFO] -------------------------------------------------
[INFO] ------------------------------------------------------------------------
[INFO] BUILD SUCCESS
[INFO] ------------------------------------------------------------------------
[INFO] Total time:  09:59 min
[INFO] Finished at: 2020-06-05T12:10:59-07:00
[INFO] ------------------------------------------------------------------------
[INFO] [jenkins-event-spy] Generated F:\jenkins\jenkins-slave\workspace\aven-invoker-plugin_MINVOKER-255@3@2@tmp\withMaven557e48c4\maven-spy-20200605-120059-3589054242980577414530.log
[Pipeline] }
[Pipeline] // dir
[Pipeline] }
[withMaven] artifactsPublisher - Archive artifact windows-jdk14-m3.6.x_build\pom.xml under
org\apache\maven\plugins\maven-invoker-plugin\3.2.2-SNAPSHOT\maven-invoker-plugin-3.2.2-SNAPSHOT.pom
[withMaven] artifactsPublisher - Archive artifact windows-jdk14-m3.6.x_build\target\maven-invoker-plugin-3.2.2-SNAPSHOT.jar
under org\apache\maven\plugins\maven-invoker-plugin\3.2.2-SNAPSHOT\maven-invoker-plugin-3.2.2-SNAPSHOT.jar
[Fast Archiver] No prior successful build to compare, so performing full copy of artifacts
[withMaven] junitPublisher - Archive test results for Maven artifact org.apache.maven.plugins:maven-invoker-plugin:maven-plugin:3.2.2-SNAPSHOT
generated by maven-surefire-plugin:test (default-test): windows-jdk14-m3.6.x_build\target\surefire-reports\*.xml
Recording test results
[withMaven] openTasksPublisher - Scan Tasks for Maven artifact org.apache.maven.plugins:maven-invoker-plugin:maven-plugin:3.2.2-SNAPSHOT
in source directory windows-jdk14-m3.6.x_build\src\main\java
[INFO]           wrongPropertyInterpolation\pom.xml ............... SUCCESS (17.7 s)
[INFO] 
[INFO] --- maven-checkstyle-plugin:3.0.0:check (checkstyle-check) @ maven-invoker-plugin ---
[TASKS] Scanning folder 'f:\jenkins\jenkins-slave\workspace\aven-invoker-plugin_MINVOKER-255@3@2'
for files matching the pattern 'windows-jdk14-m3.6.x_build\src\main\java\**\*' - excludes:
null
[TASKS] Found 17 files to scan for tasks
[TASKS] Found 8 open tasks.
Skipping warnings blame since pipelines do not have an SCM link.%n
[withMaven] invokerPublisher - Archive invoker results for Maven artifact MavenArtifact{org.apache.maven.plugins:maven-invoker-plugin:maven-plugin:3.2.2-SNAPSHOT(version:
3.2.2-SNAPSHOT, snapshot:false) } generated by PluginInvocation{org.apache.maven.plugins:maven-invoker-plugin:3.2.1@integration-test
 integration-test}: windows-jdk14-m3.6.x_build\target\invoker-reports\*.xml
[INFO] There are 4 errors reported by Checkstyle 6.18 with config/maven_checks.xml ruleset.
[INFO] Ignored 4 errors, 0 violation remaining.
[INFO] 
[INFO] --- maven-invoker-plugin:3.2.1:verify (integration-test) @ maven-invoker-plugin ---
[INFO] -------------------------------------------------
[INFO] Build Summary:
[INFO]   Passed: 71, Failed: 0, Errors: 0, Skipped: 2
[INFO] -------------------------------------------------
[INFO] ------------------------------------------------------------------------
[INFO] BUILD SUCCESS
[INFO] ------------------------------------------------------------------------
[INFO] Total time:  10:22 min
[INFO] Finished at: 2020-06-05T12:11:01-07:00
[INFO] ------------------------------------------------------------------------
[INFO] [jenkins-event-spy] Generated F:\jenkins\jenkins-slave\workspace\aven-invoker-plugin_MINVOKER-255@2@tmp\withMaven99ecd651\maven-spy-20200605-120039-1135517978478095087781.log
[Pipeline] }
[Pipeline] // dir
[Pipeline] }
[withMaven] artifactsPublisher - Archive artifact windows-jdk11-m3.6.x_build\pom.xml under
org\apache\maven\plugins\maven-invoker-plugin\3.2.2-SNAPSHOT\maven-invoker-plugin-3.2.2-SNAPSHOT.pom
[withMaven] artifactsPublisher - Archive artifact windows-jdk11-m3.6.x_build\target\maven-invoker-plugin-3.2.2-SNAPSHOT.jar
under org\apache\maven\plugins\maven-invoker-plugin\3.2.2-SNAPSHOT\maven-invoker-plugin-3.2.2-SNAPSHOT.jar
[Fast Archiver] No prior successful build to compare, so performing full copy of artifacts
[withMaven] junitPublisher - Archive test results for Maven artifact org.apache.maven.plugins:maven-invoker-plugin:maven-plugin:3.2.2-SNAPSHOT
generated by maven-surefire-plugin:test (default-test): windows-jdk11-m3.6.x_build\target\surefire-reports\*.xml
Recording test results
[withMaven] openTasksPublisher - Scan Tasks for Maven artifact org.apache.maven.plugins:maven-invoker-plugin:maven-plugin:3.2.2-SNAPSHOT
in source directory windows-jdk11-m3.6.x_build\src\main\java
[TASKS] Scanning folder 'f:\jenkins\jenkins-slave\workspace\aven-invoker-plugin_MINVOKER-255@2'
for files matching the pattern 'windows-jdk11-m3.6.x_build\src\main\java\**\*' - excludes:
null
[TASKS] Found 17 files to scan for tasks
[TASKS] Found 8 open tasks.
Skipping warnings blame since pipelines do not have an SCM link.%n
[withMaven] invokerPublisher - Archive invoker results for Maven artifact MavenArtifact{org.apache.maven.plugins:maven-invoker-plugin:maven-plugin:3.2.2-SNAPSHOT(version:
3.2.2-SNAPSHOT, snapshot:false) } generated by PluginInvocation{org.apache.maven.plugins:maven-invoker-plugin:3.2.1@integration-test
 integration-test}: windows-jdk11-m3.6.x_build\target\invoker-reports\*.xml
[INFO]           special-characters-should-work\pom.xml ........... SUCCESS (6.4 s)
[INFO] Building: staging-dependencies\pom.xml
[INFO] run post-build script verify.bsh
[INFO]           staging-dependencies\pom.xml ..................... SUCCESS (6.1 s)
[INFO] Building: staging-pom\pom.xml
[INFO] run post-build script verify.bsh
[INFO]           staging-pom\pom.xml .............................. SUCCESS (3.6 s)
[INFO] Building: staging-reactor\pom.xml
[INFO] run post-build script verify.bsh
[INFO]           staging-reactor\pom.xml .......................... SUCCESS (5.6 s)
[INFO] Building: wrongPropertyInterpolation\pom.xml
[withMaven] Publishers: Generated Artifacts Publisher: 11 ms, Junit Publisher: 251 ms, Open
Task Scanner Publisher: 127 ms, Invoker Publisher: 35284 ms
[Pipeline] // withMaven
[Pipeline] cleanWs
[WS-CLEANUP] Deleting project workspace...
[WS-CLEANUP] Deferred wipeout is used...
[WS-CLEANUP] done
[Pipeline] cleanWs
[WS-CLEANUP] Deleting project workspace...
[WS-CLEANUP] Deferred wipeout is used...
[WS-CLEANUP] done
[Pipeline] }
[Pipeline] // stage
[Pipeline] }
[Pipeline] // ws
[Pipeline] }
[Pipeline] // node
[Pipeline] }
Failed in branch windows-jdk7-m3.6.x_build
[withMaven] Publishers: Generated Artifacts Publisher: 61 ms, Junit Publisher: 196 ms, Open
Task Scanner Publisher: 143 ms, Invoker Publisher: 32949 ms, Pipeline Graph Publisher: 2 ms
[Pipeline] // withMaven
[Pipeline] cleanWs
[WS-CLEANUP] Deleting project workspace...
[WS-CLEANUP] Deferred wipeout is used...
[WS-CLEANUP] done
[Pipeline] }
[Pipeline] // stage
[Pipeline] }
[Pipeline] // ws
[Pipeline] }
[Pipeline] // node
[Pipeline] }
[withMaven] Publishers: Generated Artifacts Publisher: 203 ms, Junit Publisher: 579 ms, Open
Task Scanner Publisher: 175 ms, Invoker Publisher: 32988 ms, Pipeline Graph Publisher: 1 ms
[Pipeline] // withMaven
[Pipeline] cleanWs
[WS-CLEANUP] Deleting project workspace...
[WS-CLEANUP] Deferred wipeout is used...
[WS-CLEANUP] done
[Pipeline] }
[Pipeline] // stage
[Pipeline] }
[Pipeline] // ws
[Pipeline] }
[Pipeline] // node
[Pipeline] }
[INFO]           wrongPropertyInterpolation\pom.xml ............... SUCCESS (19.0 s)
[INFO] 
[INFO] --- maven-checkstyle-plugin:3.0.0:check (checkstyle-check) @ maven-invoker-plugin ---
[INFO] There are 4 errors reported by Checkstyle 6.18 with config/maven_checks.xml ruleset.
[INFO] Ignored 4 errors, 0 violation remaining.
[INFO] 
[INFO] --- maven-invoker-plugin:3.2.1:verify (integration-test) @ maven-invoker-plugin ---
[INFO] -------------------------------------------------
[INFO] Build Summary:
[INFO]   Passed: 71, Failed: 0, Errors: 0, Skipped: 2
[INFO] -------------------------------------------------
[INFO] ------------------------------------------------------------------------
[INFO] BUILD SUCCESS
[INFO] ------------------------------------------------------------------------
[INFO] Total time:  10:30 min
[INFO] Finished at: 2020-06-05T12:12:13-07:00
[INFO] ------------------------------------------------------------------------
[INFO] [jenkins-event-spy] Generated F:\jenkins\jenkins-slave\workspace\aven-invoker-plugin_MINVOKER-255@3@2@tmp\withMavena75240d4\maven-spy-20200605-120142-8302633491312798410266.log
[Pipeline] }
[Pipeline] // dir
[Pipeline] }
[withMaven] artifactsPublisher - Archive artifact windows-jdk15-m3.6.x_build\pom.xml under
org\apache\maven\plugins\maven-invoker-plugin\3.2.2-SNAPSHOT\maven-invoker-plugin-3.2.2-SNAPSHOT.pom
[withMaven] artifactsPublisher - Archive artifact windows-jdk15-m3.6.x_build\target\maven-invoker-plugin-3.2.2-SNAPSHOT.jar
under org\apache\maven\plugins\maven-invoker-plugin\3.2.2-SNAPSHOT\maven-invoker-plugin-3.2.2-SNAPSHOT.jar
[Fast Archiver] No prior successful build to compare, so performing full copy of artifacts
[withMaven] junitPublisher - Archive test results for Maven artifact org.apache.maven.plugins:maven-invoker-plugin:maven-plugin:3.2.2-SNAPSHOT
generated by maven-surefire-plugin:test (default-test): windows-jdk15-m3.6.x_build\target\surefire-reports\*.xml
Recording test results
[withMaven] openTasksPublisher - Scan Tasks for Maven artifact org.apache.maven.plugins:maven-invoker-plugin:maven-plugin:3.2.2-SNAPSHOT
in source directory windows-jdk15-m3.6.x_build\src\main\java
[TASKS] Scanning folder 'f:\jenkins\jenkins-slave\workspace\aven-invoker-plugin_MINVOKER-255@3@2'
for files matching the pattern 'windows-jdk15-m3.6.x_build\src\main\java\**\*' - excludes:
null
[TASKS] Found 17 files to scan for tasks
[TASKS] Found 8 open tasks.
Skipping warnings blame since pipelines do not have an SCM link.%n
[withMaven] invokerPublisher - Archive invoker results for Maven artifact MavenArtifact{org.apache.maven.plugins:maven-invoker-plugin:maven-plugin:3.2.2-SNAPSHOT(version:
3.2.2-SNAPSHOT, snapshot:false) } generated by PluginInvocation{org.apache.maven.plugins:maven-invoker-plugin:3.2.1@integration-test
 integration-test}: windows-jdk15-m3.6.x_build\target\invoker-reports\*.xml
[withMaven] Publishers: Generated Artifacts Publisher: 103 ms, Junit Publisher: 286 ms, Open
Task Scanner Publisher: 150 ms, Invoker Publisher: 35007 ms, Pipeline Graph Publisher: 37
ms
[Pipeline] // withMaven
[Pipeline] cleanWs
[WS-CLEANUP] Deleting project workspace...
[WS-CLEANUP] Deferred wipeout is used...
[WS-CLEANUP] done
[Pipeline] }
[Pipeline] // stage
[Pipeline] }
[Pipeline] // ws
[Pipeline] }
[Pipeline] // node
[Pipeline] }
[Pipeline] // parallel
[Pipeline] stage
[Pipeline] { (Notifications)
[Pipeline] echo
Build result: FAILURE
[Pipeline] jiraIssueSelector
[Pipeline] echo
The authors of changes [slachiewicz].
[Pipeline] echo
Sending email ...
[Pipeline] emailext
Mime
  • Unnamed multipart/mixed (inline, None, 0 bytes)
View raw message