maven-notifications mailing list archives

Site index · List index
Message view « Date » · « Thread »
Top « Date » · « Thread »
From Apache Jenkins Server <jenk...@builds.apache.org>
Subject Build failed in Jenkins: Maven TLP » maven-surefire » SUREFIRE-1796 #5
Date Tue, 09 Jun 2020 01:58:40 GMT
See https://builds.apache.org/job/maven-box/job/maven-surefire/job/SUREFIRE-1796/5/

Changes:

* static method
* static method
* InetAddress

All tests passed

Build log:
[...truncated 26826 lines...]
[2020-06-09T01:56:44.587Z] [INFO] 1 resources included (use -debug for more details)
[2020-06-09T01:56:44.587Z] [INFO] Rat check: Summary over all files. Unapproved: 0, unknown:
0, generated: 0, approved: 1 licenses.
[2020-06-09T01:56:44.587Z] [INFO] 
[2020-06-09T01:56:44.587Z] [INFO] --- maven-compiler-plugin:3.8.1:compile (compile-generated)
@ surefire-shared-utils ---
[2020-06-09T01:56:44.587Z] [INFO] No sources to compile
[2020-06-09T01:56:44.587Z] [INFO] 
[2020-06-09T01:56:44.587Z] [INFO] --- maven-remote-resources-plugin:1.7.0:process (process-resource-bundles)
@ surefire-shared-utils ---
[2020-06-09T01:56:44.587Z] [INFO] Preparing remote bundle org.apache:apache-jar-resource-bundle:1.4
[2020-06-09T01:56:44.587Z] [INFO] Copying 3 resources from 1 bundle.
[2020-06-09T01:56:44.587Z] [INFO] 
[2020-06-09T01:56:44.587Z] [INFO] --- maven-resources-plugin:3.1.0:resources (default-resources)
@ surefire-shared-utils ---
[2020-06-09T01:56:44.587Z] [INFO] Using 'UTF-8' encoding to copy filtered resources.
[2020-06-09T01:56:44.587Z] [INFO] skip non existing resourceDirectory /home/jenkins/jenkins-slave/workspace/box_maven-surefire_SUREFIRE-1796@3@2/surefire-shared-utils/src/main/resources
[2020-06-09T01:56:44.587Z] [INFO] Copying 3 resources
[2020-06-09T01:56:44.587Z] [INFO] 
[2020-06-09T01:56:44.587Z] [INFO] --- maven-compiler-plugin:3.8.1:compile (default-compile)
@ surefire-shared-utils ---
[2020-06-09T01:56:44.587Z] [INFO] No sources to compile
[2020-06-09T01:56:44.587Z] [INFO] 
[2020-06-09T01:56:44.587Z] [INFO] --- animal-sniffer-maven-plugin:1.17:check (signature-check)
@ surefire-shared-utils ---
[2020-06-09T01:56:44.587Z] [INFO] Checking unresolved references to org.codehaus.mojo.signature:java17:1.0
[2020-06-09T01:56:44.587Z] [INFO] 
[2020-06-09T01:56:44.587Z] [INFO] --- maven-resources-plugin:3.1.0:testResources (default-testResources)
@ surefire-shared-utils ---
[2020-06-09T01:56:44.587Z] [INFO] Using 'UTF-8' encoding to copy filtered resources.
[2020-06-09T01:56:44.587Z] [INFO] skip non existing resourceDirectory /home/jenkins/jenkins-slave/workspace/box_maven-surefire_SUREFIRE-1796@3@2/surefire-shared-utils/src/test/resources
[2020-06-09T01:56:44.587Z] [INFO] Copying 3 resources
[2020-06-09T01:56:44.587Z] [INFO] 
[2020-06-09T01:56:44.587Z] [INFO] --- maven-compiler-plugin:3.8.1:testCompile (default-testCompile)
@ surefire-shared-utils ---
[2020-06-09T01:56:44.587Z] [INFO] No sources to compile
[2020-06-09T01:56:44.587Z] [INFO] 
[2020-06-09T01:56:44.587Z] [INFO] --- maven-surefire-plugin:3.0.0-M4:test (default-test) @
surefire-shared-utils ---
[2020-06-09T01:56:44.587Z] [INFO] 
[2020-06-09T01:56:44.587Z] [INFO] --- maven-jar-plugin:3.2.0:jar (default-jar) @ surefire-shared-utils
---
[2020-06-09T01:56:44.587Z] [INFO] Building jar: /home/jenkins/jenkins-slave/workspace/box_maven-surefire_SUREFIRE-1796@3@2/surefire-shared-utils/target/surefire-shared-utils-3.0.0-SNAPSHOT.jar
[2020-06-09T01:56:44.587Z] [INFO] 
[2020-06-09T01:56:44.587Z] [INFO] --- maven-site-plugin:3.8.2:attach-descriptor (attach-descriptor)
@ surefire-shared-utils ---
[2020-06-09T01:56:44.587Z] [INFO] Skipping because packaging 'jar' is not pom.
[2020-06-09T01:56:44.587Z] [INFO] 
[2020-06-09T01:56:44.587Z] [INFO] --- maven-shade-plugin:3.2.3:shade (default) @ surefire-shared-utils
---
[2020-06-09T01:56:44.587Z] [INFO] Including org.apache.maven.shared:maven-shared-utils:jar:3.1.0
in the shaded jar.
[2020-06-09T01:56:44.587Z] [INFO] Including commons-io:commons-io:jar:2.6 in the shaded jar.
[2020-06-09T01:56:44.587Z] [INFO] Including org.apache.commons:commons-lang3:jar:3.8.1 in
the shaded jar.
[2020-06-09T01:56:44.587Z] [INFO] Including org.apache.commons:commons-compress:jar:1.20 in
the shaded jar.
[2020-06-09T01:56:44.587Z] [INFO] Including commons-codec:commons-codec:jar:1.11 in the shaded
jar.
[2020-06-09T01:56:44.587Z] [WARNING] commons-codec-1.11.jar, commons-compress-1.20.jar, commons-io-2.6.jar,
commons-lang3-3.8.1.jar define 2 overlapping resources: 
[2020-06-09T01:56:44.587Z] [WARNING]   - META-INF/LICENSE.txt
[2020-06-09T01:56:44.587Z] [WARNING]   - META-INF/NOTICE.txt
[2020-06-09T01:56:44.587Z] [WARNING] commons-codec-1.11.jar, commons-compress-1.20.jar, commons-io-2.6.jar,
commons-lang3-3.8.1.jar, maven-shared-utils-3.1.0.jar, surefire-shared-utils-3.0.0-SNAPSHOT.jar
define 1 overlapping resources: 
[2020-06-09T01:56:44.587Z] [WARNING]   - META-INF/MANIFEST.MF
[2020-06-09T01:56:44.587Z] [WARNING] maven-shared-utils-3.1.0.jar, surefire-shared-utils-3.0.0-SNAPSHOT.jar
define 3 overlapping resources: 
[2020-06-09T01:56:44.587Z] [WARNING]   - META-INF/DEPENDENCIES
[2020-06-09T01:56:44.587Z] [WARNING]   - META-INF/LICENSE
[2020-06-09T01:56:44.587Z] [WARNING]   - META-INF/NOTICE
[2020-06-09T01:56:44.587Z] [WARNING] maven-shade-plugin has detected that some class files
are
[2020-06-09T01:56:44.587Z] [WARNING] present in two or more JARs. When this happens, only
one
[2020-06-09T01:56:44.587Z] [WARNING] single version of the class is copied to the uber jar.
[2020-06-09T01:56:44.587Z] [WARNING] Usually this is not harmful and you can skip these warnings,
[2020-06-09T01:56:44.588Z] [WARNING] otherwise try to manually exclude artifacts based on
[2020-06-09T01:56:44.588Z] [WARNING] mvn dependency:tree -Ddetail=true and the above output.
[2020-06-09T01:56:44.588Z] [WARNING] See http://maven.apache.org/plugins/maven-shade-plugin/
[2020-06-09T01:56:44.588Z] [INFO] Replacing original artifact with shaded artifact.
[2020-06-09T01:56:44.588Z] [INFO] Replacing /home/jenkins/jenkins-slave/workspace/box_maven-surefire_SUREFIRE-1796@3@2/surefire-shared-utils/target/surefire-shared-utils-3.0.0-SNAPSHOT.jar
with /home/jenkins/jenkins-slave/workspace/box_maven-surefire_SUREFIRE-1796@3@2/surefire-shared-utils/target/surefire-shared-utils-3.0.0-SNAPSHOT-shaded.jar
[2020-06-09T01:56:44.588Z] [INFO] Dependency-reduced POM written at: /home/jenkins/jenkins-slave/workspace/box_maven-surefire_SUREFIRE-1796@3@2/surefire-shared-utils/dependency-reduced-pom.xml
[2020-06-09T01:56:44.588Z] [INFO] 
[2020-06-09T01:56:44.588Z] [INFO] --- maven-checkstyle-plugin:3.0.0:check (checkstyle-check)
@ surefire-shared-utils ---
[2020-06-09T01:56:45.305Z] [INFO] 
[2020-06-09T01:56:45.305Z] [INFO] --- maven-install-plugin:2.5.2:install (default-install)
@ surefire-shared-utils ---
[2020-06-09T01:56:45.305Z] [INFO] Installing /home/jenkins/jenkins-slave/workspace/box_maven-surefire_SUREFIRE-1796@3@2/surefire-shared-utils/target/surefire-shared-utils-3.0.0-SNAPSHOT.jar
to /home/jenkins/jenkins-slave/workspace/box_maven-surefire_SUREFIRE-1796@3@2/.m2/org/apache/maven/surefire/surefire-shared-utils/3.0.0-SNAPSHOT/surefire-shared-utils-3.0.0-SNAPSHOT.jar
[2020-06-09T01:56:45.306Z] [INFO] Installing /home/jenkins/jenkins-slave/workspace/box_maven-surefire_SUREFIRE-1796@3@2/surefire-shared-utils/dependency-reduced-pom.xml
to /home/jenkins/jenkins-slave/workspace/box_maven-surefire_SUREFIRE-1796@3@2/.m2/org/apache/maven/surefire/surefire-shared-utils/3.0.0-SNAPSHOT/surefire-shared-utils-3.0.0-SNAPSHOT.pom
[2020-06-09T01:56:45.306Z] [INFO] ------------------------------------------------------------------------
[2020-06-09T01:56:45.306Z] [INFO] Reactor Summary for Apache Maven Surefire 3.0.0-SNAPSHOT:
[2020-06-09T01:56:45.306Z] [INFO] 
[2020-06-09T01:56:45.306Z] [INFO] Apache Maven Surefire .............................. SUCCESS
[ 24.127 s]
[2020-06-09T01:56:45.306Z] [INFO] SureFire Logger API ................................ SUCCESS
[ 11.258 s]
[2020-06-09T01:56:45.306Z] [INFO] SureFire API ....................................... SUCCESS
[ 17.455 s]
[2020-06-09T01:56:45.306Z] [INFO] Surefire Extensions API ............................ SUCCESS
[  6.341 s]
[2020-06-09T01:56:45.306Z] [INFO] Surefire Extensions SPI ............................ SUCCESS
[  2.408 s]
[2020-06-09T01:56:45.306Z] [INFO] SureFire Booter .................................... SUCCESS
[ 19.956 s]
[2020-06-09T01:56:45.306Z] [INFO] Maven Surefire Test-Grouping Support ............... SUCCESS
[  6.676 s]
[2020-06-09T01:56:45.306Z] [INFO] SureFire Providers ................................. SUCCESS
[  1.085 s]
[2020-06-09T01:56:45.306Z] [INFO] Shared JUnit3 Provider Code ........................ SUCCESS
[  4.286 s]
[2020-06-09T01:56:45.306Z] [INFO] Shared Java 5 Provider Base ........................ SUCCESS
[  5.043 s]
[2020-06-09T01:56:45.306Z] [INFO] Shared JUnit4 Provider Code ........................ SUCCESS
[  5.608 s]
[2020-06-09T01:56:45.306Z] [INFO] Shared JUnit48 Provider Code ....................... SUCCESS
[  8.529 s]
[2020-06-09T01:56:45.306Z] [INFO] SureFire JUnit Runner .............................. SUCCESS
[  4.530 s]
[2020-06-09T01:56:45.306Z] [INFO] SureFire JUnit4 Runner ............................. SUCCESS
[  4.631 s]
[2020-06-09T01:56:45.306Z] [INFO] Maven Surefire Common .............................. SUCCESS
[01:00 min]
[2020-06-09T01:56:45.306Z] [INFO] SureFire JUnitCore Runner .......................... SUCCESS
[02:24 min]
[2020-06-09T01:56:45.306Z] [INFO] SureFire JUnit Platform Runner ..................... SUCCESS
[ 12.777 s]
[2020-06-09T01:56:45.306Z] [INFO] SureFire TestNG Utils .............................. SUCCESS
[  5.052 s]
[2020-06-09T01:56:45.306Z] [INFO] SureFire TestNG Runner ............................. SUCCESS
[  7.543 s]
[2020-06-09T01:56:45.306Z] [INFO] ShadeFire JUnit3 Provider .......................... SUCCESS
[  3.073 s]
[2020-06-09T01:56:45.306Z] [INFO] Surefire Report Parser ............................. SUCCESS
[  6.284 s]
[2020-06-09T01:56:45.306Z] [INFO] Maven Surefire Plugin .............................. SUCCESS
[ 11.341 s]
[2020-06-09T01:56:45.306Z] [INFO] Maven Failsafe Plugin .............................. SUCCESS
[01:07 min]
[2020-06-09T01:56:45.306Z] [INFO] Maven Surefire Report Plugin ....................... SUCCESS
[ 16.818 s]
[2020-06-09T01:56:45.306Z] [INFO] Maven Surefire Integration Tests ................... SUCCESS
[  01:49 h]
[2020-06-09T01:56:45.306Z] [INFO] Surefire Shared Utils .............................. SUCCESS
[  2.658 s]
[2020-06-09T01:56:45.306Z] [INFO] ------------------------------------------------------------------------
[2020-06-09T01:56:45.306Z] [INFO] BUILD SUCCESS
[2020-06-09T01:56:45.306Z] [INFO] ------------------------------------------------------------------------
[2020-06-09T01:56:45.306Z] [INFO] Total time:  01:57 h
[2020-06-09T01:56:45.306Z] [INFO] Finished at: 2020-06-09T01:56:42Z
[2020-06-09T01:56:45.306Z] [INFO] ------------------------------------------------------------------------
[Pipeline] }
[Pipeline] // withEnv
[Pipeline] }
[Pipeline] // stage
[Pipeline] cleanWs
[2020-06-09T01:56:46.076Z] [WS-CLEANUP] Deleting project workspace...
[2020-06-09T01:56:46.076Z] [WS-CLEANUP] Deferred wipeout is used...
[2020-06-09T01:56:46.389Z] [WS-CLEANUP] done
[Pipeline] }
[Pipeline] // ws
[Pipeline] }
[Pipeline] // timestamps
[Pipeline] }
[Pipeline] // node
[Pipeline] }
[2020-06-09T01:58:15.784Z] [INFO] 
[2020-06-09T01:58:15.784Z] [INFO] --- jacoco-maven-plugin:0.8.5:report (default-cli) @ surefire-shared-utils
---
[2020-06-09T01:58:15.784Z] [INFO] Skipping JaCoCo execution due to missing execution data
file.
[2020-06-09T01:58:15.784Z] [INFO] ------------------------------------------------------------------------
[2020-06-09T01:58:15.784Z] [INFO] Reactor Summary for Apache Maven Surefire 3.0.0-SNAPSHOT:
[2020-06-09T01:58:15.784Z] [INFO] 
[2020-06-09T01:58:15.784Z] [INFO] Apache Maven Surefire .............................. SUCCESS
[ 24.305 s]
[2020-06-09T01:58:15.784Z] [INFO] SureFire Logger API ................................ SUCCESS
[ 10.671 s]
[2020-06-09T01:58:15.784Z] [INFO] SureFire API ....................................... SUCCESS
[ 18.882 s]
[2020-06-09T01:58:15.784Z] [INFO] Surefire Extensions API ............................ SUCCESS
[  6.976 s]
[2020-06-09T01:58:15.784Z] [INFO] Surefire Extensions SPI ............................ SUCCESS
[  2.579 s]
[2020-06-09T01:58:15.784Z] [INFO] SureFire Booter .................................... SUCCESS
[ 23.424 s]
[2020-06-09T01:58:15.784Z] [INFO] Maven Surefire Test-Grouping Support ............... SUCCESS
[  7.199 s]
[2020-06-09T01:58:15.784Z] [INFO] SureFire Providers ................................. SUCCESS
[  1.334 s]
[2020-06-09T01:58:15.784Z] [INFO] Shared JUnit3 Provider Code ........................ SUCCESS
[  4.795 s]
[2020-06-09T01:58:15.784Z] [INFO] Shared Java 5 Provider Base ........................ SUCCESS
[  5.564 s]
[2020-06-09T01:58:15.784Z] [INFO] Shared JUnit4 Provider Code ........................ SUCCESS
[  5.692 s]
[2020-06-09T01:58:15.784Z] [INFO] Shared JUnit48 Provider Code ....................... SUCCESS
[  9.874 s]
[2020-06-09T01:58:15.784Z] [INFO] SureFire JUnit Runner .............................. SUCCESS
[  5.126 s]
[2020-06-09T01:58:15.784Z] [INFO] SureFire JUnit4 Runner ............................. SUCCESS
[  5.448 s]
[2020-06-09T01:58:15.784Z] [INFO] Maven Surefire Common .............................. SUCCESS
[01:03 min]
[2020-06-09T01:58:15.784Z] [INFO] SureFire JUnitCore Runner .......................... SUCCESS
[02:21 min]
[2020-06-09T01:58:15.784Z] [INFO] SureFire JUnit Platform Runner ..................... SUCCESS
[ 14.030 s]
[2020-06-09T01:58:15.784Z] [INFO] SureFire TestNG Utils .............................. SUCCESS
[  5.332 s]
[2020-06-09T01:58:15.784Z] [INFO] SureFire TestNG Runner ............................. SUCCESS
[  8.150 s]
[2020-06-09T01:58:15.784Z] [INFO] ShadeFire JUnit3 Provider .......................... SUCCESS
[  3.124 s]
[2020-06-09T01:58:15.784Z] [INFO] Surefire Report Parser ............................. SUCCESS
[  6.833 s]
[2020-06-09T01:58:15.784Z] [INFO] Maven Surefire Plugin .............................. SUCCESS
[ 12.044 s]
[2020-06-09T01:58:15.784Z] [INFO] Maven Failsafe Plugin .............................. SUCCESS
[01:07 min]
[2020-06-09T01:58:15.784Z] [INFO] Maven Surefire Report Plugin ....................... SUCCESS
[ 18.177 s]
[2020-06-09T01:58:15.784Z] [INFO] Maven Surefire Integration Tests ................... SUCCESS
[  01:48 h]
[2020-06-09T01:58:15.784Z] [INFO] Surefire Shared Utils .............................. SUCCESS
[02:13 min]
[2020-06-09T01:58:15.784Z] [INFO] ------------------------------------------------------------------------
[2020-06-09T01:58:15.784Z] [INFO] BUILD SUCCESS
[2020-06-09T01:58:15.784Z] [INFO] ------------------------------------------------------------------------
[2020-06-09T01:58:15.784Z] [INFO] Total time:  01:58 h
[2020-06-09T01:58:15.784Z] [INFO] Finished at: 2020-06-09T01:58:04Z
[2020-06-09T01:58:15.784Z] [INFO] ------------------------------------------------------------------------
[Pipeline] }
[Pipeline] // withEnv
[Pipeline] }
[Pipeline] // stage
[Pipeline] openTasks
[2020-06-09T01:58:18.275Z] [TASKS] Scanning folder '/home/jenkins/jenkins-slave/workspace/box_maven-surefire_SUREFIRE-1796@2'
for files matching the pattern '**/maven-failsafe-plugin/src/main/java,**/maven-surefire-common/src/main/java,**/maven-surefire-plugin/src/main/java,**/maven-surefire-report-plugin/src/main/java,**/surefire-api/src/main/java,**/surefire-booter/src/main/java,**/surefire-extensions-api/src/main/java,**/surefire-extensions-spi/src/main/java,**/surefire-grouper/src/main/java,**/surefire-its/src/main/java,**/surefire-logger-api/src/main/java,**/surefire-providers/**/src/main/java,**/surefire-report-parser/src/main/java'
- excludes: null
[2020-06-09T01:58:18.275Z] [TASKS] Found 0 files to scan for tasks
[2020-06-09T01:58:18.275Z] [TASKS] Found 0 open tasks.
[2020-06-09T01:58:18.275Z] Skipping warnings blame since pipelines do not have an SCM link.%n
[Pipeline] jacoco
[2020-06-09T01:58:18.502Z] [JaCoCo plugin] Collecting JaCoCo coverage data...
[2020-06-09T01:58:18.502Z] [JaCoCo plugin] **/*.exec;**/maven-failsafe-plugin/target/classes,**/maven-surefire-common/target/classes,**/maven-surefire-plugin/target/classes,**/maven-surefire-report-plugin/target/classes,**/surefire-api/target/classes,**/surefire-booter/target/classes,**/surefire-extensions-api/target/classes,**/surefire-extensions-spi/target/classes,**/surefire-grouper/target/classes,**/surefire-its/target/classes,**/surefire-logger-api/target/classes,**/surefire-providers/**/target/classes,**/surefire-report-parser/target/classes;**/maven-failsafe-plugin/src/main/java,**/maven-surefire-common/src/main/java,**/maven-surefire-plugin/src/main/java,**/maven-surefire-report-plugin/src/main/java,**/surefire-api/src/main/java,**/surefire-booter/src/main/java,**/surefire-extensions-api/src/main/java,**/surefire-extensions-spi/src/main/java,**/surefire-grouper/src/main/java,**/surefire-its/src/main/java,**/surefire-logger-api/src/main/java,**/surefire-providers/**/src/main/java,**/surefire-report-parser/src/main/java;
locations are configured
[2020-06-09T01:58:20.158Z] [JaCoCo plugin] Number of found exec files for pattern **/*.exec:
21
[2020-06-09T01:58:26.897Z] [JaCoCo plugin] Saving matched execfiles:  /home/jenkins/jenkins-slave/workspace/box_maven-surefire_SUREFIRE-1796@2/maven-failsafe-plugin/target/jacoco.exec
/home/jenkins/jenkins-slave/workspace/box_maven-surefire_SUREFIRE-1796@2/maven-surefire-common/target/jacoco.exec
/home/jenkins/jenkins-slave/workspace/box_maven-surefire_SUREFIRE-1796@2/maven-surefire-plugin/target/jacoco.exec
/home/jenkins/jenkins-slave/workspace/box_maven-surefire_SUREFIRE-1796@2/maven-surefire-report-plugin/target/jacoco.exec
/home/jenkins/jenkins-slave/workspace/box_maven-surefire_SUREFIRE-1796@2/surefire-api/target/jacoco.exec
/home/jenkins/jenkins-slave/workspace/box_maven-surefire_SUREFIRE-1796@2/surefire-booter/target/jacoco.exec
/home/jenkins/jenkins-slave/workspace/box_maven-surefire_SUREFIRE-1796@2/surefire-extensions-api/target/jacoco.exec
/home/jenkins/jenkins-slave/workspace/box_maven-surefire_SUREFIRE-1796@2/surefire-grouper/target/jacoco.exec
/home/jenkins/jenkins-slave/workspace/box_maven-surefire_SUREFIRE-1796@2/surefire-its/target/jacoco-it.exec
/home/jenkins/jenkins-slave/workspace/box_maven-surefire_SUREFIRE-1796@2/surefire-logger-api/target/jacoco.exec
/home/jenkins/jenkins-slave/workspace/box_maven-surefire_SUREFIRE-1796@2/surefire-providers/common-java5/target/jacoco.exec
/home/jenkins/jenkins-slave/workspace/box_maven-surefire_SUREFIRE-1796@2/surefire-providers/common-junit3/target/jacoco.exec
/home/jenkins/jenkins-slave/workspace/box_maven-surefire_SUREFIRE-1796@2/surefire-providers/common-junit4/target/jacoco.exec
/home/jenkins/jenkins-slave/workspace/box_maven-surefire_SUREFIRE-1796@2/surefire-providers/common-junit48/target/jacoco.exec
/home/jenkins/jenkins-slave/workspace/box_maven-surefire_SUREFIRE-1796@2/surefire-providers/surefire-junit-platform/target/jacoco.exec
/home/jenkins/jenkins-slave/workspace/box_maven-surefire_SUREFIRE-1796@2/surefire-providers/surefire-junit3/target/jacoco.exec
/home/jenkins/jenkins-slave/workspace/box_maven-surefire_SUREFIRE-1796@2/surefire-providers/surefire-junit4/target/jacoco.exec
/home/jenkins/jenkins-slave/workspace/box_maven-surefire_SUREFIRE-1796@2/surefire-providers/surefire-junit47/target/jacoco.exec
/home/jenkins/jenkins-slave/workspace/box_maven-surefire_SUREFIRE-1796@2/surefire-providers/surefire-testng-utils/target/jacoco.exec
/home/jenkins/jenkins-slave/workspace/box_maven-surefire_SUREFIRE-1796@2/surefire-providers/surefire-testng/target/jacoco.exec
/home/jenkins/jenkins-slave/workspace/box_maven-surefire_SUREFIRE-1796@2/surefire-report-parser/target/jacoco.exec
[2020-06-09T01:58:27.065Z] [JaCoCo plugin] Saving matched class directories for class-pattern:
**/maven-failsafe-plugin/target/classes,**/maven-surefire-common/target/classes,**/maven-surefire-plugin/target/classes,**/maven-surefire-report-plugin/target/classes,**/surefire-api/target/classes,**/surefire-booter/target/classes,**/surefire-extensions-api/target/classes,**/surefire-extensions-spi/target/classes,**/surefire-grouper/target/classes,**/surefire-its/target/classes,**/surefire-logger-api/target/classes,**/surefire-providers/**/target/classes,**/surefire-report-parser/target/classes:

[2020-06-09T01:58:27.557Z] [JaCoCo plugin]  - /home/jenkins/jenkins-slave/workspace/box_maven-surefire_SUREFIRE-1796@2/maven-failsafe-plugin/target/classes
4 files
[2020-06-09T01:58:27.719Z] [JaCoCo plugin]  - /home/jenkins/jenkins-slave/workspace/box_maven-surefire_SUREFIRE-1796@2/maven-surefire-common/target/classes
158 files
[2020-06-09T01:58:27.889Z] [JaCoCo plugin]  - /home/jenkins/jenkins-slave/workspace/box_maven-surefire_SUREFIRE-1796@2/maven-surefire-plugin/target/classes
2 files
[2020-06-09T01:58:28.123Z] [JaCoCo plugin]  - /home/jenkins/jenkins-slave/workspace/box_maven-surefire_SUREFIRE-1796@2/maven-surefire-report-plugin/target/classes
10 files
[2020-06-09T01:58:28.321Z] [JaCoCo plugin]  - /home/jenkins/jenkins-slave/workspace/box_maven-surefire_SUREFIRE-1796@2/surefire-api/target/classes
126 files
[2020-06-09T01:58:28.490Z] [JaCoCo plugin]  - /home/jenkins/jenkins-slave/workspace/box_maven-surefire_SUREFIRE-1796@2/surefire-booter/target/classes
51 files
[2020-06-09T01:58:28.649Z] [JaCoCo plugin]  - /home/jenkins/jenkins-slave/workspace/box_maven-surefire_SUREFIRE-1796@2/surefire-extensions-api/target/classes
20 files
[2020-06-09T01:58:28.824Z] [JaCoCo plugin]  - /home/jenkins/jenkins-slave/workspace/box_maven-surefire_SUREFIRE-1796@2/surefire-extensions-spi/target/classes
1 files
[2020-06-09T01:58:29.055Z] [JaCoCo plugin]  - /home/jenkins/jenkins-slave/workspace/box_maven-surefire_SUREFIRE-1796@2/surefire-grouper/target/classes
17 files
[2020-06-09T01:58:29.218Z] [JaCoCo plugin]  - /home/jenkins/jenkins-slave/workspace/box_maven-surefire_SUREFIRE-1796@2/surefire-its/target/classes
0 files
[2020-06-09T01:58:29.379Z] [JaCoCo plugin]  - /home/jenkins/jenkins-slave/workspace/box_maven-surefire_SUREFIRE-1796@2/surefire-logger-api/target/classes
6 files
[2020-06-09T01:58:29.539Z] [JaCoCo plugin]  - /home/jenkins/jenkins-slave/workspace/box_maven-surefire_SUREFIRE-1796@2/surefire-providers/common-java5/target/classes
5 files
[2020-06-09T01:58:29.708Z] [JaCoCo plugin]  - /home/jenkins/jenkins-slave/workspace/box_maven-surefire_SUREFIRE-1796@2/surefire-providers/common-junit3/target/classes
2 files
[2020-06-09T01:58:29.874Z] [JaCoCo plugin]  - /home/jenkins/jenkins-slave/workspace/box_maven-surefire_SUREFIRE-1796@2/surefire-providers/common-junit4/target/classes
12 files
[2020-06-09T01:58:30.040Z] [JaCoCo plugin]  - /home/jenkins/jenkins-slave/workspace/box_maven-surefire_SUREFIRE-1796@2/surefire-providers/common-junit48/target/classes
10 files
[2020-06-09T01:58:30.205Z] [JaCoCo plugin]  - /home/jenkins/jenkins-slave/workspace/box_maven-surefire_SUREFIRE-1796@2/surefire-providers/surefire-junit-platform/target/classes
5 files
[2020-06-09T01:58:30.366Z] [JaCoCo plugin]  - /home/jenkins/jenkins-slave/workspace/box_maven-surefire_SUREFIRE-1796@2/surefire-providers/surefire-junit3/target/classes
7 files
[2020-06-09T01:58:30.553Z] [JaCoCo plugin]  - /home/jenkins/jenkins-slave/workspace/box_maven-surefire_SUREFIRE-1796@2/surefire-providers/surefire-junit4/target/classes
4 files
[2020-06-09T01:58:30.714Z] [JaCoCo plugin]  - /home/jenkins/jenkins-slave/workspace/box_maven-surefire_SUREFIRE-1796@2/surefire-providers/surefire-junit47/target/classes
53 files
[2020-06-09T01:58:30.892Z] [JaCoCo plugin]  - /home/jenkins/jenkins-slave/workspace/box_maven-surefire_SUREFIRE-1796@2/surefire-providers/surefire-testng-utils/target/classes
6 files
[2020-06-09T01:58:31.057Z] [JaCoCo plugin]  - /home/jenkins/jenkins-slave/workspace/box_maven-surefire_SUREFIRE-1796@2/surefire-providers/surefire-testng/target/classes
23 files
[2020-06-09T01:58:32.723Z] [JaCoCo plugin]  - /home/jenkins/jenkins-slave/workspace/box_maven-surefire_SUREFIRE-1796@2/surefire-report-parser/target/classes
4 files
[2020-06-09T01:58:32.723Z] [JaCoCo plugin] Saving matched source directories for source-pattern:
**/maven-failsafe-plugin/src/main/java,**/maven-surefire-common/src/main/java,**/maven-surefire-plugin/src/main/java,**/maven-surefire-report-plugin/src/main/java,**/surefire-api/src/main/java,**/surefire-booter/src/main/java,**/surefire-extensions-api/src/main/java,**/surefire-extensions-spi/src/main/java,**/surefire-grouper/src/main/java,**/surefire-its/src/main/java,**/surefire-logger-api/src/main/java,**/surefire-providers/**/src/main/java,**/surefire-report-parser/src/main/java:

[2020-06-09T01:58:32.723Z] [JaCoCo plugin] Source Inclusions: **/*.java
[2020-06-09T01:58:33.037Z] [JaCoCo plugin] Source Exclusions: 
[2020-06-09T01:58:33.518Z] [JaCoCo plugin] - /home/jenkins/jenkins-slave/workspace/box_maven-surefire_SUREFIRE-1796@2/maven-failsafe-plugin/src/main/java
3 files
[2020-06-09T01:58:33.679Z] [JaCoCo plugin] - /home/jenkins/jenkins-slave/workspace/box_maven-surefire_SUREFIRE-1796@2/maven-surefire-common/src/main/java
97 files
[2020-06-09T01:58:33.844Z] [JaCoCo plugin] - /home/jenkins/jenkins-slave/workspace/box_maven-surefire_SUREFIRE-1796@2/maven-surefire-plugin/src/main/java
1 files
[2020-06-09T01:58:34.046Z] [JaCoCo plugin] - /home/jenkins/jenkins-slave/workspace/box_maven-surefire_SUREFIRE-1796@2/maven-surefire-report-plugin/src/main/java
7 files
[2020-06-09T01:58:34.230Z] [JaCoCo plugin] - /home/jenkins/jenkins-slave/workspace/box_maven-surefire_SUREFIRE-1796@2/surefire-api/src/main/java
102 files
[2020-06-09T01:58:34.397Z] [JaCoCo plugin] - /home/jenkins/jenkins-slave/workspace/box_maven-surefire_SUREFIRE-1796@2/surefire-booter/src/main/java
30 files
[2020-06-09T01:58:34.554Z] [JaCoCo plugin] - /home/jenkins/jenkins-slave/workspace/box_maven-surefire_SUREFIRE-1796@2/surefire-extensions-api/src/main/java
18 files
[2020-06-09T01:58:34.715Z] [JaCoCo plugin] - /home/jenkins/jenkins-slave/workspace/box_maven-surefire_SUREFIRE-1796@2/surefire-extensions-spi/src/main/java
1 files
[2020-06-09T01:58:34.876Z] [JaCoCo plugin] - /home/jenkins/jenkins-slave/workspace/box_maven-surefire_SUREFIRE-1796@2/surefire-grouper/src/main/java
6 files
[2020-06-09T01:58:35.037Z] [JaCoCo plugin] - /home/jenkins/jenkins-slave/workspace/box_maven-surefire_SUREFIRE-1796@2/surefire-logger-api/src/main/java
6 files
[2020-06-09T01:58:35.198Z] [JaCoCo plugin] - /home/jenkins/jenkins-slave/workspace/box_maven-surefire_SUREFIRE-1796@2/surefire-providers/common-java5/src/main/java
5 files
[2020-06-09T01:58:35.364Z] [JaCoCo plugin] - /home/jenkins/jenkins-slave/workspace/box_maven-surefire_SUREFIRE-1796@2/surefire-providers/common-junit3/src/main/java
2 files
[2020-06-09T01:58:35.529Z] [JaCoCo plugin] - /home/jenkins/jenkins-slave/workspace/box_maven-surefire_SUREFIRE-1796@2/surefire-providers/common-junit4/src/main/java
9 files
[2020-06-09T01:58:35.692Z] [JaCoCo plugin] - /home/jenkins/jenkins-slave/workspace/box_maven-surefire_SUREFIRE-1796@2/surefire-providers/common-junit48/src/main/java
10 files
[2020-06-09T01:58:35.855Z] [JaCoCo plugin] - /home/jenkins/jenkins-slave/workspace/box_maven-surefire_SUREFIRE-1796@2/surefire-providers/surefire-junit-platform/src/main/java
4 files
[2020-06-09T01:58:36.022Z] [JaCoCo plugin] - /home/jenkins/jenkins-slave/workspace/box_maven-surefire_SUREFIRE-1796@2/surefire-providers/surefire-junit3/src/main/java
6 files
[2020-06-09T01:58:36.214Z] [JaCoCo plugin] - /home/jenkins/jenkins-slave/workspace/box_maven-surefire_SUREFIRE-1796@2/surefire-providers/surefire-junit4/src/main/java
2 files
[2020-06-09T01:58:36.375Z] [JaCoCo plugin] - /home/jenkins/jenkins-slave/workspace/box_maven-surefire_SUREFIRE-1796@2/surefire-providers/surefire-junit47/src/main/java
39 files
[2020-06-09T01:58:36.548Z] [JaCoCo plugin] - /home/jenkins/jenkins-slave/workspace/box_maven-surefire_SUREFIRE-1796@2/surefire-providers/surefire-testng-utils/src/main/java
6 files
[2020-06-09T01:58:36.712Z] [JaCoCo plugin] - /home/jenkins/jenkins-slave/workspace/box_maven-surefire_SUREFIRE-1796@2/surefire-providers/surefire-testng/src/main/java
17 files
[2020-06-09T01:58:36.712Z] [JaCoCo plugin] - /home/jenkins/jenkins-slave/workspace/box_maven-surefire_SUREFIRE-1796@2/surefire-report-parser/src/main/java
4 files
[2020-06-09T01:58:36.712Z] [JaCoCo plugin] Loading inclusions files..
[2020-06-09T01:58:36.712Z] [JaCoCo plugin] inclusions: []
[2020-06-09T01:58:36.712Z] [JaCoCo plugin] exclusions: []
[2020-06-09T01:58:36.802Z] [JaCoCo plugin] Thresholds: JacocoHealthReportThresholds [minClass=0,
maxClass=0, minMethod=0, maxMethod=0, minLine=0, maxLine=0, minBranch=0, maxBranch=0, minInstruction=0,
maxInstruction=0, minComplexity=0, maxComplexity=0]
[2020-06-09T01:58:36.802Z] [JaCoCo plugin] Publishing the results..
[2020-06-09T01:58:36.884Z] [JaCoCo plugin] Loading packages..
[2020-06-09T01:58:36.890Z] [JaCoCo plugin] Done.
[2020-06-09T01:58:36.890Z] [JaCoCo plugin] Overall coverage: class: 78, method: 65, line:
63, branch: 50, instruction: 63
[Pipeline] junit
[2020-06-09T01:58:37.107Z] Recording test results
[Pipeline] cleanWs
[2020-06-09T01:58:39.973Z] [WS-CLEANUP] Deleting project workspace...
[2020-06-09T01:58:39.974Z] [WS-CLEANUP] Deferred wipeout is used...
[2020-06-09T01:58:40.331Z] [WS-CLEANUP] done
[Pipeline] }
[Pipeline] // ws
[Pipeline] }
[Pipeline] // timestamps
[Pipeline] }
[Pipeline] // node
[Pipeline] }
[Pipeline] // parallel
[Pipeline] echo
hudson.AbortException: hudson.AbortException: script returned exit code 1
[Pipeline] echo
Build result: FAILURE
[Pipeline] jiraIssueSelector
[Pipeline] echo
The authors of changes [tibordigana].
[Pipeline] echo
Sending email ...
[Pipeline] emailext
Mime
  • Unnamed multipart/mixed (inline, None, 0 bytes)
View raw message