maven-notifications mailing list archives

Site index · List index
Message view « Date » · « Thread »
Top « Date » · « Thread »
From Apache Jenkins Server <jenk...@builds.apache.org>
Subject Build failed in Jenkins: Maven TLP » maven-surefire » SUREFIRE-1796 #6
Date Wed, 10 Jun 2020 00:36:19 GMT
See https://builds.apache.org/job/maven-box/job/maven-surefire/job/SUREFIRE-1796/6/

Changes:

* changes after Michael's review

All tests passed

Build log:
[...truncated 30634 lines...]
[2020-06-10T00:31:52.747Z] [INFO] Building jar: C:\Windows\System32\config\systemprofile\AppData\Local\Temp\jenkins-maven-box-maven-surefire-SUREFIRE-1796-6@2\surefire-shared-utils\target\surefire-shared-utils-3.0.0-SNAPSHOT.jar
[2020-06-10T00:31:52.747Z] [INFO] 
[2020-06-10T00:31:52.747Z] [INFO] --- maven-site-plugin:3.8.2:attach-descriptor (attach-descriptor)
@ surefire-shared-utils ---
[2020-06-10T00:31:52.747Z] [INFO] Skipping because packaging 'jar' is not pom.
[2020-06-10T00:31:52.747Z] [INFO] 
[2020-06-10T00:31:52.747Z] [INFO] --- maven-shade-plugin:3.2.3:shade (default) @ surefire-shared-utils
---
[2020-06-10T00:31:52.747Z] [INFO] Including org.apache.maven.shared:maven-shared-utils:jar:3.1.0
in the shaded jar.
[2020-06-10T00:31:52.747Z] [INFO] Including commons-io:commons-io:jar:2.6 in the shaded jar.
[2020-06-10T00:31:52.747Z] [INFO] Including org.apache.commons:commons-lang3:jar:3.8.1 in
the shaded jar.
[2020-06-10T00:31:52.747Z] [INFO] Including org.apache.commons:commons-compress:jar:1.20 in
the shaded jar.
[2020-06-10T00:31:52.747Z] [INFO] Including commons-codec:commons-codec:jar:1.11 in the shaded
jar.
[2020-06-10T00:31:53.033Z] [WARNING] commons-codec-1.11.jar, commons-compress-1.20.jar, commons-io-2.6.jar,
commons-lang3-3.8.1.jar define 2 overlapping resources: 
[2020-06-10T00:31:53.033Z] [WARNING]   - META-INF/LICENSE.txt
[2020-06-10T00:31:53.033Z] [WARNING]   - META-INF/NOTICE.txt
[2020-06-10T00:31:53.033Z] [WARNING] maven-shared-utils-3.1.0.jar, surefire-shared-utils-3.0.0-SNAPSHOT.jar
define 3 overlapping resources: 
[2020-06-10T00:31:53.033Z] [WARNING]   - META-INF/DEPENDENCIES
[2020-06-10T00:31:53.033Z] [WARNING]   - META-INF/LICENSE
[2020-06-10T00:31:53.033Z] [WARNING]   - META-INF/NOTICE
[2020-06-10T00:31:53.033Z] [WARNING] commons-codec-1.11.jar, commons-compress-1.20.jar, commons-io-2.6.jar,
commons-lang3-3.8.1.jar, maven-shared-utils-3.1.0.jar, surefire-shared-utils-3.0.0-SNAPSHOT.jar
define 1 overlapping resources: 
[2020-06-10T00:31:53.034Z] [WARNING]   - META-INF/MANIFEST.MF
[2020-06-10T00:31:53.034Z] [WARNING] maven-shade-plugin has detected that some class files
are
[2020-06-10T00:31:53.034Z] [WARNING] present in two or more JARs. When this happens, only
one
[2020-06-10T00:31:53.034Z] [WARNING] single version of the class is copied to the uber jar.
[2020-06-10T00:31:53.034Z] [WARNING] Usually this is not harmful and you can skip these warnings,
[2020-06-10T00:31:53.034Z] [WARNING] otherwise try to manually exclude artifacts based on
[2020-06-10T00:31:53.034Z] [WARNING] mvn dependency:tree -Ddetail=true and the above output.
[2020-06-10T00:31:53.034Z] [WARNING] See http://maven.apache.org/plugins/maven-shade-plugin/
[2020-06-10T00:31:53.034Z] [INFO] Replacing original artifact with shaded artifact.
[2020-06-10T00:31:53.034Z] [INFO] Replacing C:\Windows\System32\config\systemprofile\AppData\Local\Temp\jenkins-maven-box-maven-surefire-SUREFIRE-1796-6@2\surefire-shared-utils\target\surefire-shared-utils-3.0.0-SNAPSHOT.jar
with C:\Windows\System32\config\systemprofile\AppData\Local\Temp\jenkins-maven-box-maven-surefire-SUREFIRE-1796-6@2\surefire-shared-utils\target\surefire-shared-utils-3.0.0-SNAPSHOT-shaded.jar
[2020-06-10T00:31:53.034Z] [INFO] Dependency-reduced POM written at: C:\Windows\System32\config\systemprofile\AppData\Local\Temp\jenkins-maven-box-maven-surefire-SUREFIRE-1796-6@2\surefire-shared-utils\dependency-reduced-pom.xml
[2020-06-10T00:31:53.034Z] [INFO] 
[2020-06-10T00:31:53.034Z] [INFO] --- maven-checkstyle-plugin:3.0.0:check (checkstyle-check)
@ surefire-shared-utils ---
[2020-06-10T00:31:53.324Z] [INFO] 
[2020-06-10T00:31:53.324Z] [INFO] --- maven-install-plugin:2.5.2:install (default-install)
@ surefire-shared-utils ---
[2020-06-10T00:31:53.325Z] [INFO] Installing C:\Windows\System32\config\systemprofile\AppData\Local\Temp\jenkins-maven-box-maven-surefire-SUREFIRE-1796-6@2\surefire-shared-utils\target\surefire-shared-utils-3.0.0-SNAPSHOT.jar
to C:\Windows\system32\config\systemprofile\AppData\Local\Temp\jenkins-maven-box-maven-surefire-SUREFIRE-1796-6@2\.m2\org\apache\maven\surefire\surefire-shared-utils\3.0.0-SNAPSHOT\surefire-shared-utils-3.0.0-SNAPSHOT.jar
[2020-06-10T00:31:53.325Z] [INFO] Installing C:\Windows\System32\config\systemprofile\AppData\Local\Temp\jenkins-maven-box-maven-surefire-SUREFIRE-1796-6@2\surefire-shared-utils\dependency-reduced-pom.xml
to C:\Windows\system32\config\systemprofile\AppData\Local\Temp\jenkins-maven-box-maven-surefire-SUREFIRE-1796-6@2\.m2\org\apache\maven\surefire\surefire-shared-utils\3.0.0-SNAPSHOT\surefire-shared-utils-3.0.0-SNAPSHOT.pom
[2020-06-10T00:31:53.325Z] [INFO] ------------------------------------------------------------------------
[2020-06-10T00:31:53.325Z] [INFO] Reactor Summary for Apache Maven Surefire 3.0.0-SNAPSHOT:
[2020-06-10T00:31:53.325Z] [INFO] 
[2020-06-10T00:31:53.325Z] [INFO] Apache Maven Surefire .............................. SUCCESS
[ 47.778 s]
[2020-06-10T00:31:53.325Z] [INFO] SureFire Logger API ................................ SUCCESS
[ 18.006 s]
[2020-06-10T00:31:53.325Z] [INFO] SureFire API ....................................... SUCCESS
[ 20.379 s]
[2020-06-10T00:31:53.325Z] [INFO] Surefire Extensions API ............................ SUCCESS
[  6.449 s]
[2020-06-10T00:31:53.325Z] [INFO] Surefire Extensions SPI ............................ SUCCESS
[  2.259 s]
[2020-06-10T00:31:53.325Z] [INFO] SureFire Booter .................................... SUCCESS
[ 21.448 s]
[2020-06-10T00:31:53.325Z] [INFO] Maven Surefire Test-Grouping Support ............... SUCCESS
[  8.698 s]
[2020-06-10T00:31:53.325Z] [INFO] SureFire Providers ................................. SUCCESS
[  0.881 s]
[2020-06-10T00:31:53.325Z] [INFO] Shared JUnit3 Provider Code ........................ SUCCESS
[  4.388 s]
[2020-06-10T00:31:53.325Z] [INFO] Shared Java 5 Provider Base ........................ SUCCESS
[  5.373 s]
[2020-06-10T00:31:53.325Z] [INFO] Shared JUnit4 Provider Code ........................ SUCCESS
[  7.881 s]
[2020-06-10T00:31:53.325Z] [INFO] Shared JUnit48 Provider Code ....................... SUCCESS
[  9.669 s]
[2020-06-10T00:31:53.325Z] [INFO] SureFire JUnit Runner .............................. SUCCESS
[  4.576 s]
[2020-06-10T00:31:53.325Z] [INFO] SureFire JUnit4 Runner ............................. SUCCESS
[  4.755 s]
[2020-06-10T00:31:53.325Z] [INFO] Maven Surefire Common .............................. SUCCESS
[ 55.378 s]
[2020-06-10T00:31:53.325Z] [INFO] SureFire JUnitCore Runner .......................... SUCCESS
[02:17 min]
[2020-06-10T00:31:53.325Z] [INFO] SureFire JUnit Platform Runner ..................... SUCCESS
[ 11.387 s]
[2020-06-10T00:31:53.325Z] [INFO] SureFire TestNG Utils .............................. SUCCESS
[  4.496 s]
[2020-06-10T00:31:53.325Z] [INFO] SureFire TestNG Runner ............................. SUCCESS
[  6.394 s]
[2020-06-10T00:31:53.325Z] [INFO] ShadeFire JUnit3 Provider .......................... SUCCESS
[  2.050 s]
[2020-06-10T00:31:53.325Z] [INFO] Surefire Report Parser ............................. SUCCESS
[  6.902 s]
[2020-06-10T00:31:53.325Z] [INFO] Maven Surefire Plugin .............................. SUCCESS
[ 11.513 s]
[2020-06-10T00:31:53.325Z] [INFO] Maven Failsafe Plugin .............................. SUCCESS
[01:15 min]
[2020-06-10T00:31:53.325Z] [INFO] Maven Surefire Report Plugin ....................... SUCCESS
[ 18.751 s]
[2020-06-10T00:31:53.325Z] [INFO] Maven Surefire Integration Tests ................... SUCCESS
[  01:34 h]
[2020-06-10T00:31:53.325Z] [INFO] Surefire Shared Utils .............................. SUCCESS
[  2.389 s]
[2020-06-10T00:31:53.325Z] [INFO] ------------------------------------------------------------------------
[2020-06-10T00:31:53.325Z] [INFO] BUILD SUCCESS
[2020-06-10T00:31:53.325Z] [INFO] ------------------------------------------------------------------------
[2020-06-10T00:31:53.325Z] [INFO] Total time:  01:42 h
[2020-06-10T00:31:53.325Z] [INFO] Finished at: 2020-06-09T17:31:19-07:00
[2020-06-10T00:31:53.325Z] [INFO] ------------------------------------------------------------------------
[Pipeline] }
[2020-06-10T00:31:53.660Z] [INFO] Tests run: 1, Failures: 0, Errors: 0, Skipped: 0, Time elapsed:
11.765 s - in org.apache.maven.surefire.its.jiras.Surefire972BizarreNoClassDefIT
[2020-06-10T00:31:53.660Z] [INFO] Running org.apache.maven.surefire.its.jiras.Surefire975DefaultVMEncodingIT
[Pipeline] // withEnv
[Pipeline] }
[Pipeline] // stage
[Pipeline] cleanWs
[2020-06-10T00:31:53.818Z] [WS-CLEANUP] Deleting project workspace...
[2020-06-10T00:31:53.818Z] [WS-CLEANUP] Deferred wipeout is used...
[2020-06-10T00:31:53.956Z] [WS-CLEANUP] done
[Pipeline] }
[Pipeline] // ws
[Pipeline] }
[Pipeline] // timestamps
[Pipeline] }
[Pipeline] // node
[Pipeline] }
[2020-06-10T00:31:59.089Z] [INFO] Tests run: 1, Failures: 0, Errors: 0, Skipped: 0, Time elapsed:
6.95 s - in org.apache.maven.surefire.its.jiras.Surefire975DefaultVMEncodingIT
[2020-06-10T00:31:59.089Z] [INFO] Running org.apache.maven.surefire.its.jiras.Surefire979WrongClassLoaderIT
[2020-06-10T00:32:05.800Z] [INFO] Tests run: 1, Failures: 0, Errors: 0, Skipped: 0, Time elapsed:
6.812 s - in org.apache.maven.surefire.its.jiras.Surefire979WrongClassLoaderIT
[2020-06-10T00:32:05.800Z] [INFO] Running org.apache.maven.surefire.its.jiras.Surefire985ParameterizedRunnerAndCategoriesIT
[2020-06-10T00:32:12.554Z] [INFO] Tests run: 1, Failures: 0, Errors: 0, Skipped: 0, Time elapsed:
5.987 s - in org.apache.maven.surefire.its.jiras.Surefire985ParameterizedRunnerAndCategoriesIT
[2020-06-10T00:32:12.554Z] [INFO] Running org.apache.maven.surefire.its.jiras.Surefire995CategoryInheritanceIT
[2020-06-10T00:32:52.896Z] [INFO] Tests run: 7, Failures: 0, Errors: 0, Skipped: 0, Time elapsed:
38.772 s - in org.apache.maven.surefire.its.jiras.Surefire995CategoryInheritanceIT
[2020-06-10T00:32:52.896Z] [INFO] 
[2020-06-10T00:32:52.896Z] [INFO] Results:
[2020-06-10T00:32:52.896Z] [INFO] 
[2020-06-10T00:32:52.896Z] [ERROR] Errors: 
[2020-06-10T00:32:52.896Z] [ERROR]   Surefire1534ReuseForksFalseWithJavaModuleIT.testExecuteWithReuseForksFalseWithJavaModuleWithFilter:67
» SurefireVerifier
[2020-06-10T00:32:52.896Z] [INFO] 
[2020-06-10T00:32:52.896Z] [ERROR] Tests run: 959, Failures: 0, Errors: 1, Skipped: 138
[2020-06-10T00:32:52.896Z] [INFO] 
[2020-06-10T00:32:52.896Z] [INFO] 
[2020-06-10T00:32:52.896Z] [INFO] --- maven-checkstyle-plugin:3.0.0:check (checkstyle-check)
@ surefire-its ---
[2020-06-10T00:32:52.896Z] [INFO] 
[2020-06-10T00:32:52.896Z] [INFO] --- maven-failsafe-plugin:3.0.0-M4:verify (default) @ surefire-its
---
[2020-06-10T00:32:52.896Z] [INFO] Failsafe report directory: C:\Windows\System32\config\systemprofile\AppData\Local\Temp\jenkins-maven-box-maven-surefire-SUREFIRE-1796-6\surefire-its\target\failsafe-reports
[2020-06-10T00:32:53.168Z] [INFO] ------------------------------------------------------------------------
[2020-06-10T00:32:53.169Z] [INFO] Reactor Summary for Apache Maven Surefire 3.0.0-SNAPSHOT:
[2020-06-10T00:32:53.169Z] [INFO] 
[2020-06-10T00:32:53.169Z] [INFO] Apache Maven Surefire .............................. SUCCESS
[ 48.814 s]
[2020-06-10T00:32:53.169Z] [INFO] SureFire Logger API ................................ SUCCESS
[ 18.556 s]
[2020-06-10T00:32:53.169Z] [INFO] SureFire API ....................................... SUCCESS
[ 21.046 s]
[2020-06-10T00:32:53.169Z] [INFO] Surefire Extensions API ............................ SUCCESS
[  6.758 s]
[2020-06-10T00:32:53.169Z] [INFO] Surefire Extensions SPI ............................ SUCCESS
[  2.152 s]
[2020-06-10T00:32:53.169Z] [INFO] SureFire Booter .................................... SUCCESS
[ 21.296 s]
[2020-06-10T00:32:53.169Z] [INFO] Maven Surefire Test-Grouping Support ............... SUCCESS
[  8.848 s]
[2020-06-10T00:32:53.169Z] [INFO] SureFire Providers ................................. SUCCESS
[  0.726 s]
[2020-06-10T00:32:53.169Z] [INFO] Shared JUnit3 Provider Code ........................ SUCCESS
[  4.161 s]
[2020-06-10T00:32:53.169Z] [INFO] Shared Java 5 Provider Base ........................ SUCCESS
[  5.473 s]
[2020-06-10T00:32:53.169Z] [INFO] Shared JUnit4 Provider Code ........................ SUCCESS
[  6.008 s]
[2020-06-10T00:32:53.169Z] [INFO] Shared JUnit48 Provider Code ....................... SUCCESS
[  9.477 s]
[2020-06-10T00:32:53.169Z] [INFO] SureFire JUnit Runner .............................. SUCCESS
[  4.713 s]
[2020-06-10T00:32:53.169Z] [INFO] SureFire JUnit4 Runner ............................. SUCCESS
[  6.263 s]
[2020-06-10T00:32:53.169Z] [INFO] Maven Surefire Common .............................. SUCCESS
[ 56.384 s]
[2020-06-10T00:32:53.169Z] [INFO] SureFire JUnitCore Runner .......................... SUCCESS
[02:19 min]
[2020-06-10T00:32:53.169Z] [INFO] SureFire JUnit Platform Runner ..................... SUCCESS
[ 12.241 s]
[2020-06-10T00:32:53.169Z] [INFO] SureFire TestNG Utils .............................. SUCCESS
[  4.602 s]
[2020-06-10T00:32:53.169Z] [INFO] SureFire TestNG Runner ............................. SUCCESS
[  7.379 s]
[2020-06-10T00:32:53.169Z] [INFO] ShadeFire JUnit3 Provider .......................... SUCCESS
[  2.228 s]
[2020-06-10T00:32:53.169Z] [INFO] Surefire Report Parser ............................. SUCCESS
[  6.305 s]
[2020-06-10T00:32:53.169Z] [INFO] Maven Surefire Plugin .............................. SUCCESS
[ 11.607 s]
[2020-06-10T00:32:53.169Z] [INFO] Maven Failsafe Plugin .............................. SUCCESS
[01:14 min]
[2020-06-10T00:32:53.169Z] [INFO] Maven Surefire Report Plugin ....................... SUCCESS
[ 16.877 s]
[2020-06-10T00:32:53.169Z] [INFO] Maven Surefire Integration Tests ................... FAILURE
[  01:35 h]
[2020-06-10T00:32:53.169Z] [INFO] Surefire Shared Utils .............................. SKIPPED
[2020-06-10T00:32:53.169Z] [INFO] ------------------------------------------------------------------------
[2020-06-10T00:32:53.169Z] [INFO] BUILD FAILURE
[2020-06-10T00:32:53.169Z] [INFO] ------------------------------------------------------------------------
[2020-06-10T00:32:53.169Z] [INFO] Total time:  01:43 h
[2020-06-10T00:32:53.169Z] [INFO] Finished at: 2020-06-09T17:32:52-07:00
[2020-06-10T00:32:53.169Z] [INFO] ------------------------------------------------------------------------
[2020-06-10T00:32:53.169Z] [ERROR] Failed to execute goal org.apache.maven.plugins:maven-failsafe-plugin:3.0.0-M4:verify
(default) on project surefire-its: There are test failures.
[2020-06-10T00:32:53.169Z] [ERROR] 
[2020-06-10T00:32:53.169Z] [ERROR] Please refer to C:\Windows\System32\config\systemprofile\AppData\Local\Temp\jenkins-maven-box-maven-surefire-SUREFIRE-1796-6\surefire-its\target\failsafe-reports
for the individual test results.
[2020-06-10T00:32:53.169Z] [ERROR] Please refer to dump files (if any exist) [date].dump,
[date]-jvmRun[N].dump and [date].dumpstream.
[2020-06-10T00:32:53.169Z] [ERROR] -> [Help 1]
[2020-06-10T00:32:53.169Z] org.apache.maven.lifecycle.LifecycleExecutionException: Failed
to execute goal org.apache.maven.plugins:maven-failsafe-plugin:3.0.0-M4:verify (default) on
project surefire-its: There are test failures.
[2020-06-10T00:32:53.169Z] 
[2020-06-10T00:32:53.169Z] Please refer to C:\Windows\System32\config\systemprofile\AppData\Local\Temp\jenkins-maven-box-maven-surefire-SUREFIRE-1796-6\surefire-its\target\failsafe-reports
for the individual test results.
[2020-06-10T00:32:53.169Z] Please refer to dump files (if any exist) [date].dump, [date]-jvmRun[N].dump
and [date].dumpstream.
[2020-06-10T00:32:53.169Z]     at org.apache.maven.lifecycle.internal.MojoExecutor.execute
(MojoExecutor.java:215)
[2020-06-10T00:32:53.169Z]     at org.apache.maven.lifecycle.internal.MojoExecutor.execute
(MojoExecutor.java:156)
[2020-06-10T00:32:53.169Z]     at org.apache.maven.lifecycle.internal.MojoExecutor.execute
(MojoExecutor.java:148)
[2020-06-10T00:32:53.169Z]     at org.apache.maven.lifecycle.internal.LifecycleModuleBuilder.buildProject
(LifecycleModuleBuilder.java:117)
[2020-06-10T00:32:53.169Z]     at org.apache.maven.lifecycle.internal.LifecycleModuleBuilder.buildProject
(LifecycleModuleBuilder.java:81)
[2020-06-10T00:32:53.169Z]     at org.apache.maven.lifecycle.internal.builder.singlethreaded.SingleThreadedBuilder.build
(SingleThreadedBuilder.java:56)
[2020-06-10T00:32:53.169Z]     at org.apache.maven.lifecycle.internal.LifecycleStarter.execute
(LifecycleStarter.java:128)
[2020-06-10T00:32:53.169Z]     at org.apache.maven.DefaultMaven.doExecute (DefaultMaven.java:305)
[2020-06-10T00:32:53.169Z]     at org.apache.maven.DefaultMaven.doExecute (DefaultMaven.java:192)
[2020-06-10T00:32:53.169Z]     at org.apache.maven.DefaultMaven.execute (DefaultMaven.java:105)
[2020-06-10T00:32:53.169Z]     at org.apache.maven.cli.MavenCli.execute (MavenCli.java:956)
[2020-06-10T00:32:53.169Z]     at org.apache.maven.cli.MavenCli.doMain (MavenCli.java:288)
[2020-06-10T00:32:53.169Z]     at org.apache.maven.cli.MavenCli.main (MavenCli.java:192)
[2020-06-10T00:32:53.169Z]     at sun.reflect.NativeMethodAccessorImpl.invoke0 (Native Method)
[2020-06-10T00:32:53.169Z]     at sun.reflect.NativeMethodAccessorImpl.invoke (NativeMethodAccessorImpl.java:62)
[2020-06-10T00:32:53.169Z]     at sun.reflect.DelegatingMethodAccessorImpl.invoke (DelegatingMethodAccessorImpl.java:43)
[2020-06-10T00:32:53.170Z]     at java.lang.reflect.Method.invoke (Method.java:498)
[2020-06-10T00:32:53.170Z]     at org.codehaus.plexus.classworlds.launcher.Launcher.launchEnhanced
(Launcher.java:282)
[2020-06-10T00:32:53.170Z]     at org.codehaus.plexus.classworlds.launcher.Launcher.launch
(Launcher.java:225)
[2020-06-10T00:32:53.170Z]     at org.codehaus.plexus.classworlds.launcher.Launcher.mainWithExitCode
(Launcher.java:406)
[2020-06-10T00:32:53.170Z]     at org.codehaus.plexus.classworlds.launcher.Launcher.main (Launcher.java:347)
[2020-06-10T00:32:53.170Z] Caused by: org.apache.maven.plugin.MojoFailureException: There
are test failures.
[2020-06-10T00:32:53.170Z] 
[2020-06-10T00:32:53.170Z] Please refer to C:\Windows\System32\config\systemprofile\AppData\Local\Temp\jenkins-maven-box-maven-surefire-SUREFIRE-1796-6\surefire-its\target\failsafe-reports
for the individual test results.
[2020-06-10T00:32:53.170Z] Please refer to dump files (if any exist) [date].dump, [date]-jvmRun[N].dump
and [date].dumpstream.
[2020-06-10T00:32:53.170Z]     at org.apache.maven.plugin.surefire.SurefireHelper.throwException
(SurefireHelper.java:271)
[2020-06-10T00:32:53.170Z]     at org.apache.maven.plugin.surefire.SurefireHelper.reportExecution
(SurefireHelper.java:159)
[2020-06-10T00:32:53.170Z]     at org.apache.maven.plugin.failsafe.VerifyMojo.execute (VerifyMojo.java:192)
[2020-06-10T00:32:53.170Z]     at org.apache.maven.plugin.DefaultBuildPluginManager.executeMojo
(DefaultBuildPluginManager.java:137)
[2020-06-10T00:32:53.170Z]     at org.apache.maven.lifecycle.internal.MojoExecutor.execute
(MojoExecutor.java:210)
[2020-06-10T00:32:53.170Z]     at org.apache.maven.lifecycle.internal.MojoExecutor.execute
(MojoExecutor.java:156)
[2020-06-10T00:32:53.170Z]     at org.apache.maven.lifecycle.internal.MojoExecutor.execute
(MojoExecutor.java:148)
[2020-06-10T00:32:53.170Z]     at org.apache.maven.lifecycle.internal.LifecycleModuleBuilder.buildProject
(LifecycleModuleBuilder.java:117)
[2020-06-10T00:32:53.170Z]     at org.apache.maven.lifecycle.internal.LifecycleModuleBuilder.buildProject
(LifecycleModuleBuilder.java:81)
[2020-06-10T00:32:53.170Z]     at org.apache.maven.lifecycle.internal.builder.singlethreaded.SingleThreadedBuilder.build
(SingleThreadedBuilder.java:56)
[2020-06-10T00:32:53.170Z]     at org.apache.maven.lifecycle.internal.LifecycleStarter.execute
(LifecycleStarter.java:128)
[2020-06-10T00:32:53.170Z]     at org.apache.maven.DefaultMaven.doExecute (DefaultMaven.java:305)
[2020-06-10T00:32:53.170Z]     at org.apache.maven.DefaultMaven.doExecute (DefaultMaven.java:192)
[2020-06-10T00:32:53.170Z]     at org.apache.maven.DefaultMaven.execute (DefaultMaven.java:105)
[2020-06-10T00:32:53.170Z]     at org.apache.maven.cli.MavenCli.execute (MavenCli.java:956)
[2020-06-10T00:32:53.170Z]     at org.apache.maven.cli.MavenCli.doMain (MavenCli.java:288)
[2020-06-10T00:32:53.170Z]     at org.apache.maven.cli.MavenCli.main (MavenCli.java:192)
[2020-06-10T00:32:53.170Z]     at sun.reflect.NativeMethodAccessorImpl.invoke0 (Native Method)
[2020-06-10T00:32:53.170Z]     at sun.reflect.NativeMethodAccessorImpl.invoke (NativeMethodAccessorImpl.java:62)
[2020-06-10T00:32:53.170Z]     at sun.reflect.DelegatingMethodAccessorImpl.invoke (DelegatingMethodAccessorImpl.java:43)
[2020-06-10T00:32:53.170Z]     at java.lang.reflect.Method.invoke (Method.java:498)
[2020-06-10T00:32:53.170Z]     at org.codehaus.plexus.classworlds.launcher.Launcher.launchEnhanced
(Launcher.java:282)
[2020-06-10T00:32:53.170Z]     at org.codehaus.plexus.classworlds.launcher.Launcher.launch
(Launcher.java:225)
[2020-06-10T00:32:53.170Z]     at org.codehaus.plexus.classworlds.launcher.Launcher.mainWithExitCode
(Launcher.java:406)
[2020-06-10T00:32:53.170Z]     at org.codehaus.plexus.classworlds.launcher.Launcher.main (Launcher.java:347)
[2020-06-10T00:32:53.170Z] [ERROR] 
[2020-06-10T00:32:53.170Z] [ERROR] Re-run Maven using the -X switch to enable full debug logging.
[2020-06-10T00:32:53.170Z] [ERROR] 
[2020-06-10T00:32:53.170Z] [ERROR] For more information about the errors and possible solutions,
please read the following articles:
[2020-06-10T00:32:53.170Z] [ERROR] [Help 1] http://cwiki.apache.org/confluence/display/MAVEN/MojoFailureException
[2020-06-10T00:32:53.170Z] [ERROR] 
[2020-06-10T00:32:53.170Z] [ERROR] After correcting the problems, you can resume the build
with the command
[2020-06-10T00:32:53.170Z] [ERROR]   mvn <args> -rf :surefire-its
[Pipeline] }
[Pipeline] // withEnv
[Pipeline] }
[Pipeline] // stage
[Pipeline] fileExists
[Pipeline] zip
[2020-06-10T00:32:53.396Z] Writing zip file of C:\Windows\system32\config\systemprofile\AppData\Local\Temp\jenkins-maven-box-maven-surefire-SUREFIRE-1796-6\maven-failsafe-plugin\target\it
to C:\Windows\system32\config\systemprofile\AppData\Local\Temp\jenkins-maven-box-maven-surefire-SUREFIRE-1796-6\maven-failsafe-plugin--windows-jdk11-maven3.6.x.zip
[2020-06-10T00:32:54.005Z] Zipped 78 entries.
[2020-06-10T00:32:54.006Z] Archiving C:\Windows\system32\config\systemprofile\AppData\Local\Temp\jenkins-maven-box-maven-surefire-SUREFIRE-1796-6\maven-failsafe-plugin--windows-jdk11-maven3.6.x.zip
[2020-06-10T00:32:54.044Z] [Fast Archiver] No prior successful build to compare, so performing
full copy of artifacts
[Pipeline] fileExists
[Pipeline] zip
[2020-06-10T00:32:54.245Z] Writing zip file of C:\Windows\system32\config\systemprofile\AppData\Local\Temp\jenkins-maven-box-maven-surefire-SUREFIRE-1796-6\surefire-its\target
to C:\Windows\system32\config\systemprofile\AppData\Local\Temp\jenkins-maven-box-maven-surefire-SUREFIRE-1796-6\surefire-its--windows-jdk11-maven3.6.x.zip
[2020-06-10T00:35:11.374Z] Zipped 19166 entries.
[2020-06-10T00:35:11.374Z] Archiving C:\Windows\system32\config\systemprofile\AppData\Local\Temp\jenkins-maven-box-maven-surefire-SUREFIRE-1796-6\surefire-its--windows-jdk11-maven3.6.x.zip
[2020-06-10T00:35:11.375Z] [Fast Archiver] No prior successful build to compare, so performing
full copy of artifacts
[Pipeline] archiveArtifacts
[2020-06-10T00:35:44.956Z] Archiving artifacts
[2020-06-10T00:35:44.978Z] [Fast Archiver] No prior successful build to compare, so performing
full copy of artifacts
[Pipeline] cleanWs
[2020-06-10T00:36:18.242Z] [WS-CLEANUP] Deleting project workspace...
[2020-06-10T00:36:18.242Z] [WS-CLEANUP] Deferred wipeout is used...
[2020-06-10T00:36:18.398Z] [WS-CLEANUP] done
[Pipeline] }
[Pipeline] // ws
[Pipeline] }
[Pipeline] // timestamps
[Pipeline] }
[Pipeline] // node
[Pipeline] }
[Pipeline] // parallel
[Pipeline] echo
Build result: FAILURE
[Pipeline] jiraIssueSelector
[Pipeline] echo
The authors of changes [tibordigana].
[Pipeline] echo
Sending email ...
[Pipeline] emailext
Mime
  • Unnamed multipart/mixed (inline, None, 0 bytes)
View raw message