maven-notifications mailing list archives

Site index · List index
Message view « Date » · « Thread »
Top « Date » · « Thread »
From Apache Jenkins Server <jenk...@builds.apache.org>
Subject Build failed in Jenkins: Maven TLP » maven-gpg-plugin » master #68
Date Tue, 09 Jun 2020 16:11:41 GMT
See https://builds.apache.org/job/maven-box/job/maven-gpg-plugin/job/master/68/

Changes:

* Exclude H23
* [INFRA-20239] H23 should be ok now
* Revert: Use Java 7 JDK for all released Maven versions (135a0e16) due to
* Update Maven versions
* There's no M3.6.3 for Windows

All tests passed

Build log:
[...truncated 39011 lines...]
[INFO] Parsing exclusions from F:\short\m-gpg-p-master-68@2\j15m3.6.xb\.gitignore
[INFO] Finished adding exclusions from SCM ignore files.
[INFO] 73 implicit excludes (use -debug for more details).
[INFO] 6 explicit excludes (use -debug for more details).
[INFO] 68 resources included (use -debug for more details)
[INFO] Rat check: Summary over all files. Unapproved: 0, unknown: 0, generated: 0, approved:
56 licenses.
[INFO] 
[INFO] --- maven-plugin-plugin:3.5.2:helpmojo (generate-helpmojo) @ maven-gpg-plugin ---
[INFO] Using 'UTF-8' encoding to read mojo source files.
[INFO] java-javadoc mojo extractor found 0 mojo descriptor.
[INFO] java-annotations mojo extractor found 0 mojo descriptor.
[INFO] 
[INFO] --- maven-remote-resources-plugin:1.7.0:process (process-resource-bundles) @ maven-gpg-plugin
---
[INFO] Preparing remote bundle org.apache:apache-jar-resource-bundle:1.4
[INFO] Copying 3 resources from 1 bundle.
[INFO] 
[INFO] --- maven-resources-plugin:3.1.0:resources (default-resources) @ maven-gpg-plugin ---
[INFO] Using 'UTF-8' encoding to copy filtered resources.
[INFO] Copying 1 resource
[INFO] Copying 3 resources
[INFO] 
[INFO] --- maven-compiler-plugin:3.8.1:compile (default-compile) @ maven-gpg-plugin ---
[INFO] Changes detected - recompiling the module!
[INFO] Compiling 11 source files to F:\short\m-gpg-p-master-68@2\j15m3.6.xb\target\classes
[INFO] /F:/short/m-gpg-p-master-68@2/j15m3.6.xb/src/main/java/org/apache/maven/plugins/gpg/AttachedSignedArtifact.java:
Some input files use or override a deprecated API.
[INFO] /F:/short/m-gpg-p-master-68@2/j15m3.6.xb/src/main/java/org/apache/maven/plugins/gpg/AttachedSignedArtifact.java:
Recompile with -Xlint:deprecation for details.
[INFO] 
[INFO] --- maven-plugin-plugin:3.5.2:descriptor (default-descriptor) @ maven-gpg-plugin ---
[INFO] Using 'UTF-8' encoding to read mojo source files.
[INFO] java-javadoc mojo extractor found 0 mojo descriptor.
[INFO] java-annotations mojo extractor found 3 mojo descriptors.
[INFO] 
[INFO] --- maven-resources-plugin:3.1.0:testResources (default-testResources) @ maven-gpg-plugin
---
[INFO] Using 'UTF-8' encoding to copy filtered resources.
[INFO] Copying 8 resources
[INFO] Copying 3 resources
[INFO] 
[INFO] --- maven-compiler-plugin:3.8.1:testCompile (default-testCompile) @ maven-gpg-plugin
---
[INFO] Changes detected - recompiling the module!
[INFO] Compiling 2 source files to F:\short\m-gpg-p-master-68@2\j15m3.6.xb\target\test-classes
[INFO] 
[INFO] --- maven-surefire-plugin:2.22.0:test (default-test) @ maven-gpg-plugin ---
[INFO] Surefire report directory: F:\short\m-gpg-p-master-68@2\j15m3.6.xb\target\surefire-reports
[INFO] 
[INFO] -------------------------------------------------------
[INFO]  T E S T S
[INFO] -------------------------------------------------------
[INFO] Running org.apache.maven.plugins.gpg.GpgVersionConsumerTest
[INFO] Tests run: 1, Failures: 0, Errors: 0, Skipped: 0, Time elapsed: 0.124 s - in org.apache.maven.plugins.gpg.GpgVersionConsumerTest
[INFO] Running org.apache.maven.plugins.gpg.GpgVersionTest
[INFO] Tests run: 2, Failures: 0, Errors: 0, Skipped: 0, Time elapsed: 0.001 s - in org.apache.maven.plugins.gpg.GpgVersionTest
[INFO] 
[INFO] Results:
[INFO] 
[INFO] Tests run: 3, Failures: 0, Errors: 0, Skipped: 0
[INFO] 
[INFO] 
[INFO] --- maven-jar-plugin:3.2.0:jar (default-jar) @ maven-gpg-plugin ---
[INFO] Building jar: F:\short\m-gpg-p-master-68@2\j15m3.6.xb\target\maven-gpg-plugin-3.0.1-SNAPSHOT.jar
[INFO] 
[INFO] --- maven-plugin-plugin:3.5.2:addPluginArtifactMetadata (default-addPluginArtifactMetadata)
@ maven-gpg-plugin ---
[INFO] 
[INFO] --- maven-site-plugin:3.7.1:attach-descriptor (attach-descriptor) @ maven-gpg-plugin
---
[INFO] Skipping because packaging 'maven-plugin' is not pom.
[INFO] 
[INFO] --- maven-shade-plugin:3.2.2:shade (default) @ maven-gpg-plugin ---
[INFO] Including org.apache.maven.resolver:maven-resolver-util:jar:1.4.1 in the shaded jar.
[INFO] Including org.sonatype.aether:aether-util:jar:1.13.1 in the shaded jar.
[INFO] Excluding org.apache.maven:maven-plugin-api:jar:3.0 from the shaded jar.
[INFO] Excluding org.sonatype.sisu:sisu-inject-plexus:jar:1.4.2 from the shaded jar.
[INFO] Excluding org.sonatype.sisu:sisu-inject-bean:jar:1.4.2 from the shaded jar.
[INFO] Excluding org.sonatype.sisu:sisu-guice:jar:noaop:2.1.7 from the shaded jar.
[INFO] Excluding org.apache.maven:maven-core:jar:3.0 from the shaded jar.
[INFO] Excluding org.apache.maven:maven-settings-builder:jar:3.0 from the shaded jar.
[INFO] Excluding org.apache.maven:maven-repository-metadata:jar:3.0 from the shaded jar.
[INFO] Excluding org.apache.maven:maven-aether-provider:jar:3.0 from the shaded jar.
[INFO] Excluding org.sonatype.aether:aether-impl:jar:1.7 from the shaded jar.
[INFO] Excluding org.sonatype.aether:aether-spi:jar:1.7 from the shaded jar.
[INFO] Excluding org.sonatype.aether:aether-api:jar:1.7 from the shaded jar.
[INFO] Excluding org.codehaus.plexus:plexus-interpolation:jar:1.14 from the shaded jar.
[INFO] Excluding org.codehaus.plexus:plexus-classworlds:jar:2.2.3 from the shaded jar.
[INFO] Excluding org.codehaus.plexus:plexus-component-annotations:jar:2.0.0 from the shaded
jar.
[INFO] Excluding org.apache.maven:maven-artifact:jar:3.0 from the shaded jar.
[INFO] Excluding org.apache.maven:maven-model:jar:3.0 from the shaded jar.
[INFO] Excluding org.apache.maven:maven-model-builder:jar:3.0 from the shaded jar.
[INFO] Excluding org.apache.maven:maven-settings:jar:3.0 from the shaded jar.
[INFO] Excluding org.apache.maven.shared:maven-artifact-transfer:jar:0.12.0 from the shaded
jar.
[INFO] Excluding org.apache.maven.shared:maven-common-artifact-filters:jar:3.0.1 from the
shaded jar.
[INFO] Excluding org.apache.maven.shared:maven-shared-utils:jar:3.1.0 from the shaded jar.
[INFO] Excluding commons-io:commons-io:jar:2.5 from the shaded jar.
[INFO] Excluding commons-codec:commons-codec:jar:1.11 from the shaded jar.
[INFO] Excluding org.slf4j:slf4j-api:jar:1.7.5 from the shaded jar.
[INFO] Excluding org.apache.maven.resolver:maven-resolver-api:jar:1.4.1 from the shaded jar.
[INFO] Excluding org.codehaus.plexus:plexus-utils:jar:3.3.0 from the shaded jar.
[INFO] Excluding org.sonatype.plexus:plexus-sec-dispatcher:jar:1.4 from the shaded jar.
[INFO] Excluding org.sonatype.plexus:plexus-cipher:jar:1.4 from the shaded jar.
[INFO] Replacing original artifact with shaded artifact.
[INFO] Replacing F:\short\m-gpg-p-master-68@2\j15m3.6.xb\target\maven-gpg-plugin-3.0.1-SNAPSHOT.jar
with F:\short\m-gpg-p-master-68@2\j15m3.6.xb\target\maven-gpg-plugin-3.0.1-SNAPSHOT-shaded.jar
[INFO] Dependency-reduced POM written at: F:\short\m-gpg-p-master-68@2\j15m3.6.xb\dependency-reduced-pom.xml
[INFO] 
[INFO] --- maven-invoker-plugin:3.2.1:install (integration-test) @ maven-gpg-plugin ---
[INFO] Installing F:\short\m-gpg-p-master-68@2\j15m3.6.xb\dependency-reduced-pom.xml to F:\short\m-gpg-p-master-68@2\j15m3.6.xb\target\local-repo\org\apache\maven\plugins\maven-gpg-plugin\3.0.1-SNAPSHOT\maven-gpg-plugin-3.0.1-SNAPSHOT.pom
[INFO] Installing F:\short\m-gpg-p-master-68@2\j15m3.6.xb\target\maven-gpg-plugin-3.0.1-SNAPSHOT.jar
to F:\short\m-gpg-p-master-68@2\j15m3.6.xb\target\local-repo\org\apache\maven\plugins\maven-gpg-plugin\3.0.1-SNAPSHOT\maven-gpg-plugin-3.0.1-SNAPSHOT.jar
[INFO] 
[INFO] --- maven-invoker-plugin:3.2.1:integration-test (integration-test) @ maven-gpg-plugin
---
[INFO] Building: no-main-artifact\pom.xml
[INFO] run post-build script verify.bsh
[INFO]           no-main-artifact\pom.xml ......................... SUCCESS (11.2 s)
[INFO] Building: sign-and-deploy-file-with-extras
[INFO] run pre-build script setup.bsh
[INFO] run post-build script verify.bsh
[INFO]           sign-and-deploy-file-with-extras ................. SUCCESS (4.4 s)
[INFO] Building: sign-and-deploy-file-with-pom
[INFO] run pre-build script setup.bsh
[INFO] run post-build script verify.bsh
[INFO]           sign-and-deploy-file-with-pom .................... SUCCESS (3.5 s)
[INFO] Building: sign-and-deploy-file-without-pom
[INFO] run pre-build script setup.bsh
[INFO] run post-build script verify.bsh
[INFO]   The post-build script did not succeed. Missing file F:\short\m-gpg-p-master-68@2\j15m3.6.xb\target\it\sign-and-deploy-file-without-pom\target\repo\org\apache\maven\its\gpg\sadfwop\test\1.0\test-1.0.jar
[INFO]           sign-and-deploy-file-without-pom ................. FAILED (3.3 s)
[INFO] Building: sign-and-deploy-files
[INFO] run pre-build script setup.bsh
[INFO] run post-build script verify.bsh
[INFO]           sign-and-deploy-files ............................ SUCCESS (5.3 s)
[INFO] Building: sign-and-deploy-not-jar-packaging
[INFO] run pre-build script setup.bsh
[INFO] run post-build script verify.bsh
[INFO]           sign-and-deploy-not-jar-packaging ................ SUCCESS (3.6 s)
[INFO] Building: sign-release\pom.xml
[INFO] run post-build script verify.bsh
[INFO]           sign-release\pom.xml ............................. SUCCESS (5.5 s)
[INFO] Building: sign-with-passphase-from-maven-settings\pom.xml
[INFO] run post-build script verify.bsh
[INFO]           sign-with-passphase-from-maven-settings\pom.xml .. SUCCESS (4.4 s)
[INFO] 
[INFO] --- maven-checkstyle-plugin:3.0.0:check (checkstyle-check) @ maven-gpg-plugin ---
[INFO] There is 1 error reported by Checkstyle 6.18 with config/maven_checks.xml ruleset.
[INFO] Ignored 1 error, 0 violation remaining.
[INFO] 
[INFO] --- maven-invoker-plugin:3.2.1:verify (integration-test) @ maven-gpg-plugin ---
[INFO] -------------------------------------------------
[INFO] Build Summary:
[INFO]   Passed: 7, Failed: 1, Errors: 0, Skipped: 0
[INFO] -------------------------------------------------
[ERROR] The following builds failed:
[ERROR] *  sign-and-deploy-file-without-pom
[INFO] -------------------------------------------------
[INFO] ------------------------------------------------------------------------
[INFO] BUILD FAILURE
[INFO] ------------------------------------------------------------------------
[INFO] Total time:  56.980 s
[INFO] Finished at: 2020-06-09T09:11:37-07:00
[INFO] ------------------------------------------------------------------------
[INFO] [jenkins-event-spy] Generated F:\short\m-gpg-p-master-68@2@tmp\withMaven86812a76\maven-spy-20200609-091040-6719580864519030341651.log
[ERROR] Failed to execute goal org.apache.maven.plugins:maven-invoker-plugin:3.2.1:verify
(integration-test) on project maven-gpg-plugin: 1 build failed. See console output above for
details. -> [Help 1]
org.apache.maven.lifecycle.LifecycleExecutionException: Failed to execute goal org.apache.maven.plugins:maven-invoker-plugin:3.2.1:verify
(integration-test) on project maven-gpg-plugin: 1 build failed. See console output above for
details.
    at org.apache.maven.lifecycle.internal.MojoExecutor.execute (MojoExecutor.java:215)
    at org.apache.maven.lifecycle.internal.MojoExecutor.execute (MojoExecutor.java:156)
    at org.apache.maven.lifecycle.internal.MojoExecutor.execute (MojoExecutor.java:148)
    at org.apache.maven.lifecycle.internal.LifecycleModuleBuilder.buildProject (LifecycleModuleBuilder.java:117)
    at org.apache.maven.lifecycle.internal.LifecycleModuleBuilder.buildProject (LifecycleModuleBuilder.java:81)
    at org.apache.maven.lifecycle.internal.builder.singlethreaded.SingleThreadedBuilder.build
(SingleThreadedBuilder.java:56)
    at org.apache.maven.lifecycle.internal.LifecycleStarter.execute (LifecycleStarter.java:128)
    at org.apache.maven.DefaultMaven.doExecute (DefaultMaven.java:305)
    at org.apache.maven.DefaultMaven.doExecute (DefaultMaven.java:192)
    at org.apache.maven.DefaultMaven.execute (DefaultMaven.java:105)
    at org.apache.maven.cli.MavenCli.execute (MavenCli.java:956)
    at org.apache.maven.cli.MavenCli.doMain (MavenCli.java:288)
    at org.apache.maven.cli.MavenCli.main (MavenCli.java:192)
    at jdk.internal.reflect.NativeMethodAccessorImpl.invoke0 (Native Method)
    at jdk.internal.reflect.NativeMethodAccessorImpl.invoke (NativeMethodAccessorImpl.java:62)
    at jdk.internal.reflect.DelegatingMethodAccessorImpl.invoke (DelegatingMethodAccessorImpl.java:43)
    at java.lang.reflect.Method.invoke (Method.java:564)
    at org.codehaus.plexus.classworlds.launcher.Launcher.launchEnhanced (Launcher.java:282)
    at org.codehaus.plexus.classworlds.launcher.Launcher.launch (Launcher.java:225)
    at org.codehaus.plexus.classworlds.launcher.Launcher.mainWithExitCode (Launcher.java:406)
    at org.codehaus.plexus.classworlds.launcher.Launcher.main (Launcher.java:347)
Caused by: org.apache.maven.plugin.MojoFailureException: 1 build failed. See console output
above for details.
    at org.apache.maven.plugins.invoker.InvokerSession.handleFailures (InvokerSession.java:259)
    at org.apache.maven.plugins.invoker.VerifyMojo.execute (VerifyMojo.java:140)
    at org.apache.maven.plugin.DefaultBuildPluginManager.executeMojo (DefaultBuildPluginManager.java:137)
    at org.apache.maven.lifecycle.internal.MojoExecutor.execute (MojoExecutor.java:210)
    at org.apache.maven.lifecycle.internal.MojoExecutor.execute (MojoExecutor.java:156)
    at org.apache.maven.lifecycle.internal.MojoExecutor.execute (MojoExecutor.java:148)
    at org.apache.maven.lifecycle.internal.LifecycleModuleBuilder.buildProject (LifecycleModuleBuilder.java:117)
    at org.apache.maven.lifecycle.internal.LifecycleModuleBuilder.buildProject (LifecycleModuleBuilder.java:81)
    at org.apache.maven.lifecycle.internal.builder.singlethreaded.SingleThreadedBuilder.build
(SingleThreadedBuilder.java:56)
    at org.apache.maven.lifecycle.internal.LifecycleStarter.execute (LifecycleStarter.java:128)
    at org.apache.maven.DefaultMaven.doExecute (DefaultMaven.java:305)
    at org.apache.maven.DefaultMaven.doExecute (DefaultMaven.java:192)
    at org.apache.maven.DefaultMaven.execute (DefaultMaven.java:105)
    at org.apache.maven.cli.MavenCli.execute (MavenCli.java:956)
    at org.apache.maven.cli.MavenCli.doMain (MavenCli.java:288)
    at org.apache.maven.cli.MavenCli.main (MavenCli.java:192)
    at jdk.internal.reflect.NativeMethodAccessorImpl.invoke0 (Native Method)
    at jdk.internal.reflect.NativeMethodAccessorImpl.invoke (NativeMethodAccessorImpl.java:62)
    at jdk.internal.reflect.DelegatingMethodAccessorImpl.invoke (DelegatingMethodAccessorImpl.java:43)
    at java.lang.reflect.Method.invoke (Method.java:564)
    at org.codehaus.plexus.classworlds.launcher.Launcher.launchEnhanced (Launcher.java:282)
    at org.codehaus.plexus.classworlds.launcher.Launcher.launch (Launcher.java:225)
    at org.codehaus.plexus.classworlds.launcher.Launcher.mainWithExitCode (Launcher.java:406)
    at org.codehaus.plexus.classworlds.launcher.Launcher.main (Launcher.java:347)
[ERROR] 
[ERROR] Re-run Maven using the -X switch to enable full debug logging.
[ERROR] 
[ERROR] For more information about the errors and possible solutions, please read the following
articles:
[ERROR] [Help 1] http://cwiki.apache.org/confluence/display/MAVEN/MojoFailureException
[Pipeline] }
[Pipeline] // dir
[Pipeline] }
[withMaven] junitPublisher - Archive test results for Maven artifact org.apache.maven.plugins:maven-gpg-plugin:maven-plugin:3.0.1-SNAPSHOT
generated by maven-surefire-plugin:test (default-test): j15m3.6.xb\target\surefire-reports\*.xml
Recording test results
[withMaven] openTasksPublisher - Scan Tasks for Maven artifact org.apache.maven.plugins:maven-gpg-plugin:maven-plugin:3.0.1-SNAPSHOT
in source directory j15m3.6.xb\src\main\java
[TASKS] Scanning folder 'F:\short\m-gpg-p-master-68@2' for files matching the pattern 'j15m3.6.xb\src\main\java\**\*'
- excludes: null
[TASKS] Found 10 files to scan for tasks
[TASKS] Found 1 open tasks.
Skipping warnings blame since pipelines do not have an SCM link.%n
[TASKS] Computing warning deltas based on reference build #63
[withMaven] invokerPublisher - Archive invoker results for Maven artifact MavenArtifact{org.apache.maven.plugins:maven-gpg-plugin:maven-plugin:3.0.1-SNAPSHOT(version:
3.0.1-SNAPSHOT, snapshot:false) } generated by PluginInvocation{org.apache.maven.plugins:maven-invoker-plugin:3.2.1@integration-test
 integration-test}: j15m3.6.xb\target\invoker-reports\*.xml
[withMaven] Publishers: Generated Artifacts Publisher: 23 ms, Junit Publisher: 93 ms, Open
Task Scanner Publisher: 68 ms, Invoker Publisher: 1750 ms
[Pipeline] // withMaven
[Pipeline] cleanWs
[WS-CLEANUP] Deleting project workspace...
[WS-CLEANUP] Deferred wipeout is used...
[WS-CLEANUP] done
[Pipeline] cleanWs
[WS-CLEANUP] Deleting project workspace...
[WS-CLEANUP] Deferred wipeout is used...
[WS-CLEANUP] done
[Pipeline] }
[Pipeline] // stage
[Pipeline] }
[Pipeline] // ws
[Pipeline] }
[Pipeline] // node
[Pipeline] }
Failed in branch windows-jdk15-m3.6.x_build
[Pipeline] // parallel
[Pipeline] stage
[Pipeline] { (Notifications)
[Pipeline] echo
Build result: FAILURE
[Pipeline] jiraIssueSelector
[Pipeline] echo
The authors of changes [rfscholte, hboutemy, slachiewicz].
[Pipeline] echo
Sending email ...
[Pipeline] emailext
Mime
  • Unnamed multipart/mixed (inline, None, 0 bytes)
View raw message