maven-notifications mailing list archives

Site index · List index
Message view « Date » · « Thread »
Top « Date » · « Thread »
From Apache Jenkins Server <jenk...@builds.apache.org>
Subject Build failed in Jenkins: Maven TLP » maven-surefire » SUREFIRE-1796 #3
Date Mon, 08 Jun 2020 20:40:55 GMT
See https://builds.apache.org/job/maven-box/job/maven-surefire/job/SUREFIRE-1796/3/

Changes:

* FutureTask.get() checking exception instead of try-catch within the

All tests passed

Build log:
[...truncated 26825 lines...]
[2020-06-08T20:37:04.983Z] [INFO] Tests run: 1, Failures: 0, Errors: 0, Skipped: 0, Time elapsed:
6.198 s - in org.apache.maven.surefire.its.jiras.Surefire975DefaultVMEncodingIT
[2020-06-08T20:37:04.983Z] [INFO] Running org.apache.maven.surefire.its.jiras.Surefire979WrongClassLoaderIT
[2020-06-08T20:37:11.464Z] [INFO] Tests run: 1, Failures: 0, Errors: 0, Skipped: 0, Time elapsed:
6.37 s - in org.apache.maven.surefire.its.jiras.Surefire979WrongClassLoaderIT
[2020-06-08T20:37:11.464Z] [INFO] Running org.apache.maven.surefire.its.jiras.Surefire985ParameterizedRunnerAndCategoriesIT
[2020-06-08T20:37:17.941Z] [INFO] Tests run: 1, Failures: 0, Errors: 0, Skipped: 0, Time elapsed:
6.398 s - in org.apache.maven.surefire.its.jiras.Surefire985ParameterizedRunnerAndCategoriesIT
[2020-06-08T20:37:17.941Z] [INFO] Running org.apache.maven.surefire.its.jiras.Surefire995CategoryInheritanceIT
[2020-06-08T20:38:06.828Z] [INFO] Tests run: 7, Failures: 0, Errors: 0, Skipped: 0, Time elapsed:
45.566 s - in org.apache.maven.surefire.its.jiras.Surefire995CategoryInheritanceIT
[2020-06-08T20:38:06.828Z] [INFO] 
[2020-06-08T20:38:06.828Z] [INFO] Results:
[2020-06-08T20:38:06.829Z] [INFO] 
[2020-06-08T20:38:06.829Z] [WARNING] Tests run: 959, Failures: 0, Errors: 0, Skipped: 138
[2020-06-08T20:38:06.829Z] [INFO] 
[2020-06-08T20:38:06.829Z] [INFO] 
[2020-06-08T20:38:06.829Z] [INFO] --- maven-checkstyle-plugin:3.0.0:check (checkstyle-check)
@ surefire-its ---
[2020-06-08T20:38:06.829Z] [INFO] 
[2020-06-08T20:38:06.829Z] [INFO] --- maven-failsafe-plugin:3.0.0-M4:verify (default) @ surefire-its
---
[2020-06-08T20:38:06.829Z] [INFO] Failsafe report directory: /home/jenkins/jenkins-slave/workspace/box_maven-surefire_SUREFIRE-1796@2/surefire-its/target/failsafe-reports
[2020-06-08T20:38:06.829Z] [INFO] 
[2020-06-08T20:38:06.829Z] [INFO] --- maven-install-plugin:2.5.2:install (default-install)
@ surefire-its ---
[2020-06-08T20:38:06.829Z] [INFO] Skipping artifact installation
[2020-06-08T20:38:06.829Z] [INFO] 
[2020-06-08T20:38:06.829Z] [INFO] --- maven-deploy-plugin:2.8.2:deploy (default-deploy) @
surefire-its ---
[2020-06-08T20:38:06.829Z] [INFO] Skipping artifact deployment
[2020-06-08T20:38:06.829Z] [INFO] 
[2020-06-08T20:38:06.829Z] [INFO] --- jacoco-maven-plugin:0.8.5:report (default-cli) @ surefire-its
---
[2020-06-08T20:38:06.829Z] [INFO] Skipping JaCoCo execution due to missing execution data
file.
[2020-06-08T20:38:06.829Z] [INFO] 
[2020-06-08T20:38:06.829Z] [INFO] ----------< org.apache.maven.surefire:surefire-shared-utils
>-----------
[2020-06-08T20:38:06.829Z] [INFO] Building Surefire Shared Utils 3.0.0-SNAPSHOT          
         [26/26]
[2020-06-08T20:38:06.829Z] [INFO] --------------------------------[ jar ]---------------------------------
[2020-06-08T20:38:06.829Z] [INFO] 
[2020-06-08T20:38:06.829Z] [INFO] --- maven-clean-plugin:3.1.0:clean (default-clean) @ surefire-shared-utils
---
[2020-06-08T20:38:06.829Z] [INFO] 
[2020-06-08T20:38:06.829Z] [INFO] --- maven-enforcer-plugin:3.0.0-M3:enforce (enforce-maven-version)
@ surefire-shared-utils ---
[2020-06-08T20:38:06.829Z] [INFO] 
[2020-06-08T20:38:06.829Z] [INFO] --- maven-enforcer-plugin:3.0.0-M3:enforce (enforce-bytecode-version)
@ surefire-shared-utils ---
[2020-06-08T20:38:06.829Z] [INFO] Adding ignore: module-info
[2020-06-08T20:38:06.829Z] [INFO] 
[2020-06-08T20:38:06.829Z] [INFO] --- maven-enforcer-plugin:3.0.0-M3:enforce (enforce-java)
@ surefire-shared-utils ---
[2020-06-08T20:38:06.829Z] [INFO] 
[2020-06-08T20:38:06.829Z] [INFO] --- maven-enforcer-plugin:3.0.0-M3:enforce (enforce-maven)
@ surefire-shared-utils ---
[2020-06-08T20:38:06.829Z] [INFO] 
[2020-06-08T20:38:06.829Z] [INFO] --- apache-rat-plugin:0.13:check (rat-check) @ surefire-shared-utils
---
[2020-06-08T20:38:06.829Z] [INFO] Enabled default license matchers.
[2020-06-08T20:38:06.829Z] [INFO] Will parse SCM ignores for exclusions...
[2020-06-08T20:38:06.829Z] [INFO] Finished adding exclusions from SCM ignore files.
[2020-06-08T20:38:06.829Z] [INFO] 62 implicit excludes (use -debug for more details).
[2020-06-08T20:38:06.829Z] [INFO] 27 explicit excludes (use -debug for more details).
[2020-06-08T20:38:06.829Z] [INFO] 1 resources included (use -debug for more details)
[2020-06-08T20:38:06.829Z] [INFO] Rat check: Summary over all files. Unapproved: 0, unknown:
0, generated: 0, approved: 1 licenses.
[2020-06-08T20:38:06.829Z] [INFO] 
[2020-06-08T20:38:06.829Z] [INFO] --- maven-compiler-plugin:3.8.1:compile (compile-generated)
@ surefire-shared-utils ---
[2020-06-08T20:38:06.829Z] [INFO] No sources to compile
[2020-06-08T20:38:06.829Z] [INFO] 
[2020-06-08T20:38:06.829Z] [INFO] --- maven-remote-resources-plugin:1.7.0:process (process-resource-bundles)
@ surefire-shared-utils ---
[2020-06-08T20:38:06.829Z] [INFO] Preparing remote bundle org.apache:apache-jar-resource-bundle:1.4
[2020-06-08T20:38:06.829Z] [INFO] Copying 3 resources from 1 bundle.
[2020-06-08T20:38:06.829Z] [INFO] 
[2020-06-08T20:38:06.829Z] [INFO] --- maven-resources-plugin:3.1.0:resources (default-resources)
@ surefire-shared-utils ---
[2020-06-08T20:38:06.829Z] [INFO] Using 'UTF-8' encoding to copy filtered resources.
[2020-06-08T20:38:06.829Z] [INFO] skip non existing resourceDirectory /home/jenkins/jenkins-slave/workspace/box_maven-surefire_SUREFIRE-1796@2/surefire-shared-utils/src/main/resources
[2020-06-08T20:38:06.829Z] [INFO] Copying 3 resources
[2020-06-08T20:38:06.829Z] [INFO] 
[2020-06-08T20:38:06.829Z] [INFO] --- maven-compiler-plugin:3.8.1:compile (default-compile)
@ surefire-shared-utils ---
[2020-06-08T20:38:06.829Z] [INFO] No sources to compile
[2020-06-08T20:38:06.829Z] [INFO] 
[2020-06-08T20:38:06.829Z] [INFO] --- animal-sniffer-maven-plugin:1.17:check (signature-check)
@ surefire-shared-utils ---
[2020-06-08T20:38:06.829Z] [INFO] Checking unresolved references to org.codehaus.mojo.signature:java17:1.0
[2020-06-08T20:38:06.829Z] [INFO] 
[2020-06-08T20:38:06.829Z] [INFO] --- maven-resources-plugin:3.1.0:testResources (default-testResources)
@ surefire-shared-utils ---
[2020-06-08T20:38:06.829Z] [INFO] Using 'UTF-8' encoding to copy filtered resources.
[2020-06-08T20:38:06.829Z] [INFO] skip non existing resourceDirectory /home/jenkins/jenkins-slave/workspace/box_maven-surefire_SUREFIRE-1796@2/surefire-shared-utils/src/test/resources
[2020-06-08T20:38:06.829Z] [INFO] Copying 3 resources
[2020-06-08T20:38:06.829Z] [INFO] 
[2020-06-08T20:38:06.829Z] [INFO] --- maven-compiler-plugin:3.8.1:testCompile (default-testCompile)
@ surefire-shared-utils ---
[2020-06-08T20:38:06.829Z] [INFO] No sources to compile
[2020-06-08T20:38:06.829Z] [INFO] 
[2020-06-08T20:38:06.829Z] [INFO] --- maven-surefire-plugin:3.0.0-M4:test (default-test) @
surefire-shared-utils ---
[2020-06-08T20:38:06.829Z] [INFO] 
[2020-06-08T20:38:06.829Z] [INFO] --- maven-jar-plugin:3.2.0:jar (default-jar) @ surefire-shared-utils
---
[2020-06-08T20:38:06.830Z] [INFO] Building jar: /home/jenkins/jenkins-slave/workspace/box_maven-surefire_SUREFIRE-1796@2/surefire-shared-utils/target/surefire-shared-utils-3.0.0-SNAPSHOT.jar
[2020-06-08T20:38:06.830Z] [INFO] 
[2020-06-08T20:38:06.830Z] [INFO] --- maven-site-plugin:3.8.2:attach-descriptor (attach-descriptor)
@ surefire-shared-utils ---
[2020-06-08T20:38:06.830Z] [INFO] Skipping because packaging 'jar' is not pom.
[2020-06-08T20:38:06.830Z] [INFO] 
[2020-06-08T20:38:06.830Z] [INFO] --- maven-shade-plugin:3.2.3:shade (default) @ surefire-shared-utils
---
[2020-06-08T20:38:06.830Z] [INFO] Including org.apache.maven.shared:maven-shared-utils:jar:3.1.0
in the shaded jar.
[2020-06-08T20:38:06.830Z] [INFO] Including commons-io:commons-io:jar:2.6 in the shaded jar.
[2020-06-08T20:38:06.830Z] [INFO] Including org.apache.commons:commons-lang3:jar:3.8.1 in
the shaded jar.
[2020-06-08T20:38:06.830Z] [INFO] Including org.apache.commons:commons-compress:jar:1.20 in
the shaded jar.
[2020-06-08T20:38:06.830Z] [INFO] Including commons-codec:commons-codec:jar:1.11 in the shaded
jar.
[2020-06-08T20:38:07.595Z] [WARNING] commons-codec-1.11.jar, commons-compress-1.20.jar, commons-io-2.6.jar,
commons-lang3-3.8.1.jar define 2 overlapping resources: 
[2020-06-08T20:38:07.595Z] [WARNING]   - META-INF/LICENSE.txt
[2020-06-08T20:38:07.595Z] [WARNING]   - META-INF/NOTICE.txt
[2020-06-08T20:38:07.595Z] [WARNING] maven-shared-utils-3.1.0.jar, surefire-shared-utils-3.0.0-SNAPSHOT.jar
define 3 overlapping resources: 
[2020-06-08T20:38:07.595Z] [WARNING]   - META-INF/DEPENDENCIES
[2020-06-08T20:38:07.595Z] [WARNING]   - META-INF/LICENSE
[2020-06-08T20:38:07.595Z] [WARNING]   - META-INF/NOTICE
[2020-06-08T20:38:07.595Z] [WARNING] commons-codec-1.11.jar, commons-compress-1.20.jar, commons-io-2.6.jar,
commons-lang3-3.8.1.jar, maven-shared-utils-3.1.0.jar, surefire-shared-utils-3.0.0-SNAPSHOT.jar
define 1 overlapping resources: 
[2020-06-08T20:38:07.595Z] [WARNING]   - META-INF/MANIFEST.MF
[2020-06-08T20:38:07.595Z] [WARNING] maven-shade-plugin has detected that some class files
are
[2020-06-08T20:38:07.595Z] [WARNING] present in two or more JARs. When this happens, only
one
[2020-06-08T20:38:07.595Z] [WARNING] single version of the class is copied to the uber jar.
[2020-06-08T20:38:07.595Z] [WARNING] Usually this is not harmful and you can skip these warnings,
[2020-06-08T20:38:07.595Z] [WARNING] otherwise try to manually exclude artifacts based on
[2020-06-08T20:38:07.595Z] [WARNING] mvn dependency:tree -Ddetail=true and the above output.
[2020-06-08T20:38:07.595Z] [WARNING] See http://maven.apache.org/plugins/maven-shade-plugin/
[2020-06-08T20:38:07.595Z] [INFO] Replacing original artifact with shaded artifact.
[2020-06-08T20:38:07.595Z] [INFO] Replacing /home/jenkins/jenkins-slave/workspace/box_maven-surefire_SUREFIRE-1796@2/surefire-shared-utils/target/surefire-shared-utils-3.0.0-SNAPSHOT.jar
with /home/jenkins/jenkins-slave/workspace/box_maven-surefire_SUREFIRE-1796@2/surefire-shared-utils/target/surefire-shared-utils-3.0.0-SNAPSHOT-shaded.jar
[2020-06-08T20:38:07.595Z] [INFO] Dependency-reduced POM written at: /home/jenkins/jenkins-slave/workspace/box_maven-surefire_SUREFIRE-1796@2/surefire-shared-utils/dependency-reduced-pom.xml
[2020-06-08T20:38:07.595Z] [INFO] 
[2020-06-08T20:38:07.595Z] [INFO] --- maven-checkstyle-plugin:3.0.0:check (checkstyle-check)
@ surefire-shared-utils ---
[2020-06-08T20:38:07.595Z] [INFO] 
[2020-06-08T20:38:07.595Z] [INFO] --- maven-install-plugin:2.5.2:install (default-install)
@ surefire-shared-utils ---
[2020-06-08T20:38:07.595Z] [INFO] Installing /home/jenkins/jenkins-slave/workspace/box_maven-surefire_SUREFIRE-1796@2/surefire-shared-utils/target/surefire-shared-utils-3.0.0-SNAPSHOT.jar
to /home/jenkins/jenkins-slave/workspace/box_maven-surefire_SUREFIRE-1796@2/.m2/org/apache/maven/surefire/surefire-shared-utils/3.0.0-SNAPSHOT/surefire-shared-utils-3.0.0-SNAPSHOT.jar
[2020-06-08T20:38:07.595Z] [INFO] Installing /home/jenkins/jenkins-slave/workspace/box_maven-surefire_SUREFIRE-1796@2/surefire-shared-utils/dependency-reduced-pom.xml
to /home/jenkins/jenkins-slave/workspace/box_maven-surefire_SUREFIRE-1796@2/.m2/org/apache/maven/surefire/surefire-shared-utils/3.0.0-SNAPSHOT/surefire-shared-utils-3.0.0-SNAPSHOT.pom
[2020-06-08T20:38:07.595Z] [INFO] 
[2020-06-08T20:38:07.595Z] [INFO] --- maven-deploy-plugin:2.8.2:deploy (default-deploy) @
surefire-shared-utils ---
[2020-06-08T20:40:28.028Z] [INFO] 
[2020-06-08T20:40:28.028Z] [INFO] --- jacoco-maven-plugin:0.8.5:report (default-cli) @ surefire-shared-utils
---
[2020-06-08T20:40:28.028Z] [INFO] Skipping JaCoCo execution due to missing execution data
file.
[2020-06-08T20:40:28.028Z] [INFO] ------------------------------------------------------------------------
[2020-06-08T20:40:28.028Z] [INFO] Reactor Summary for Apache Maven Surefire 3.0.0-SNAPSHOT:
[2020-06-08T20:40:28.028Z] [INFO] 
[2020-06-08T20:40:28.028Z] [INFO] Apache Maven Surefire .............................. SUCCESS
[ 21.523 s]
[2020-06-08T20:40:28.028Z] [INFO] SureFire Logger API ................................ SUCCESS
[ 11.705 s]
[2020-06-08T20:40:28.028Z] [INFO] SureFire API ....................................... SUCCESS
[ 17.893 s]
[2020-06-08T20:40:28.028Z] [INFO] Surefire Extensions API ............................ SUCCESS
[  7.750 s]
[2020-06-08T20:40:28.028Z] [INFO] Surefire Extensions SPI ............................ SUCCESS
[  2.440 s]
[2020-06-08T20:40:28.028Z] [INFO] SureFire Booter .................................... SUCCESS
[ 21.762 s]
[2020-06-08T20:40:28.028Z] [INFO] Maven Surefire Test-Grouping Support ............... SUCCESS
[  7.147 s]
[2020-06-08T20:40:28.028Z] [INFO] SureFire Providers ................................. SUCCESS
[  1.308 s]
[2020-06-08T20:40:28.028Z] [INFO] Shared JUnit3 Provider Code ........................ SUCCESS
[  4.842 s]
[2020-06-08T20:40:28.028Z] [INFO] Shared Java 5 Provider Base ........................ SUCCESS
[  5.626 s]
[2020-06-08T20:40:28.028Z] [INFO] Shared JUnit4 Provider Code ........................ SUCCESS
[  5.924 s]
[2020-06-08T20:40:28.028Z] [INFO] Shared JUnit48 Provider Code ....................... SUCCESS
[  9.565 s]
[2020-06-08T20:40:28.028Z] [INFO] SureFire JUnit Runner .............................. SUCCESS
[  5.121 s]
[2020-06-08T20:40:28.028Z] [INFO] SureFire JUnit4 Runner ............................. SUCCESS
[  5.360 s]
[2020-06-08T20:40:28.028Z] [INFO] Maven Surefire Common .............................. SUCCESS
[01:01 min]
[2020-06-08T20:40:28.028Z] [INFO] SureFire JUnitCore Runner .......................... SUCCESS
[02:18 min]
[2020-06-08T20:40:28.028Z] [INFO] SureFire JUnit Platform Runner ..................... SUCCESS
[ 14.141 s]
[2020-06-08T20:40:28.028Z] [INFO] SureFire TestNG Utils .............................. SUCCESS
[  5.249 s]
[2020-06-08T20:40:28.028Z] [INFO] SureFire TestNG Runner ............................. SUCCESS
[  7.799 s]
[2020-06-08T20:40:28.028Z] [INFO] ShadeFire JUnit3 Provider .......................... SUCCESS
[  3.221 s]
[2020-06-08T20:40:28.028Z] [INFO] Surefire Report Parser ............................. SUCCESS
[  6.843 s]
[2020-06-08T20:40:28.028Z] [INFO] Maven Surefire Plugin .............................. SUCCESS
[ 12.093 s]
[2020-06-08T20:40:28.028Z] [INFO] Maven Failsafe Plugin .............................. SUCCESS
[01:05 min]
[2020-06-08T20:40:28.028Z] [INFO] Maven Surefire Report Plugin ....................... SUCCESS
[ 17.646 s]
[2020-06-08T20:40:28.028Z] [INFO] Maven Surefire Integration Tests ................... SUCCESS
[  01:47 h]
[2020-06-08T20:40:28.028Z] [INFO] Surefire Shared Utils .............................. SUCCESS
[02:18 min]
[2020-06-08T20:40:28.028Z] [INFO] ------------------------------------------------------------------------
[2020-06-08T20:40:28.028Z] [INFO] BUILD SUCCESS
[2020-06-08T20:40:28.028Z] [INFO] ------------------------------------------------------------------------
[2020-06-08T20:40:28.028Z] [INFO] Total time:  01:57 h
[2020-06-08T20:40:28.028Z] [INFO] Finished at: 2020-06-08T20:40:21Z
[2020-06-08T20:40:28.028Z] [INFO] ------------------------------------------------------------------------
[Pipeline] }
[Pipeline] // withEnv
[Pipeline] }
[Pipeline] // stage
[Pipeline] openTasks
[2020-06-08T20:40:30.642Z] [TASKS] Scanning folder '/home/jenkins/jenkins-slave/workspace/box_maven-surefire_SUREFIRE-1796@2'
for files matching the pattern '**/maven-failsafe-plugin/src/main/java,**/maven-surefire-common/src/main/java,**/maven-surefire-plugin/src/main/java,**/maven-surefire-report-plugin/src/main/java,**/surefire-api/src/main/java,**/surefire-booter/src/main/java,**/surefire-extensions-api/src/main/java,**/surefire-extensions-spi/src/main/java,**/surefire-grouper/src/main/java,**/surefire-its/src/main/java,**/surefire-logger-api/src/main/java,**/surefire-providers/**/src/main/java,**/surefire-report-parser/src/main/java'
- excludes: null
[2020-06-08T20:40:30.642Z] [TASKS] Found 0 files to scan for tasks
[2020-06-08T20:40:30.642Z] [TASKS] Found 0 open tasks.
[2020-06-08T20:40:30.642Z] Skipping warnings blame since pipelines do not have an SCM link.%n
[Pipeline] jacoco
[2020-06-08T20:40:30.842Z] [JaCoCo plugin] Collecting JaCoCo coverage data...
[2020-06-08T20:40:30.842Z] [JaCoCo plugin] **/*.exec;**/maven-failsafe-plugin/target/classes,**/maven-surefire-common/target/classes,**/maven-surefire-plugin/target/classes,**/maven-surefire-report-plugin/target/classes,**/surefire-api/target/classes,**/surefire-booter/target/classes,**/surefire-extensions-api/target/classes,**/surefire-extensions-spi/target/classes,**/surefire-grouper/target/classes,**/surefire-its/target/classes,**/surefire-logger-api/target/classes,**/surefire-providers/**/target/classes,**/surefire-report-parser/target/classes;**/maven-failsafe-plugin/src/main/java,**/maven-surefire-common/src/main/java,**/maven-surefire-plugin/src/main/java,**/maven-surefire-report-plugin/src/main/java,**/surefire-api/src/main/java,**/surefire-booter/src/main/java,**/surefire-extensions-api/src/main/java,**/surefire-extensions-spi/src/main/java,**/surefire-grouper/src/main/java,**/surefire-its/src/main/java,**/surefire-logger-api/src/main/java,**/surefire-providers/**/src/main/java,**/surefire-report-parser/src/main/java;
locations are configured
[2020-06-08T20:40:32.452Z] [JaCoCo plugin] Number of found exec files for pattern **/*.exec:
21
[2020-06-08T20:40:38.112Z] [JaCoCo plugin] Saving matched execfiles:  /home/jenkins/jenkins-slave/workspace/box_maven-surefire_SUREFIRE-1796@2/maven-failsafe-plugin/target/jacoco.exec
/home/jenkins/jenkins-slave/workspace/box_maven-surefire_SUREFIRE-1796@2/maven-surefire-common/target/jacoco.exec
/home/jenkins/jenkins-slave/workspace/box_maven-surefire_SUREFIRE-1796@2/maven-surefire-plugin/target/jacoco.exec
/home/jenkins/jenkins-slave/workspace/box_maven-surefire_SUREFIRE-1796@2/maven-surefire-report-plugin/target/jacoco.exec
/home/jenkins/jenkins-slave/workspace/box_maven-surefire_SUREFIRE-1796@2/surefire-api/target/jacoco.exec
/home/jenkins/jenkins-slave/workspace/box_maven-surefire_SUREFIRE-1796@2/surefire-booter/target/jacoco.exec
/home/jenkins/jenkins-slave/workspace/box_maven-surefire_SUREFIRE-1796@2/surefire-extensions-api/target/jacoco.exec
/home/jenkins/jenkins-slave/workspace/box_maven-surefire_SUREFIRE-1796@2/surefire-grouper/target/jacoco.exec
/home/jenkins/jenkins-slave/workspace/box_maven-surefire_SUREFIRE-1796@2/surefire-its/target/jacoco-it.exec
/home/jenkins/jenkins-slave/workspace/box_maven-surefire_SUREFIRE-1796@2/surefire-logger-api/target/jacoco.exec
/home/jenkins/jenkins-slave/workspace/box_maven-surefire_SUREFIRE-1796@2/surefire-providers/common-java5/target/jacoco.exec
/home/jenkins/jenkins-slave/workspace/box_maven-surefire_SUREFIRE-1796@2/surefire-providers/common-junit3/target/jacoco.exec
/home/jenkins/jenkins-slave/workspace/box_maven-surefire_SUREFIRE-1796@2/surefire-providers/common-junit4/target/jacoco.exec
/home/jenkins/jenkins-slave/workspace/box_maven-surefire_SUREFIRE-1796@2/surefire-providers/common-junit48/target/jacoco.exec
/home/jenkins/jenkins-slave/workspace/box_maven-surefire_SUREFIRE-1796@2/surefire-providers/surefire-junit-platform/target/jacoco.exec
/home/jenkins/jenkins-slave/workspace/box_maven-surefire_SUREFIRE-1796@2/surefire-providers/surefire-junit3/target/jacoco.exec
/home/jenkins/jenkins-slave/workspace/box_maven-surefire_SUREFIRE-1796@2/surefire-providers/surefire-junit4/target/jacoco.exec
/home/jenkins/jenkins-slave/workspace/box_maven-surefire_SUREFIRE-1796@2/surefire-providers/surefire-junit47/target/jacoco.exec
/home/jenkins/jenkins-slave/workspace/box_maven-surefire_SUREFIRE-1796@2/surefire-providers/surefire-testng-utils/target/jacoco.exec
/home/jenkins/jenkins-slave/workspace/box_maven-surefire_SUREFIRE-1796@2/surefire-providers/surefire-testng/target/jacoco.exec
/home/jenkins/jenkins-slave/workspace/box_maven-surefire_SUREFIRE-1796@2/surefire-report-parser/target/jacoco.exec
[2020-06-08T20:40:41.358Z] [JaCoCo plugin] Saving matched class directories for class-pattern:
**/maven-failsafe-plugin/target/classes,**/maven-surefire-common/target/classes,**/maven-surefire-plugin/target/classes,**/maven-surefire-report-plugin/target/classes,**/surefire-api/target/classes,**/surefire-booter/target/classes,**/surefire-extensions-api/target/classes,**/surefire-extensions-spi/target/classes,**/surefire-grouper/target/classes,**/surefire-its/target/classes,**/surefire-logger-api/target/classes,**/surefire-providers/**/target/classes,**/surefire-report-parser/target/classes:

[2020-06-08T20:40:41.707Z] [JaCoCo plugin]  - /home/jenkins/jenkins-slave/workspace/box_maven-surefire_SUREFIRE-1796@2/maven-failsafe-plugin/target/classes
4 files
[2020-06-08T20:40:41.882Z] [JaCoCo plugin]  - /home/jenkins/jenkins-slave/workspace/box_maven-surefire_SUREFIRE-1796@2/maven-surefire-common/target/classes
157 files
[2020-06-08T20:40:42.056Z] [JaCoCo plugin]  - /home/jenkins/jenkins-slave/workspace/box_maven-surefire_SUREFIRE-1796@2/maven-surefire-plugin/target/classes
2 files
[2020-06-08T20:40:42.289Z] [JaCoCo plugin]  - /home/jenkins/jenkins-slave/workspace/box_maven-surefire_SUREFIRE-1796@2/maven-surefire-report-plugin/target/classes
10 files
[2020-06-08T20:40:42.493Z] [JaCoCo plugin]  - /home/jenkins/jenkins-slave/workspace/box_maven-surefire_SUREFIRE-1796@2/surefire-api/target/classes
126 files
[2020-06-08T20:40:42.666Z] [JaCoCo plugin]  - /home/jenkins/jenkins-slave/workspace/box_maven-surefire_SUREFIRE-1796@2/surefire-booter/target/classes
51 files
[2020-06-08T20:40:42.825Z] [JaCoCo plugin]  - /home/jenkins/jenkins-slave/workspace/box_maven-surefire_SUREFIRE-1796@2/surefire-extensions-api/target/classes
20 files
[2020-06-08T20:40:43.005Z] [JaCoCo plugin]  - /home/jenkins/jenkins-slave/workspace/box_maven-surefire_SUREFIRE-1796@2/surefire-extensions-spi/target/classes
1 files
[2020-06-08T20:40:43.258Z] [JaCoCo plugin]  - /home/jenkins/jenkins-slave/workspace/box_maven-surefire_SUREFIRE-1796@2/surefire-grouper/target/classes
17 files
[2020-06-08T20:40:43.421Z] [JaCoCo plugin]  - /home/jenkins/jenkins-slave/workspace/box_maven-surefire_SUREFIRE-1796@2/surefire-its/target/classes
0 files
[2020-06-08T20:40:43.585Z] [JaCoCo plugin]  - /home/jenkins/jenkins-slave/workspace/box_maven-surefire_SUREFIRE-1796@2/surefire-logger-api/target/classes
6 files
[2020-06-08T20:40:43.748Z] [JaCoCo plugin]  - /home/jenkins/jenkins-slave/workspace/box_maven-surefire_SUREFIRE-1796@2/surefire-providers/common-java5/target/classes
5 files
[2020-06-08T20:40:43.918Z] [JaCoCo plugin]  - /home/jenkins/jenkins-slave/workspace/box_maven-surefire_SUREFIRE-1796@2/surefire-providers/common-junit3/target/classes
2 files
[2020-06-08T20:40:44.087Z] [JaCoCo plugin]  - /home/jenkins/jenkins-slave/workspace/box_maven-surefire_SUREFIRE-1796@2/surefire-providers/common-junit4/target/classes
12 files
[2020-06-08T20:40:44.256Z] [JaCoCo plugin]  - /home/jenkins/jenkins-slave/workspace/box_maven-surefire_SUREFIRE-1796@2/surefire-providers/common-junit48/target/classes
10 files
[2020-06-08T20:40:44.422Z] [JaCoCo plugin]  - /home/jenkins/jenkins-slave/workspace/box_maven-surefire_SUREFIRE-1796@2/surefire-providers/surefire-junit-platform/target/classes
5 files
[2020-06-08T20:40:44.587Z] [JaCoCo plugin]  - /home/jenkins/jenkins-slave/workspace/box_maven-surefire_SUREFIRE-1796@2/surefire-providers/surefire-junit3/target/classes
7 files
[2020-06-08T20:40:44.776Z] [JaCoCo plugin]  - /home/jenkins/jenkins-slave/workspace/box_maven-surefire_SUREFIRE-1796@2/surefire-providers/surefire-junit4/target/classes
4 files
[2020-06-08T20:40:44.938Z] [JaCoCo plugin]  - /home/jenkins/jenkins-slave/workspace/box_maven-surefire_SUREFIRE-1796@2/surefire-providers/surefire-junit47/target/classes
53 files
[2020-06-08T20:40:45.114Z] [JaCoCo plugin]  - /home/jenkins/jenkins-slave/workspace/box_maven-surefire_SUREFIRE-1796@2/surefire-providers/surefire-testng-utils/target/classes
6 files
[2020-06-08T20:40:45.292Z] [JaCoCo plugin]  - /home/jenkins/jenkins-slave/workspace/box_maven-surefire_SUREFIRE-1796@2/surefire-providers/surefire-testng/target/classes
23 files
[2020-06-08T20:40:46.932Z] [JaCoCo plugin]  - /home/jenkins/jenkins-slave/workspace/box_maven-surefire_SUREFIRE-1796@2/surefire-report-parser/target/classes
4 files
[2020-06-08T20:40:46.932Z] [JaCoCo plugin] Saving matched source directories for source-pattern:
**/maven-failsafe-plugin/src/main/java,**/maven-surefire-common/src/main/java,**/maven-surefire-plugin/src/main/java,**/maven-surefire-report-plugin/src/main/java,**/surefire-api/src/main/java,**/surefire-booter/src/main/java,**/surefire-extensions-api/src/main/java,**/surefire-extensions-spi/src/main/java,**/surefire-grouper/src/main/java,**/surefire-its/src/main/java,**/surefire-logger-api/src/main/java,**/surefire-providers/**/src/main/java,**/surefire-report-parser/src/main/java:

[2020-06-08T20:40:46.932Z] [JaCoCo plugin] Source Inclusions: **/*.java
[2020-06-08T20:40:47.101Z] [JaCoCo plugin] Source Exclusions: 
[2020-06-08T20:40:47.358Z] [JaCoCo plugin] - /home/jenkins/jenkins-slave/workspace/box_maven-surefire_SUREFIRE-1796@2/maven-failsafe-plugin/src/main/java
3 files
[2020-06-08T20:40:47.593Z] [JaCoCo plugin] - /home/jenkins/jenkins-slave/workspace/box_maven-surefire_SUREFIRE-1796@2/maven-surefire-common/src/main/java
96 files
[2020-06-08T20:40:47.762Z] [JaCoCo plugin] - /home/jenkins/jenkins-slave/workspace/box_maven-surefire_SUREFIRE-1796@2/maven-surefire-plugin/src/main/java
1 files
[2020-06-08T20:40:47.965Z] [JaCoCo plugin] - /home/jenkins/jenkins-slave/workspace/box_maven-surefire_SUREFIRE-1796@2/maven-surefire-report-plugin/src/main/java
7 files
[2020-06-08T20:40:48.154Z] [JaCoCo plugin] - /home/jenkins/jenkins-slave/workspace/box_maven-surefire_SUREFIRE-1796@2/surefire-api/src/main/java
102 files
[2020-06-08T20:40:48.324Z] [JaCoCo plugin] - /home/jenkins/jenkins-slave/workspace/box_maven-surefire_SUREFIRE-1796@2/surefire-booter/src/main/java
30 files
[2020-06-08T20:40:48.485Z] [JaCoCo plugin] - /home/jenkins/jenkins-slave/workspace/box_maven-surefire_SUREFIRE-1796@2/surefire-extensions-api/src/main/java
18 files
[2020-06-08T20:40:48.649Z] [JaCoCo plugin] - /home/jenkins/jenkins-slave/workspace/box_maven-surefire_SUREFIRE-1796@2/surefire-extensions-spi/src/main/java
1 files
[2020-06-08T20:40:48.812Z] [JaCoCo plugin] - /home/jenkins/jenkins-slave/workspace/box_maven-surefire_SUREFIRE-1796@2/surefire-grouper/src/main/java
6 files
[2020-06-08T20:40:48.976Z] [JaCoCo plugin] - /home/jenkins/jenkins-slave/workspace/box_maven-surefire_SUREFIRE-1796@2/surefire-logger-api/src/main/java
6 files
[2020-06-08T20:40:49.137Z] [JaCoCo plugin] - /home/jenkins/jenkins-slave/workspace/box_maven-surefire_SUREFIRE-1796@2/surefire-providers/common-java5/src/main/java
5 files
[2020-06-08T20:40:49.298Z] [JaCoCo plugin] - /home/jenkins/jenkins-slave/workspace/box_maven-surefire_SUREFIRE-1796@2/surefire-providers/common-junit3/src/main/java
2 files
[2020-06-08T20:40:49.463Z] [JaCoCo plugin] - /home/jenkins/jenkins-slave/workspace/box_maven-surefire_SUREFIRE-1796@2/surefire-providers/common-junit4/src/main/java
9 files
[2020-06-08T20:40:49.625Z] [JaCoCo plugin] - /home/jenkins/jenkins-slave/workspace/box_maven-surefire_SUREFIRE-1796@2/surefire-providers/common-junit48/src/main/java
10 files
[2020-06-08T20:40:49.789Z] [JaCoCo plugin] - /home/jenkins/jenkins-slave/workspace/box_maven-surefire_SUREFIRE-1796@2/surefire-providers/surefire-junit-platform/src/main/java
4 files
[2020-06-08T20:40:49.951Z] [JaCoCo plugin] - /home/jenkins/jenkins-slave/workspace/box_maven-surefire_SUREFIRE-1796@2/surefire-providers/surefire-junit3/src/main/java
6 files
[2020-06-08T20:40:50.133Z] [JaCoCo plugin] - /home/jenkins/jenkins-slave/workspace/box_maven-surefire_SUREFIRE-1796@2/surefire-providers/surefire-junit4/src/main/java
2 files
[2020-06-08T20:40:50.294Z] [JaCoCo plugin] - /home/jenkins/jenkins-slave/workspace/box_maven-surefire_SUREFIRE-1796@2/surefire-providers/surefire-junit47/src/main/java
39 files
[2020-06-08T20:40:50.468Z] [JaCoCo plugin] - /home/jenkins/jenkins-slave/workspace/box_maven-surefire_SUREFIRE-1796@2/surefire-providers/surefire-testng-utils/src/main/java
6 files
[2020-06-08T20:40:50.633Z] [JaCoCo plugin] - /home/jenkins/jenkins-slave/workspace/box_maven-surefire_SUREFIRE-1796@2/surefire-providers/surefire-testng/src/main/java
17 files
[2020-06-08T20:40:50.633Z] [JaCoCo plugin] - /home/jenkins/jenkins-slave/workspace/box_maven-surefire_SUREFIRE-1796@2/surefire-report-parser/src/main/java
4 files
[2020-06-08T20:40:50.633Z] [JaCoCo plugin] Loading inclusions files..
[2020-06-08T20:40:50.633Z] [JaCoCo plugin] inclusions: []
[2020-06-08T20:40:50.633Z] [JaCoCo plugin] exclusions: []
[2020-06-08T20:40:50.750Z] [JaCoCo plugin] Thresholds: JacocoHealthReportThresholds [minClass=0,
maxClass=0, minMethod=0, maxMethod=0, minLine=0, maxLine=0, minBranch=0, maxBranch=0, minInstruction=0,
maxInstruction=0, minComplexity=0, maxComplexity=0]
[2020-06-08T20:40:50.750Z] [JaCoCo plugin] Publishing the results..
[2020-06-08T20:40:50.861Z] [JaCoCo plugin] Loading packages..
[2020-06-08T20:40:50.869Z] [JaCoCo plugin] Done.
[2020-06-08T20:40:50.869Z] [JaCoCo plugin] Overall coverage: class: 78, method: 65, line:
63, branch: 50, instruction: 63
[Pipeline] junit
[2020-06-08T20:40:51.054Z] Recording test results
[Pipeline] cleanWs
[2020-06-08T20:40:54.208Z] [WS-CLEANUP] Deleting project workspace...
[2020-06-08T20:40:54.208Z] [WS-CLEANUP] Deferred wipeout is used...
[2020-06-08T20:40:54.533Z] [WS-CLEANUP] done
[Pipeline] }
[Pipeline] // ws
[Pipeline] }
[Pipeline] // timestamps
[Pipeline] }
[Pipeline] // node
[Pipeline] }
[Pipeline] // parallel
[Pipeline] echo
hudson.AbortException: hudson.AbortException: script returned exit code 1
[Pipeline] echo
Build result: FAILURE
[Pipeline] jiraIssueSelector
[Pipeline] echo
The authors of changes [tibordigana].
[Pipeline] echo
Sending email ...
[Pipeline] emailext
Mime
  • Unnamed multipart/mixed (inline, None, 0 bytes)
View raw message