mina-dev mailing list archives

Site index · List index
Message view « Date » · « Thread »
Top « Date » · « Thread »
From sebb <seb...@gmail.com>
Subject Re: Build failed in Jenkins: ftpserver-trunk-jdk1.6-solaris #544
Date Fri, 23 Jan 2015 15:46:36 GMT
I've disabled the Jenkins job by stopping it from checking SCM.

There's no point running the job at present because of problems with the host

On 23 January 2015 at 15:37, Apache Jenkins Server
<jenkins@builds.apache.org> wrote:
> See <https://builds.apache.org/job/ftpserver-trunk-jdk1.6-solaris/544/>
>
> ------------------------------------------
> Started by an SCM change
> Building remotely on solaris1 (Solaris) in workspace <https://builds.apache.org/job/ftpserver-trunk-jdk1.6-solaris/ws/>
> java.io.IOException: Failed to install http://archive.apache.org/dist/maven/binaries/apache-maven-2.2.1-bin.zip
to /home/jenkins/tools/maven/apache-maven-2.2.1
>         at hudson.FilePath.installIfNecessaryFrom(FilePath.java:772)
>         at hudson.tools.DownloadFromUrlInstaller.performInstallation(DownloadFromUrlInstaller.java:70)
>         at hudson.tools.InstallerTranslator.getToolHome(InstallerTranslator.java:68)
>         at hudson.tools.ToolLocationNodeProperty.getToolHome(ToolLocationNodeProperty.java:107)
>         at hudson.tools.ToolInstallation.translateFor(ToolInstallation.java:204)
>         at hudson.tasks.Maven$MavenInstallation.forNode(Maven.java:609)
>         at hudson.maven.MavenModuleSetBuild.getEnvironment(MavenModuleSetBuild.java:182)
>         at hudson.scm.SubversionSCM.checkout(SubversionSCM.java:866)
>         at hudson.model.AbstractProject.checkout(AbstractProject.java:1252)
>         at hudson.model.AbstractBuild$AbstractBuildExecution.defaultCheckout(AbstractBuild.java:615)
>         at jenkins.scm.SCMCheckoutStrategy.checkout(SCMCheckoutStrategy.java:86)
>         at hudson.model.AbstractBuild$AbstractBuildExecution.run(AbstractBuild.java:524)
>         at hudson.model.Run.execute(Run.java:1706)
>         at hudson.maven.MavenModuleSetBuild.run(MavenModuleSetBuild.java:529)
>         at hudson.model.ResourceController.execute(ResourceController.java:88)
>         at hudson.model.Executor.run(Executor.java:232)
> Caused by: java.io.IOException: Failed to mkdirs: /home/jenkins/tools/maven/apache-maven-2.2.1
>         at hudson.FilePath.mkdirs(FilePath.java:1075)
>         at hudson.FilePath.installIfNecessaryFrom(FilePath.java:738)
>         ... 15 more
> Retrying after 10 seconds
> java.io.IOException: Failed to install http://archive.apache.org/dist/maven/binaries/apache-maven-2.2.1-bin.zip
to /home/jenkins/tools/maven/apache-maven-2.2.1
>         at hudson.FilePath.installIfNecessaryFrom(FilePath.java:772)
>         at hudson.tools.DownloadFromUrlInstaller.performInstallation(DownloadFromUrlInstaller.java:70)
>         at hudson.tools.InstallerTranslator.getToolHome(InstallerTranslator.java:68)
>         at hudson.tools.ToolLocationNodeProperty.getToolHome(ToolLocationNodeProperty.java:107)
>         at hudson.tools.ToolInstallation.translateFor(ToolInstallation.java:204)
>         at hudson.tasks.Maven$MavenInstallation.forNode(Maven.java:609)
>         at hudson.maven.MavenModuleSetBuild.getEnvironment(MavenModuleSetBuild.java:182)
>         at hudson.scm.SubversionSCM.checkout(SubversionSCM.java:866)
>         at hudson.model.AbstractProject.checkout(AbstractProject.java:1252)
>         at hudson.model.AbstractBuild$AbstractBuildExecution.defaultCheckout(AbstractBuild.java:615)
>         at jenkins.scm.SCMCheckoutStrategy.checkout(SCMCheckoutStrategy.java:86)
>         at hudson.model.AbstractBuild$AbstractBuildExecution.run(AbstractBuild.java:524)
>         at hudson.model.Run.execute(Run.java:1706)
>         at hudson.maven.MavenModuleSetBuild.run(MavenModuleSetBuild.java:529)
>         at hudson.model.ResourceController.execute(ResourceController.java:88)
>         at hudson.model.Executor.run(Executor.java:232)
> Caused by: java.io.IOException: Failed to mkdirs: /home/jenkins/tools/maven/apache-maven-2.2.1
>         at hudson.FilePath.mkdirs(FilePath.java:1075)
>         at hudson.FilePath.installIfNecessaryFrom(FilePath.java:738)
>         ... 15 more
> Retrying after 10 seconds
> java.io.IOException: Failed to install http://archive.apache.org/dist/maven/binaries/apache-maven-2.2.1-bin.zip
to /home/jenkins/tools/maven/apache-maven-2.2.1
>         at hudson.FilePath.installIfNecessaryFrom(FilePath.java:772)
>         at hudson.tools.DownloadFromUrlInstaller.performInstallation(DownloadFromUrlInstaller.java:70)
>         at hudson.tools.InstallerTranslator.getToolHome(InstallerTranslator.java:68)
>         at hudson.tools.ToolLocationNodeProperty.getToolHome(ToolLocationNodeProperty.java:107)
>         at hudson.tools.ToolInstallation.translateFor(ToolInstallation.java:204)
>         at hudson.tasks.Maven$MavenInstallation.forNode(Maven.java:609)
>         at hudson.maven.MavenModuleSetBuild.getEnvironment(MavenModuleSetBuild.java:182)
>         at hudson.scm.SubversionSCM.checkout(SubversionSCM.java:866)
>         at hudson.model.AbstractProject.checkout(AbstractProject.java:1252)
>         at hudson.model.AbstractBuild$AbstractBuildExecution.defaultCheckout(AbstractBuild.java:615)
>         at jenkins.scm.SCMCheckoutStrategy.checkout(SCMCheckoutStrategy.java:86)
>         at hudson.model.AbstractBuild$AbstractBuildExecution.run(AbstractBuild.java:524)
>         at hudson.model.Run.execute(Run.java:1706)
>         at hudson.maven.MavenModuleSetBuild.run(MavenModuleSetBuild.java:529)
>         at hudson.model.ResourceController.execute(ResourceController.java:88)
>         at hudson.model.Executor.run(Executor.java:232)
> Caused by: java.io.IOException: Failed to mkdirs: /home/jenkins/tools/maven/apache-maven-2.2.1
>         at hudson.FilePath.mkdirs(FilePath.java:1075)
>         at hudson.FilePath.installIfNecessaryFrom(FilePath.java:738)
>         ... 15 more

Mime
View raw message