ode-dev mailing list archives

Site index · List index
Message view « Date » · « Thread »
Top « Date » · « Thread »
From Apache Hudson Server <hud...@hudson.apache.org>
Subject Build failed in Jenkins: ODE-trunk-maven2-jdk5 #178
Date Mon, 04 Apr 2011 10:58:59 GMT
See <https://hudson.apache.org/hudson/job/ODE-trunk-maven2-jdk5/178/changes>

Changes:

[gpb] Minor change to test commit access.

------------------------------------------
[...truncated 6975 lines...]
	at com.thoughtworks.xstream.mapper.MapperWrapper.realClass(MapperWrapper.java:38)
	at com.thoughtworks.xstream.mapper.MapperWrapper.realClass(MapperWrapper.java:38)
	at com.thoughtworks.xstream.mapper.MapperWrapper.realClass(MapperWrapper.java:38)
	at com.thoughtworks.xstream.mapper.ArrayMapper.realClass(ArrayMapper.java:96)
	at com.thoughtworks.xstream.mapper.MapperWrapper.realClass(MapperWrapper.java:38)
	at com.thoughtworks.xstream.mapper.MapperWrapper.realClass(MapperWrapper.java:38)
	at com.thoughtworks.xstream.mapper.MapperWrapper.realClass(MapperWrapper.java:38)
	at com.thoughtworks.xstream.mapper.MapperWrapper.realClass(MapperWrapper.java:38)
	at com.thoughtworks.xstream.mapper.MapperWrapper.realClass(MapperWrapper.java:38)
	at com.thoughtworks.xstream.mapper.MapperWrapper.realClass(MapperWrapper.java:38)
	at com.thoughtworks.xstream.mapper.MapperWrapper.realClass(MapperWrapper.java:38)
	at com.thoughtworks.xstream.mapper.CachingMapper.realClass(CachingMapper.java:52)
	at com.thoughtworks.xstream.core.util.HierarchicalStreams.readClassType(HierarchicalStreams.java:29)
	at com.thoughtworks.xstream.core.TreeUnmarshaller.start(TreeUnmarshaller.java:136)
	at com.thoughtworks.xstream.core.AbstractTreeMarshallingStrategy.unmarshal(AbstractTreeMarshallingStrategy.java:33)
	at com.thoughtworks.xstream.XStream.unmarshal(XStream.java:923)
	at com.thoughtworks.xstream.XStream.unmarshal(XStream.java:909)
	at com.thoughtworks.xstream.XStream.fromXML(XStream.java:853)
	at org.apache.activemq.transport.xstream.XStreamWireFormat.unmarshalText(XStreamWireFormat.java:55)
	at org.apache.activemq.transport.http.HttpTunnelServlet.doPost(HttpTunnelServlet.java:118)
	at javax.servlet.http.HttpServlet.service(HttpServlet.java:713)
	at javax.servlet.http.HttpServlet.service(HttpServlet.java:806)
	at org.eclipse.jetty.servlet.ServletHolder.handle(ServletHolder.java:530)
	at org.eclipse.jetty.servlet.ServletHandler.doHandle(ServletHandler.java:427)
	at org.eclipse.jetty.server.handler.ScopedHandler.handle(ScopedHandler.java:119)
	at org.eclipse.jetty.server.session.SessionHandler.handle(SessionHandler.java:182)
	at org.eclipse.jetty.server.handler.ContextHandler.doHandle(ContextHandler.java:933)
	at org.eclipse.jetty.servlet.ServletHandler.doScope(ServletHandler.java:362)
	at org.eclipse.jetty.server.handler.ContextHandler.doScope(ContextHandler.java:867)
	at org.eclipse.jetty.server.handler.ScopedHandler.handle(ScopedHandler.java:117)
	at org.eclipse.jetty.server.handler.HandlerWrapper.handle(HandlerWrapper.java:113)
	at org.eclipse.jetty.server.Server.handle(Server.java:334)
	at org.eclipse.jetty.server.HttpConnection.handleRequest(HttpConnection.java:559)
	at org.eclipse.jetty.server.HttpConnection$RequestHandler.content(HttpConnection.java:1007)
	at org.eclipse.jetty.http.HttpParser.parseNext(HttpParser.java:747)
	at org.eclipse.jetty.http.HttpParser.parseAvailable(HttpParser.java:209)
	at org.eclipse.jetty.server.HttpConnection.handle(HttpConnection.java:406)
	at org.eclipse.jetty.server.bio.SocketConnector$ConnectorEndPoint.run(SocketConnector.java:252)
	at org.eclipse.jetty.util.thread.QueuedThreadPool$2.run(QueuedThreadPool.java:436)
	at java.lang.Thread.run(Thread.java:595)
</pre>
<hr /><i><small>Powered by Jetty://</small></i><br/> 
                                              
<br/>                                                
<br/>                                                
<br/>                                                
<br/>                                                
<br/>                                                
<br/>                                                
<br/>                                                
<br/>                                                
<br/>                                                
<br/>                                                
<br/>                                                
<br/>                                                
<br/>                                                
<br/>                                                
<br/>                                                
<br/>                                                
<br/>                                                
<br/>                                                
<br/>                                                

</body>
</html>


[SimpleHTTPServer] Stop called
Tests run: 1, Failures: 1, Errors: 0, Skipped: 0, Time elapsed: 19.266 sec <<< FAILURE!

Results :

Failed tests: 
  testTimeouts(org.apache.ode.axis2.EndpointTimeoutsTest)

Tests run: 57, Failures: 50, Errors: 0, Skipped: 0

[ERROR] There are test failures.

Please refer to <https://hudson.apache.org/hudson/job/ODE-trunk-maven2-jdk5/ws/trunk/axis2-war/target/surefire-reports>
for the individual test results.
[JENKINS] Recording test results
[JENKINS] Archiving <https://hudson.apache.org/hudson/job/ODE-trunk-maven2-jdk5/ws/trunk/axis2-war/pom.xml>
to /home/hudson/hudson/jobs/ODE-trunk-maven2-jdk5/modules/org.apache.ode$ode-axis2-war/builds/2011-04-04_09-28-18/archive/org.apache.ode/ode-axis2-war/1.4-SNAPSHOT/pom.xml
[JENKINS] Archiving <https://hudson.apache.org/hudson/job/ODE-trunk-maven2-jdk5/ws/trunk/axis2-war/target/ode-axis2-war-1.4-SNAPSHOT.war>
to /home/hudson/hudson/jobs/ODE-trunk-maven2-jdk5/modules/org.apache.ode$ode-axis2-war/builds/2011-04-04_09-28-18/archive/org.apache.ode/ode-axis2-war/1.4-SNAPSHOT/ode-axis2-war-1.4-SNAPSHOT.war
[INFO] ------------------------------------------------------------------------
[INFO] Building ODE :: BPELUnit Integration Tests
[INFO]    task-segment: [clean, test, integration-test]
[INFO] ------------------------------------------------------------------------
[INFO] snapshot net.bpelunit:maven-bpelunit-plugin:1.5.1-SNAPSHOT: checking for updates from
oss.sonatype.snapshots
[INFO] snapshot net.bpelunit:maven-bpelunit-plugin:1.5.1-SNAPSHOT: checking for updates from
oss.sonatype.releases
[INFO] snapshot net.bpelunit:maven-bpelunit-plugin:1.5.1-SNAPSHOT: checking for updates from
central
[INFO] snapshot net.bpelunit:maven-bpelunit-plugin:1.5.1-SNAPSHOT: checking for updates from
jboss-public-repository-group
[INFO] snapshot net.bpelunit:maven-bpelunit-plugin:1.5.1-SNAPSHOT: checking for updates from
apache.snapshots
Downloading: https://oss.sonatype.org/content/repositories/snapshots//net/bpelunit/maven-bpelunit-plugin/1.5.1-SNAPSHOT/maven-bpelunit-plugin-1.5.1-20110403.222626-8.pom
1K downloaded  (maven-bpelunit-plugin-1.5.1-20110403.222626-8.pom)
[INFO] snapshot net.bpelunit:bpelunit:1.5.1-SNAPSHOT: checking for updates from oss.sonatype.snapshots
[INFO] snapshot net.bpelunit:bpelunit:1.5.1-SNAPSHOT: checking for updates from oss.sonatype.releases
[INFO] snapshot net.bpelunit:bpelunit:1.5.1-SNAPSHOT: checking for updates from central
[INFO] snapshot net.bpelunit:bpelunit:1.5.1-SNAPSHOT: checking for updates from jboss-public-repository-group
[INFO] snapshot net.bpelunit:bpelunit:1.5.1-SNAPSHOT: checking for updates from apache.snapshots
Downloading: https://oss.sonatype.org/content/repositories/snapshots//net/bpelunit/bpelunit/1.5.1-SNAPSHOT/bpelunit-1.5.1-20110403.221945-12.pom
14K downloaded  (bpelunit-1.5.1-20110403.221945-12.pom)
Downloading: https://oss.sonatype.org/content/repositories/snapshots//net/bpelunit/maven-bpelunit-plugin/1.5.1-SNAPSHOT/maven-bpelunit-plugin-1.5.1-20110403.222626-8.jar
14K downloaded  (maven-bpelunit-plugin-1.5.1-20110403.222626-8.jar)
[INFO] [clean:clean {execution: default-clean}]
[INFO] Deleting file set: <https://hudson.apache.org/hudson/job/ODE-trunk-maven2-jdk5/ws/trunk/bpel-itest/target>
(included: [**], excluded: [])
[INFO] [remote-resources:process {execution: default}]
[INFO] [remote-resources:process {execution: default}]
[INFO] [site:attach-descriptor {execution: default-attach-descriptor}]
[INFO] Preparing jetty:run-war
[WARNING] Removing: run-war from forked lifecycle, to prevent recursive invocation.
[JENKINS] Archiving <https://hudson.apache.org/hudson/job/ODE-trunk-maven2-jdk5/ws/trunk/bpel-itest/pom.xml>
to /home/hudson/hudson/jobs/ODE-trunk-maven2-jdk5/modules/org.apache.ode$ode-bpelunit-itests/builds/2011-04-04_09-28-18/archive/org.apache.ode/ode-bpelunit-itests/1.4-SNAPSHOT/pom.xml
[INFO] [remote-resources:process {execution: default}]
[INFO] [site:attach-descriptor {execution: default-attach-descriptor}]
[INFO] [jetty:run-war {execution: start-jetty}]
[INFO] Configuring Jetty for project: ODE :: BPELUnit Integration Tests
[INFO] Context path = /ode
[INFO] Tmp directory = /zonestorage/hudson<https://hudson.apache.org/hudson/job/ODE-trunk-maven2-jdk5/ws/trunk/bpel-itest/target/tmp>
[INFO] Web defaults = org/eclipse/jetty/webapp/webdefault.xml
[INFO] Web overrides =  none
[INFO] Starting jetty 7.1.5.v20100705 ...
2011-04-04 06:58:11.352:INFO::jetty-7.1.5.v20100705
2011-04-04 06:58:11.424:INFO::Extract jar:file:/zonestorage/hudson<https://hudson.apache.org/hudson/job/ODE-trunk-maven2-jdk5/ws/trunk/axis2-war/target/ode-axis2-war-1.4-SNAPSHOT.war!/>
to /zonestorage/hudson<https://hudson.apache.org/hudson/job/ODE-trunk-maven2-jdk5/ws/trunk/bpel-itest/target/tmp/webapp>
2011-04-04 06:58:16.591:INFO::No Transaction manager found - if your webapp requires one,
please configure one.
06:58:19,776 INFO  [ODEServer] Using DAO Connection Factory class org.apache.ode.dao.jpa.BPELDAOConnectionFactoryImpl.
06:58:39,298 INFO  [BpelServerImpl] BPEL Server Started.
06:58:39,304 INFO  [SystemSchedulesConfig] SYSTEM CRON configuration: /zonestorage/hudson<https://hudson.apache.org/hudson/job/ODE-trunk-maven2-jdk5/ws/trunk/bpel-itest/target/tmp/webapp/WEB-INF/conf/schedules.xml>
06:58:40,335 INFO  [DeploymentPoller] Poller started.
06:58:40,335 INFO  [ODEServer] Process deployment polling started on path /zonestorage/hudson<https://hudson.apache.org/hudson/job/ODE-trunk-maven2-jdk5/ws/trunk/bpel-itest/target/tmp/webapp/WEB-INF/processes.>
06:58:40,335 INFO  [ODEServer] ODE Service Engine has been started.
2011-04-04 06:58:40.382:INFO::Started SelectChannelConnector@0.0.0.0:8080
[INFO] Started Jetty Server
[INFO] snapshot net.bpelunit:framework:1.5.1-SNAPSHOT: checking for updates from oss.sonatype.snapshots
[INFO] snapshot net.bpelunit:framework:1.5.1-SNAPSHOT: checking for updates from oss.sonatype.releases
[INFO] snapshot net.bpelunit:framework:1.5.1-SNAPSHOT: checking for updates from sonatype-nexus-snapshots
[INFO] snapshot net.bpelunit:framework:1.5.1-SNAPSHOT: checking for updates from central
[INFO] snapshot net.bpelunit:framework:1.5.1-SNAPSHOT: checking for updates from jboss-public-repository-group
[INFO] snapshot net.bpelunit:framework:1.5.1-SNAPSHOT: checking for updates from apache.snapshots
Downloading: https://oss.sonatype.org/content/repositories/snapshots/net/bpelunit/framework/1.5.1-SNAPSHOT/framework-1.5.1-20110403.222203-8.pom
4K downloaded  (framework-1.5.1-20110403.222203-8.pom)
Downloading: https://oss.sonatype.org/content/repositories/snapshots//de/schlichtherle/truezip/6.8.2/truezip-6.8.2.pom
[INFO] Unable to find resource 'de.schlichtherle:truezip:pom:6.8.2' in repository oss.sonatype.snapshots
(https://oss.sonatype.org/content/repositories/snapshots/)
Downloading: https://oss.sonatype.org/content/repositories/releases//de/schlichtherle/truezip/6.8.2/truezip-6.8.2.pom
4K downloaded  (truezip-6.8.2.pom)
Downloading: https://oss.sonatype.org/content/repositories/snapshots//de/schlichtherle/asl20-oss-parent/6/asl20-oss-parent-6.pom
[INFO] Unable to find resource 'de.schlichtherle:asl20-oss-parent:pom:6' in repository oss.sonatype.snapshots
(https://oss.sonatype.org/content/repositories/snapshots/)
Downloading: https://oss.sonatype.org/content/repositories/releases//de/schlichtherle/asl20-oss-parent/6/asl20-oss-parent-6.pom
8K downloaded  (asl20-oss-parent-6.pom)
[INFO] snapshot uk.com.robust-it:cloning:1.7.5-SNAPSHOT: checking for updates from oss.sonatype.snapshots
[INFO] snapshot uk.com.robust-it:cloning:1.7.5-SNAPSHOT: checking for updates from oss.sonatype.releases
[INFO] snapshot uk.com.robust-it:cloning:1.7.5-SNAPSHOT: checking for updates from sonatype-nexus-snapshots
[INFO] snapshot uk.com.robust-it:cloning:1.7.5-SNAPSHOT: checking for updates from central
[INFO] snapshot uk.com.robust-it:cloning:1.7.5-SNAPSHOT: checking for updates from jboss-public-repository-group
[INFO] snapshot uk.com.robust-it:cloning:1.7.5-SNAPSHOT: checking for updates from apache.snapshots
Downloading: https://oss.sonatype.org/content/repositories/snapshots//de/schlichtherle/truezip/6.8.2/truezip-6.8.2.jar
Downloading: https://oss.sonatype.org/content/repositories/snapshots/net/bpelunit/framework/1.5.1-SNAPSHOT/framework-1.5.1-20110403.222203-8.jar
[INFO] Unable to find resource 'de.schlichtherle:truezip:jar:6.8.2' in repository oss.sonatype.snapshots
(https://oss.sonatype.org/content/repositories/snapshots/)
Downloading: https://oss.sonatype.org/content/repositories/releases//de/schlichtherle/truezip/6.8.2/truezip-6.8.2.jar
468K downloaded  (truezip-6.8.2.jar)
583K downloaded  (framework-1.5.1-20110403.222203-8.jar)
-----------------------------------------------------
this realm = app0.child-container[net.bpelunit:maven-bpelunit-plugin:1.5.1-SNAPSHOT]
urls[0] = file:/export/home/hudson/.m2/repository/net/bpelunit/maven-bpelunit-plugin/1.5.1-SNAPSHOT/maven-bpelunit-plugin-1.5.1-SNAPSHOT.jar
urls[1] = file:/export/home/hudson/.m2/repository/org/codehaus/plexus/plexus-utils/1.1/plexus-utils-1.1.jar
urls[2] = file:/export/home/hudson/.m2/repository/net/bpelunit/framework/1.5.1-SNAPSHOT/framework-1.5.1-SNAPSHOT.jar
urls[3] = file:/export/home/hudson/.m2/repository/commons-codec/commons-codec/1.3/commons-codec-1.3.jar
urls[4] = file:/export/home/hudson/.m2/repository/commons-lang/commons-lang/2.4/commons-lang-2.4.jar
urls[5] = file:/export/home/hudson/.m2/repository/commons-logging/commons-logging/1.1.1/commons-logging-1.1.1.jar
urls[6] = file:/export/home/hudson/.m2/repository/de/schlichtherle/truezip/6.8.2/truezip-6.8.2.jar
urls[7] = file:/export/home/hudson/.m2/repository/org/apache/commons/commons-io/1.3.2/commons-io-1.3.2.jar
urls[8] = file:/export/home/hudson/.m2/repository/org/apache/xmlbeans/xmlbeans/2.3.0/xmlbeans-2.3.0.jar
urls[9] = file:/export/home/hudson/.m2/repository/stax/stax-api/1.0.1/stax-api-1.0.1.jar
urls[10] = file:/export/home/hudson/.m2/repository/org/jdom/jdom/1.1/jdom-1.1.jar
urls[11] = file:/export/home/hudson/.m2/repository/wsdl4j/wsdl4j/1.6.2/wsdl4j-1.6.2.jar
urls[12] = file:/export/home/hudson/.m2/repository/log4j/log4j/1.2.15/log4j-1.2.15.jar
urls[13] = file:/export/home/hudson/.m2/repository/jetty/jetty/5.1.10/jetty-5.1.10.jar
urls[14] = file:/export/home/hudson/.m2/repository/javax/servlet/servlet-api/2.4/servlet-api-2.4.jar
urls[15] = file:/export/home/hudson/.m2/repository/com/sun/xml/messaging/saaj/saaj-impl/1.3/saaj-impl-1.3.jar
urls[16] = file:/export/home/hudson/.m2/repository/javax/xml/soap/saaj-api/1.3/saaj-api-1.3.jar
urls[17] = file:/export/home/hudson/.m2/repository/javax/activation/activation/1.1.1/activation-1.1.1.jar
urls[18] = file:/export/home/hudson/.m2/repository/commons-httpclient/commons-httpclient/3.1/commons-httpclient-3.1.jar
urls[19] = file:/export/home/hudson/.m2/repository/org/apache/velocity/velocity/1.6.4/velocity-1.6.4.jar
urls[20] = file:/export/home/hudson/.m2/repository/commons-collections/commons-collections/3.2.1/commons-collections-3.2.1.jar
urls[21] = file:/export/home/hudson/.m2/repository/oro/oro/2.0.8/oro-2.0.8.jar
urls[22] = file:/export/home/hudson/.m2/repository/uk/com/robust-it/cloning/1.7.5-SNAPSHOT/cloning-1.7.5-SNAPSHOT.jar
urls[23] = file:/export/home/hudson/.m2/repository/org/objenesis/objenesis/1.2/objenesis-1.2.jar
Number of imports: 10
import: org.codehaus.classworlds.Entry@a6c57a42
import: org.codehaus.classworlds.Entry@12f43f3b
import: org.codehaus.classworlds.Entry@20025374
import: org.codehaus.classworlds.Entry@f8e44ca4
import: org.codehaus.classworlds.Entry@92758522
import: org.codehaus.classworlds.Entry@ebf2705b
import: org.codehaus.classworlds.Entry@bb25e54
import: org.codehaus.classworlds.Entry@bece5185
import: org.codehaus.classworlds.Entry@3fee8e37
import: org.codehaus.classworlds.Entry@3fee19d8


this realm = plexus.core.maven
Number of imports: 10
import: org.codehaus.classworlds.Entry@a6c57a42
import: org.codehaus.classworlds.Entry@12f43f3b
import: org.codehaus.classworlds.Entry@20025374
import: org.codehaus.classworlds.Entry@f8e44ca4
import: org.codehaus.classworlds.Entry@92758522
import: org.codehaus.classworlds.Entry@ebf2705b
import: org.codehaus.classworlds.Entry@bb25e54
import: org.codehaus.classworlds.Entry@bece5185
import: org.codehaus.classworlds.Entry@3fee8e37
import: org.codehaus.classworlds.Entry@3fee19d8


this realm = plexus.core
urls[0] = file:/home/hudson/hudson-slave/maven2.1-interceptor.jar
urls[1] = file:/home/hudson/hudson-slave/maven-interceptor.jar
urls[2] = file:/zonestorage/hudson/home/hudson/tools/maven/apache-maven-2.2.1/lib/maven-2.2.1-uber.jar
Number of imports: 10
import: org.codehaus.classworlds.Entry@a6c57a42
import: org.codehaus.classworlds.Entry@12f43f3b
import: org.codehaus.classworlds.Entry@20025374
import: org.codehaus.classworlds.Entry@f8e44ca4
import: org.codehaus.classworlds.Entry@92758522
import: org.codehaus.classworlds.Entry@ebf2705b
import: org.codehaus.classworlds.Entry@bb25e54
import: org.codehaus.classworlds.Entry@bece5185
import: org.codehaus.classworlds.Entry@3fee8e37
import: org.codehaus.classworlds.Entry@3fee19d8
-----------------------------------------------------
[INFO] ------------------------------------------------------------------------
[ERROR] BUILD ERROR
[INFO] ------------------------------------------------------------------------
[INFO] Internal error in the plugin manager executing goal 'net.bpelunit:maven-bpelunit-plugin:1.5.1-SNAPSHOT:test':
Unable to find the mojo 'test' (or one of its required components) in the plugin 'net.bpelunit:maven-bpelunit-plugin'
Bad version number in .class file
[INFO] ------------------------------------------------------------------------
[INFO] For more information, run Maven with the -e switch
[INFO] ------------------------------------------------------------------------
[INFO] Total time: 90 minutes 26 seconds
[INFO] Finished at: Mon Apr 04 06:58:54 EDT 2011
[INFO] Final Memory: 121M/452M
[INFO] ------------------------------------------------------------------------
Sending e-mails to: dev@ode.apache.org
Sending e-mails to: dev@ode.apache.org
Sending e-mails to: dev@ode.apache.org
Sending e-mails to: dev@ode.apache.org
channel stopped
06:58:55,562 INFO  [DeploymentPoller] Poller stopped.
06:58:55,562 INFO  [BpelServerImpl] BPEL Server Stopped.
06:58:55,742 INFO  [ODEServer] Shutdown completed. 
[locks-and-latches] Releasing all the locks
[locks-and-latches] All the locks released


Mime
View raw message