openjpa-commits mailing list archives

Site index · List index
Message view « Date » · « Thread »
Top « Date » · « Thread »
From Apache Jenkins Server <jenk...@builds.apache.org>
Subject Build failed in Jenkins: OpenJPA-trunk #11
Date Wed, 14 Mar 2018 16:37:04 GMT
See <https://builds.apache.org/job/OpenJPA-trunk/11/display/redirect?page=changes>

Changes:

[ilgrosso] OPENJPA-2730 Update to ASM 6 - This closes #11

------------------------------------------
[...truncated 603.73 KB...]
AU        openjpa-persistence-jdbc/src/main/java/org/apache/openjpa/persistence/jdbc/JoinSyntax.java
AU        openjpa-persistence-jdbc/src/main/java/org/apache/openjpa/persistence/jdbc/VersionStrategy.java
AU        openjpa-persistence-jdbc/src/main/java/org/apache/openjpa/persistence/jdbc/XSecondaryTables.java
AU        openjpa-persistence-jdbc/src/main/java/org/apache/openjpa/persistence/jdbc/ElementForeignKey.java
AU        openjpa-persistence-jdbc/src/main/java/org/apache/openjpa/persistence/jdbc/KeyIndex.java
AU        openjpa-persistence-jdbc/src/main/java/org/apache/openjpa/persistence/jdbc/DataStoreIdColumn.java
AU        openjpa-persistence-jdbc/src/main/java/org/apache/openjpa/persistence/jdbc/KeyJoinColumn.java
AU        openjpa-persistence-jdbc/src/main/java/org/apache/openjpa/persistence/jdbc/MappingTag.java
AU        openjpa-persistence-jdbc/src/main/java/org/apache/openjpa/persistence/jdbc/XSecondaryTable.java
AU        openjpa-persistence-jdbc/src/main/java/org/apache/openjpa/persistence/jdbc/PersistenceMappingDefaults.java
AU        openjpa-persistence-jdbc/src/main/java/org/apache/openjpa/persistence/jdbc/OrderColumn.java
AU        openjpa-persistence-jdbc/src/main/java/org/apache/openjpa/persistence/jdbc/ElementColumns.java
AU        openjpa-persistence-jdbc/src/main/java/org/apache/openjpa/persistence/jdbc/DiscriminatorStrategy.java
AU        openjpa-persistence-jdbc/src/main/java/org/apache/openjpa/persistence/jdbc/Strategy.java
AU        openjpa-persistence-jdbc/src/main/java/org/apache/openjpa/persistence/jdbc/ElementColumn.java
AU        openjpa-persistence-jdbc/src/main/java/org/apache/openjpa/persistence/jdbc/AnnotationPersistenceMappingParser.java
AU        openjpa-persistence-jdbc/src/main/java/org/apache/openjpa/persistence/jdbc/KeyStrategy.java
AU        openjpa-persistence-jdbc/src/main/java/org/apache/openjpa/persistence/jdbc/ElementStrategy.java
AU        openjpa-persistence-jdbc/src/main/java/org/apache/openjpa/persistence/jdbc/Nonpolymorphic.java
AU        openjpa-persistence-jdbc/src/main/java/org/apache/openjpa/persistence/jdbc/ElementIndex.java
AU        openjpa-persistence-jdbc/src/main/java/org/apache/openjpa/persistence/jdbc/ClassCriteria.java
AU        openjpa-persistence-jdbc/src/main/java/org/apache/openjpa/persistence/jdbc/PersistenceMappingFactory.java
AU        openjpa-persistence-jdbc/src/main/java/org/apache/openjpa/persistence/jdbc/KeyColumns.java
AU        openjpa-persistence-jdbc/src/main/java/org/apache/openjpa/persistence/jdbc/ElementNonpolymorphic.java
AU        openjpa-persistence-jdbc/src/main/java/org/apache/openjpa/persistence/jdbc/FetchDirection.java
AU        openjpa-persistence-jdbc/src/main/java/org/apache/openjpa/persistence/jdbc/FetchMode.java
AU        openjpa-persistence-jdbc/src/main/java/org/apache/openjpa/persistence/jdbc/SubclassFetchMode.java
AU        openjpa-persistence-jdbc/src/main/java/org/apache/openjpa/persistence/jdbc/XMLPersistenceMappingParser.java
AU        openjpa-persistence-jdbc/src/main/java/org/apache/openjpa/persistence/jdbc/XJoinColumn.java
AU        openjpa-persistence-jdbc/src/main/java/org/apache/openjpa/persistence/jdbc/JDBCFetchPlanImpl.java
AU        openjpa-persistence-jdbc/src/main/java/org/apache/openjpa/persistence/jdbc/ElementJoinColumns.java
AU        openjpa-persistence-jdbc/src/main/java/org/apache/openjpa/persistence/jdbc/KeyForeignKey.java
AU        openjpa-persistence-jdbc/src/main/java/org/apache/openjpa/persistence/jdbc/XTable.java
AU        openjpa-persistence-jdbc/src/main/java/org/apache/openjpa/persistence/jdbc/ElementEmbeddedMapping.java
AU        openjpa-persistence-jdbc/src/main/java/org/apache/openjpa/persistence/jdbc/Columns.java
AU        openjpa-persistence-jdbc/src/main/java/org/apache/openjpa/persistence/jdbc/NonpolymorphicType.java
AU        openjpa-persistence-jdbc/src/main/java/org/apache/openjpa/persistence/jdbc/AnnotationPersistenceMappingSerializer.java
AU        openjpa-persistence-jdbc/src/main/java/org/apache/openjpa/persistence/jdbc/JDBCFetchPlan.java
AU        openjpa-persistence-jdbc/src/main/java/org/apache/openjpa/persistence/jdbc/ElementJoinColumn.java
AU        openjpa-persistence-jdbc/src/main/java/org/apache/openjpa/persistence/jdbc/IsolationLevel.java
AU        openjpa-persistence-jdbc/src/main/java/org/apache/openjpa/persistence/jdbc/ResultSetType.java
AU        openjpa-persistence-jdbc/src/main/java/org/apache/openjpa/persistence/jdbc/ForeignKeyAction.java
AU        openjpa-persistence-jdbc/src/main/java/org/apache/openjpa/persistence/jdbc/KeyClassCriteria.java
AU        openjpa-persistence-jdbc/src/main/java/org/apache/openjpa/persistence/jdbc/LRSSizeAlgorithm.java
AU        openjpa-persistence-jdbc/src/main/java/org/apache/openjpa/persistence/jdbc/KeyColumn.java
AU        openjpa-persistence-jdbc/src/main/java/org/apache/openjpa/persistence/jdbc/XMappingOverrides.java
AU        openjpa-persistence-jdbc/src/main/java/org/apache/openjpa/persistence/jdbc/Unique.java
AU        openjpa-persistence-jdbc/src/main/java/org/apache/openjpa/persistence/jdbc/Index.java
AU        openjpa-persistence-jdbc/src/main/java/org/apache/openjpa/persistence/jdbc/KeyJoinColumns.java
AU        openjpa-persistence-jdbc/src/main/java/org/apache/openjpa/persistence/jdbc/XMLPersistenceMappingSerializer.java
A         openjpa-persistence-jdbc/src/main/java/org/apache/openjpa/persistence/jdbc/package.html
AU        openjpa-persistence-jdbc/src/main/java/org/apache/openjpa/persistence/jdbc/MappingOverrides.java
AU        openjpa-persistence-jdbc/src/main/java/org/apache/openjpa/persistence/jdbc/KeyEmbeddedMapping.java
AU        openjpa-persistence-jdbc/src/main/java/org/apache/openjpa/persistence/jdbc/XMappingOverride.java
AU        openjpa-persistence-jdbc/src/main/java/org/apache/openjpa/persistence/jdbc/VersionColumns.java
AU        openjpa-persistence-jdbc/src/main/java/org/apache/openjpa/persistence/jdbc/XJoinColumns.java
AU        openjpa-persistence-jdbc/src/main/java/org/apache/openjpa/persistence/jdbc/KeyNonpolymorphic.java
AU        openjpa-persistence-jdbc/src/main/java/org/apache/openjpa/persistence/jdbc/ContainerTable.java
AU        openjpa-persistence-jdbc/src/main/java/org/apache/openjpa/persistence/jdbc/MappingOverride.java
AU        openjpa-persistence-jdbc/src/main/java/org/apache/openjpa/persistence/jdbc/JDBCPersistenceProductDerivation.java
AU        openjpa-persistence-jdbc/src/main/java/org/apache/openjpa/persistence/jdbc/XEmbeddedMapping.java
A         openjpa-persistence-jdbc/src/main/ant
AU        openjpa-persistence-jdbc/src/main/ant/enhancer.xml
A         openjpa-persistence-jdbc/src/main/appended-resources
A         openjpa-persistence-jdbc/src/main/appended-resources/META-INF
AU        openjpa-persistence-jdbc/src/main/appended-resources/META-INF/NOTICE.vm
A         openjpa-persistence-jdbc/src/main/resources
A         openjpa-persistence-jdbc/src/main/resources/META-INF
A         openjpa-persistence-jdbc/src/main/resources/META-INF/services
A         openjpa-persistence-jdbc/src/main/resources/META-INF/services/org.apache.openjpa.lib.conf.ProductDerivation
A         openjpa-persistence-jdbc/src/main/resources/org
A         openjpa-persistence-jdbc/src/main/resources/org/apache
A         openjpa-persistence-jdbc/src/main/resources/org/apache/openjpa
A         openjpa-persistence-jdbc/src/main/resources/org/apache/openjpa/persistence
A         openjpa-persistence-jdbc/src/main/resources/org/apache/openjpa/persistence/jdbc
AU        openjpa-persistence-jdbc/src/main/resources/org/apache/openjpa/persistence/jdbc/localizer.properties
 U        .
At revision 1826731

Setting ANT_1_9_7_HOME=/home/jenkins/tools/ant/apache-ant-1.9.7
Setting MAVEN_3_0_4_HOME=/home/jenkins/tools/maven/apache-maven-3.0.4
Setting JDK_1_8_LATEST__HOME=/home/jenkins/tools/java/latest1.8
[OpenJPA-trunk] $ /bin/bash -xe /tmp/jenkins4500413004995822711.sh
+ export ANT_HOME=/home/jenkins/tools/ant/apache-ant-1.9.7
+ ANT_HOME=/home/jenkins/tools/ant/apache-ant-1.9.7
+ export JAVA_HOME=/home/jenkins/tools/java/latest1.8
+ JAVA_HOME=/home/jenkins/tools/java/latest1.8
+ export M2_HOME=/home/jenkins/tools/maven/apache-maven-3.0.4
+ M2_HOME=/home/jenkins/tools/maven/apache-maven-3.0.4
+ export PATH=/home/jenkins/tools/ant/apache-ant-1.9.7/bin:/home/jenkins/tools/java/latest1.8/bin:/home/jenkins/tools/maven/apache-maven-3.0.4/bin:/home/jenkins/tools/java/latest1.8/bin:/usr/local/sbin:/usr/local/bin:/usr/sbin:/usr/bin:/sbin:/bin:/usr/games:/usr/local/games
+ PATH=/home/jenkins/tools/ant/apache-ant-1.9.7/bin:/home/jenkins/tools/java/latest1.8/bin:/home/jenkins/tools/maven/apache-maven-3.0.4/bin:/home/jenkins/tools/java/latest1.8/bin:/usr/local/sbin:/usr/local/bin:/usr/sbin:/usr/bin:/sbin:/bin:/usr/games:/usr/local/games
+ mvn clean install
[INFO] Scanning for projects...
Downloading: http://repo.maven.apache.org/maven2/org/apache/felix/maven-bundle-plugin/2.2.0/maven-bundle-plugin-2.2.0.pom
4/5 KB   5/5 KB            Downloaded: http://repo.maven.apache.org/maven2/org/apache/felix/maven-bundle-plugin/2.2.0/maven-bundle-plugin-2.2.0.pom
(5 KB at 28.5 KB/sec)
Downloading: http://repo.maven.apache.org/maven2/biz/aQute/bndlib/1.15.0/bndlib-1.15.0.pom
2/2 KB            Downloaded: http://repo.maven.apache.org/maven2/biz/aQute/bndlib/1.15.0/bndlib-1.15.0.pom
(2 KB at 90.8 KB/sec)
Downloading: http://repo.maven.apache.org/maven2/org/apache/felix/maven-bundle-plugin/2.2.0/maven-bundle-plugin-2.2.0.jar
Downloading: http://repo.maven.apache.org/maven2/biz/aQute/bndlib/1.15.0/bndlib-1.15.0.jar
1/114 KB   5/114 KB   8/114 KB   10/114 KB   11/114 KB   13/114 KB   14/114 KB   15/114 KB
  17/114 KB   18/114 KB   20/114 KB   21/114 KB   1/536 KB   21/114 KB   1/536 KB   23/114
KB   5/536 KB   23/114 KB   5/536 KB   24/114 KB   5/536 KB   25/114 KB   9/536 KB   25/114
KB   13/536 KB   25/114 KB   14/536 KB   25/114 KB   14/536 KB   27/114 KB   14/536 KB   30/114
KB   14/536 KB   31/114 KB   14/536 KB   34/114 KB   15/536 KB   34/114 KB   17/536 KB   34/114
KB   21/536 KB   34/114 KB   25/536 KB   34/114 KB   27/536 KB   34/114 KB   27/536 KB   35/114
KB   28/536 KB   35/114 KB   28/536 KB   38/114 KB   30/536 KB   38/114 KB   34/536 KB   38/114
KB   38/536 KB   38/114 KB   39/536 KB   38/114 KB   39/536 KB   39/114 KB   39/536 KB   41/114
KB   41/536 KB   41/114 KB   42/536 KB   41/114 KB   42/536 KB   42/114 KB   42/536 KB   44/114
KB   42/536 KB   45/114 KB   42/536 KB   47/114 KB   42/536 KB   48/114 KB   42/536 KB   51/114
KB   44/536 KB   51/114 KB   45/536 KB   51/114 KB   47/536 KB   51/114 KB   51/536 KB   52/114
KB   51/536 KB   52/114 KB   55/536 KB   55/114 KB   55/536 KB   55/114 KB   56/536 KB   55/114
KB   58/536 KB   55/114 KB   62/536 KB   55/114 KB   66/536 KB   55/114 KB   70/536 KB   55/114
KB   72/536 KB   55/114 KB   72/536 KB   56/114 KB   76/536 KB   56/114 KB   80/536 KB   56/114
KB   80/536 KB   59/114 KB   84/536 KB   59/114 KB   88/536 KB   59/114 KB   89/536 KB   59/114
KB   93/536 KB   59/114 KB   93/536 KB   61/114 KB   93/536 KB   61/114 KB   97/536 KB   61/114
KB   97/536 KB   64/114 KB   97/536 KB   64/114 KB   97/536 KB   65/114 KB   97/536 KB   68/114
KB   99/536 KB   68/114 KB   99/536 KB   69/114 KB   99/536 KB   72/114 KB   99/536 KB   73/114
KB   100/536 KB   73/114 KB   104/536 KB   73/114 KB   104/536 KB   75/114 KB   108/536 KB
  75/114 KB   108/536 KB   78/114 KB   112/536 KB   78/114 KB   116/536 KB   78/114 KB   120/536
KB   78/114 KB   124/536 KB   79/114 KB   124/536 KB   79/114 KB   128/536 KB   79/114 KB
  128/536 KB   82/114 KB   132/536 KB   82/114 KB   136/536 KB   82/114 KB   136/536 KB  
83/114 KB   136/536 KB   86/114 KB   140/536 KB   86/114 KB   143/536 KB   86/114 KB   147/536
KB   86/114 KB   147/536 KB   88/114 KB   147/536 KB   88/114 KB   147/536 KB   90/114 KB
  148/536 KB   90/114 KB   152/536 KB   90/114 KB   156/536 KB   90/114 KB   156/536 KB  
92/114 KB   157/536 KB   92/114 KB   157/536 KB   96/114 KB   157/536 KB   96/114 KB   158/536
KB   96/114 KB   162/536 KB   97/114 KB   162/536 KB   97/114 KB   162/536 KB   101/114 KB
  166/536 KB   101/114 KB   166/536 KB   102/114 KB   170/536 KB   102/114 KB   174/536 KB
  102/114 KB   174/536 KB   103/114 KB   178/536 KB   103/114 KB   178/536 KB   107/114 KB
  182/536 KB   107/114 KB   182/536 KB   107/114 KB   186/536 KB   107/114 KB   190/536 KB
  107/114 KB   194/536 KB   107/114 KB   194/536 KB   109/114 KB   198/536 KB   109/114 KB
  198/536 KB   110/114 KB   202/536 KB   110/114 KB   206/536 KB   110/114 KB   206/536 KB
  110/114 KB   206/536 KB   112/114 KB   206/536 KB   114/114 KB   208/536 KB   114/114 KB
  211/536 KB   114/114 KB   212/536 KB   114/114 KB   216/536 KB   114/114 KB   220/536 KB
  114/114 KB   224/536 KB   114/114 KB   228/536 KB   114/114 KB   232/536 KB   114/114 KB
  236/536 KB   114/114 KB   240/536 KB   114/114 KB   242/536 KB   114/114 KB   243/536 KB
  114/114 KB   247/536 KB   114/114 KB   251/536 KB   114/114 KB   255/536 KB   114/114 KB
  257/536 KB   114/114 KB   259/536 KB   114/114 KB   263/536 KB   114/114 KB   267/536 KB
  114/114 KB   269/536 KB   114/114 KB   270/536 KB   114/114 KB   274/536 KB   114/114 KB
  274/536 KB   114/114 KB   276/536 KB   114/114 KB   280/536 KB   114/114 KB   284/536 KB
  114/114 KB   288/536 KB   114/114 KB   292/536 KB   114/114 KB   296/536 KB   114/114 KB
  300/536 KB   114/114 KB   304/536 KB   114/114 KB   307/536 KB   114/114 KB   308/536 KB
  114/114 KB   312/536 KB   114/114 KB   316/536 KB   114/114 KB   320/536 KB   114/114 KB
  324/536 KB   114/114 KB   328/536 KB   114/114 KB   332/536 KB   114/114 KB   336/536 KB
  114/114 KB                             338/536 KB                Downloaded: http://repo.maven.apache.org/maven2/org/apache/felix/maven-bundle-plugin/2.2.0/maven-bundle-plugin-2.2.0.jar
(114 KB at 2414.5 KB/sec)
339/536 KB   343/536 KB   347/536 KB   351/536 KB   355/536 KB   359/536 KB   363/536 KB 
 367/536 KB   371/536 KB   372/536 KB   373/536 KB   377/536 KB   381/536 KB   385/536 KB
  389/536 KB   393/536 KB   397/536 KB   401/536 KB   401/536 KB   403/536 KB   407/536 KB
  411/536 KB   415/536 KB   419/536 KB   423/536 KB   427/536 KB   431/536 KB   435/536 KB
  438/536 KB   440/536 KB   444/536 KB   448/536 KB   452/536 KB   456/536 KB   460/536 KB
  464/536 KB   465/536 KB   467/536 KB   471/536 KB   475/536 KB   479/536 KB   483/536 KB
  487/536 KB   491/536 KB   495/536 KB   499/536 KB   503/536 KB   507/536 KB   511/536 KB
  515/536 KB   519/536 KB   523/536 KB   527/536 KB   529/536 KB   530/536 KB   534/536 KB
  536/536 KB                Downloaded: http://repo.maven.apache.org/maven2/biz/aQute/bndlib/1.15.0/bndlib-1.15.0.jar
(536 KB at 7759.0 KB/sec)
[WARNING] 
[WARNING] Some problems were encountered while building the effective model for org.apache.openjpa:openjpa-features:pom:3.0.0-SNAPSHOT
[WARNING] 'build.plugins.plugin.version' for org.apache.karaf.tooling:karaf-maven-plugin is
missing. @ line 31, column 12
[WARNING] 'build.plugins.plugin.version' for org.codehaus.mojo:build-helper-maven-plugin is
missing. @ line 49, column 12
[WARNING] 
[WARNING] It is highly recommended to fix these problems because they threaten the stability
of your build.
[WARNING] 
[WARNING] For this reason, future Maven versions might no longer support building such malformed
projects.
[WARNING] 
[INFO] ------------------------------------------------------------------------
[INFO] Reactor Build Order:
[INFO] 
[INFO] OpenJPA Parent POM
[INFO] OpenJPA Utilities Library
[INFO] OpenJPA Kernel
[INFO] OpenJPA JDBC
[INFO] OpenJPA Persistence
[INFO] OpenJPA Persistence JDBC
[INFO] OpenJPA Persistence Locking Tests
[INFO] OpenJPA tools
[INFO] OpenJPA Maven Plugin
[INFO] OpenJPA XML Store
[INFO] OpenJPA Slice
[INFO] OpenJPA JEST
[INFO] OpenJPA Aggregate Jar
[INFO] OpenJPA Aggregate Jar with Dependencies
[INFO] OpenJPA Project Docs and Assemblies
[INFO] OpenJPA Examples
[INFO] OpenJPA Examples - Simple
[INFO] OpenJPA Examples - image-gallery
[INFO] OpenJPA Examples - OpenBooks
[INFO] OpenJPA Integration Tests
[INFO] OpenJPA Integration Tests - Daytrader
[INFO] OpenJPA Integration Tests - Examples
[INFO] OpenJPA Integration Tests - SLF4JLogFactory
[INFO] OpenJPA Integration Tests - JPA TCK
[INFO] OpenJPA Integration Tests - Bean Validation
[INFO] OpenJPA Integration Tests - JMX Platform MBeans
[INFO] OpenJPA Fetching Statistic Tool
[INFO] OpenJPA Fetching Statistic Tool -- WAS Bundle
[INFO] OpenJPA Features
[INFO]                                                                         
[INFO] ------------------------------------------------------------------------
[INFO] Building OpenJPA Parent POM 3.0.0-SNAPSHOT
[INFO] ------------------------------------------------------------------------
Downloading: http://repo.maven.apache.org/maven2/org/codehaus/mojo/buildnumber-maven-plugin/1.4/buildnumber-maven-plugin-1.4.pom
4/14 KB      8/14 KB   12/14 KB   14/14 KB              Downloaded: http://repo.maven.apache.org/maven2/org/codehaus/mojo/buildnumber-maven-plugin/1.4/buildnumber-maven-plugin-1.4.pom
(14 KB at 641.5 KB/sec)
Downloading: http://repo.maven.apache.org/maven2/org/codehaus/mojo/buildnumber-maven-plugin/1.4/buildnumber-maven-plugin-1.4.jar
4/40 KB    6/40 KB   10/40 KB   14/40 KB   18/40 KB   22/40 KB   26/40 KB   30/40 KB   34/40
KB   38/40 KB   40/40 KB              Downloaded: http://repo.maven.apache.org/maven2/org/codehaus/mojo/buildnumber-maven-plugin/1.4/buildnumber-maven-plugin-1.4.jar
(40 KB at 1712.5 KB/sec)
Downloading: http://repo.maven.apache.org/maven2/org/apache/maven/plugins/maven-checkstyle-plugin/2.9/maven-checkstyle-plugin-2.9.pom
4/10 KB    7/10 KB   10/10 KB              Downloaded: http://repo.maven.apache.org/maven2/org/apache/maven/plugins/maven-checkstyle-plugin/2.9/maven-checkstyle-plugin-2.9.pom
(10 KB at 102.0 KB/sec)
Downloading: http://repo.maven.apache.org/maven2/org/apache/maven/plugins/maven-checkstyle-plugin/2.9/maven-checkstyle-plugin-2.9.jar
4/85 KB    7/85 KB   11/85 KB   15/85 KB   19/85 KB   23/85 KB   27/85 KB   31/85 KB   35/85
KB   35/85 KB   37/85 KB   41/85 KB   42/85 KB   44/85 KB   48/85 KB   49/85 KB   51/85 KB
  55/85 KB   56/85 KB   58/85 KB   62/85 KB   64/85 KB   65/85 KB   69/85 KB   72/85 KB  
73/85 KB   77/85 KB   80/85 KB   82/85 KB   85/85 KB              Downloaded: http://repo.maven.apache.org/maven2/org/apache/maven/plugins/maven-checkstyle-plugin/2.9/maven-checkstyle-plugin-2.9.jar
(85 KB at 484.8 KB/sec)
[INFO] 
[INFO] --- maven-clean-plugin:3.0.0:clean (default-clean) @ openjpa-parent ---
[INFO] 
[INFO] --- buildnumber-maven-plugin:1.4:create (default) @ openjpa-parent ---
Downloading: http://repo.maven.apache.org/maven2/org/apache/maven/scm/maven-scm-manager-plexus/1.9.4/maven-scm-manager-plexus-1.9.4.pom
3/3 KB              Downloaded: http://repo.maven.apache.org/maven2/org/apache/maven/scm/maven-scm-manager-plexus/1.9.4/maven-scm-manager-plexus-1.9.4.pom
(3 KB at 106.4 KB/sec)
Downloading: http://repo.maven.apache.org/maven2/org/apache/maven/scm/maven-scm-managers/1.9.4/maven-scm-managers-1.9.4.pom
2/2 KB            Downloaded: http://repo.maven.apache.org/maven2/org/apache/maven/scm/maven-scm-managers/1.9.4/maven-scm-managers-1.9.4.pom
(2 KB at 91.0 KB/sec)
Downloading: http://repo.maven.apache.org/maven2/com/google/code/maven-scm-provider-svnjava/maven-scm-provider-svnjava/2.1.1/maven-scm-provider-svnjava-2.1.1.pom
4/10 KB   8/10 KB   10/10 KB              Downloaded: http://repo.maven.apache.org/maven2/com/google/code/maven-scm-provider-svnjava/maven-scm-provider-svnjava/2.1.1/maven-scm-provider-svnjava-2.1.1.pom
(10 KB at 502.6 KB/sec)
Downloading: http://repo.maven.apache.org/maven2/org/apache/maven/scm/maven-scm-provider-svn-commons/1.8/maven-scm-provider-svn-commons-1.8.pom
3/3 KB              Downloaded: http://repo.maven.apache.org/maven2/org/apache/maven/scm/maven-scm-provider-svn-commons/1.8/maven-scm-provider-svn-commons-1.8.pom
(3 KB at 155.1 KB/sec)
Downloading: http://repo.maven.apache.org/maven2/org/apache/maven/scm/maven-scm-providers-svn/1.8/maven-scm-providers-svn-1.8.pom
3/3 KB            Downloaded: http://repo.maven.apache.org/maven2/org/apache/maven/scm/maven-scm-providers-svn/1.8/maven-scm-providers-svn-1.8.pom
(3 KB at 76.8 KB/sec)
Downloading: http://repo.maven.apache.org/maven2/org/apache/maven/scm/maven-scm-providers/1.8/maven-scm-providers-1.8.pom
4/4 KB            Downloaded: http://repo.maven.apache.org/maven2/org/apache/maven/scm/maven-scm-providers/1.8/maven-scm-providers-1.8.pom
(4 KB at 158.7 KB/sec)
Downloading: http://repo.maven.apache.org/maven2/net/java/dev/jna/jna/3.5.2/jna-3.5.2.pom
2/2 KB            Downloaded: http://repo.maven.apache.org/maven2/net/java/dev/jna/jna/3.5.2/jna-3.5.2.pom
(2 KB at 43.2 KB/sec)
Downloading: http://repo.maven.apache.org/maven2/org/codehaus/plexus/plexus-utils/3.0.14/plexus-utils-3.0.14.pom
4/4 KB            Downloaded: http://repo.maven.apache.org/maven2/org/codehaus/plexus/plexus-utils/3.0.14/plexus-utils-3.0.14.pom
(4 KB at 153.6 KB/sec)
Downloading: http://repo.maven.apache.org/maven2/org/tmatesoft/svnkit/svnkit/1.8.5/svnkit-1.8.5.pom
3/3 KB            Downloaded: http://repo.maven.apache.org/maven2/org/tmatesoft/svnkit/svnkit/1.8.5/svnkit-1.8.5.pom
(3 KB at 140.9 KB/sec)
Downloading: http://repo.maven.apache.org/maven2/com/jcraft/jsch.agentproxy.svnkit-trilead-ssh2/0.0.7/jsch.agentproxy.svnkit-trilead-ssh2-0.0.7.pom
2/2 KB            Downloaded: http://repo.maven.apache.org/maven2/com/jcraft/jsch.agentproxy.svnkit-trilead-ssh2/0.0.7/jsch.agentproxy.svnkit-trilead-ssh2-0.0.7.pom
(2 KB at 65.6 KB/sec)
Downloading: http://repo.maven.apache.org/maven2/com/jcraft/jsch.agentproxy/0.0.7/jsch.agentproxy-0.0.7.pom
         [WARNING] Failed to create parent directories for resolution tracking file /home/jenkins/.m2/repository/com/jcraft/jsch.agentproxy/0.0.7/jsch.agentproxy-0.0.7.pom.lastUpdated
Downloading: http://repo.maven.apache.org/maven2/org/tmatesoft/sqljet/sqljet/1.1.10/sqljet-1.1.10.pom
3/3 KB            Downloaded: http://repo.maven.apache.org/maven2/org/tmatesoft/sqljet/sqljet/1.1.10/sqljet-1.1.10.pom
(3 KB at 125.2 KB/sec)
Downloading: http://repo.maven.apache.org/maven2/net/java/dev/jna/platform/3.5.2/platform-3.5.2.pom
2/2 KB            Downloaded: http://repo.maven.apache.org/maven2/net/java/dev/jna/platform/3.5.2/platform-3.5.2.pom
(2 KB at 74.7 KB/sec)
Downloading: http://repo.maven.apache.org/maven2/com/jcraft/jsch.agentproxy.connector-factory/0.0.7/jsch.agentproxy.connector-factory-0.0.7.pom
         [WARNING] Failed to create parent directories for resolution tracking file /home/jenkins/.m2/repository/com/jcraft/jsch.agentproxy.connector-factory/0.0.7/jsch.agentproxy.connector-factory-0.0.7.pom.lastUpdated
Downloading: http://repo.maven.apache.org/maven2/de/regnis/q/sequence/sequence-library/1.0.2/sequence-library-1.0.2.pom
2/2 KB            Downloaded: http://repo.maven.apache.org/maven2/de/regnis/q/sequence/sequence-library/1.0.2/sequence-library-1.0.2.pom
(2 KB at 62.0 KB/sec)
Downloading: http://repo.maven.apache.org/maven2/com/trilead/trilead-ssh2/1.0.0-build217/trilead-ssh2-1.0.0-build217.pom
2/2 KB            Downloaded: http://repo.maven.apache.org/maven2/com/trilead/trilead-ssh2/1.0.0-build217/trilead-ssh2-1.0.0-build217.pom
(2 KB at 68.7 KB/sec)
[INFO] ------------------------------------------------------------------------
[INFO] Reactor Summary:
[INFO] 
[INFO] OpenJPA Parent POM ................................ FAILURE [1.803s]
[INFO] OpenJPA Utilities Library ......................... SKIPPED
[INFO] OpenJPA Kernel .................................... SKIPPED
[INFO] OpenJPA JDBC ...................................... SKIPPED
[INFO] OpenJPA Persistence ............................... SKIPPED
[INFO] OpenJPA Persistence JDBC .......................... SKIPPED
[INFO] OpenJPA Persistence Locking Tests ................. SKIPPED
[INFO] OpenJPA tools ..................................... SKIPPED
[INFO] OpenJPA Maven Plugin .............................. SKIPPED
[INFO] OpenJPA XML Store ................................. SKIPPED
[INFO] OpenJPA Slice ..................................... SKIPPED
[INFO] OpenJPA JEST ...................................... SKIPPED
[INFO] OpenJPA Aggregate Jar ............................. SKIPPED
[INFO] OpenJPA Aggregate Jar with Dependencies ........... SKIPPED
[INFO] OpenJPA Project Docs and Assemblies ............... SKIPPED
[INFO] OpenJPA Examples .................................. SKIPPED
[INFO] OpenJPA Examples - Simple ......................... SKIPPED
[INFO] OpenJPA Examples - image-gallery .................. SKIPPED
[INFO] OpenJPA Examples - OpenBooks ...................... SKIPPED
[INFO] OpenJPA Integration Tests ......................... SKIPPED
[INFO] OpenJPA Integration Tests - Daytrader ............. SKIPPED
[INFO] OpenJPA Integration Tests - Examples .............. SKIPPED
[INFO] OpenJPA Integration Tests - SLF4JLogFactory ....... SKIPPED
[INFO] OpenJPA Integration Tests - JPA TCK ............... SKIPPED
[INFO] OpenJPA Integration Tests - Bean Validation ....... SKIPPED
[INFO] OpenJPA Integration Tests - JMX Platform MBeans ... SKIPPED
[INFO] OpenJPA Fetching Statistic Tool ................... SKIPPED
[INFO] OpenJPA Fetching Statistic Tool -- WAS Bundle ..... SKIPPED
[INFO] OpenJPA Features .................................. SKIPPED
[INFO] ------------------------------------------------------------------------
[INFO] BUILD FAILURE
[INFO] ------------------------------------------------------------------------
[INFO] Total time: 3.713s
[INFO] Finished at: Wed Mar 14 16:36:56 UTC 2018
[INFO] Final Memory: 20M/1449M
[INFO] ------------------------------------------------------------------------
[ERROR] Failed to execute goal org.codehaus.mojo:buildnumber-maven-plugin:1.4:create (default)
on project openjpa-parent: Execution default of goal org.codehaus.mojo:buildnumber-maven-plugin:1.4:create
failed: Plugin org.codehaus.mojo:buildnumber-maven-plugin:1.4 or one of its dependencies could
not be resolved: Failed to collect dependencies for org.codehaus.mojo:buildnumber-maven-plugin:jar:1.4
(): Failed to read artifact descriptor for com.jcraft:jsch.agentproxy.svnkit-trilead-ssh2:jar:0.0.7:
Could not transfer artifact com.jcraft:jsch.agentproxy:pom:0.0.7 from/to central (http://repo.maven.apache.org/maven2):
Specified destination directory cannot be created: /home/jenkins/.m2/repository/com/jcraft/jsch.agentproxy/0.0.7
-> [Help 1]
[ERROR] 
[ERROR] To see the full stack trace of the errors, re-run Maven with the -e switch.
[ERROR] Re-run Maven using the -X switch to enable full debug logging.
[ERROR] 
[ERROR] For more information about the errors and possible solutions, please read the following
articles:
[ERROR] [Help 1] http://cwiki.apache.org/confluence/display/MAVEN/PluginResolutionException
Build step 'Execute shell' marked build as failure
Archiving artifacts
Setting ANT_1_9_7_HOME=/home/jenkins/tools/ant/apache-ant-1.9.7
Setting MAVEN_3_0_4_HOME=/home/jenkins/tools/maven/apache-maven-3.0.4
Setting JDK_1_8_LATEST__HOME=/home/jenkins/tools/java/latest1.8
Recording test results
Setting ANT_1_9_7_HOME=/home/jenkins/tools/ant/apache-ant-1.9.7
Setting MAVEN_3_0_4_HOME=/home/jenkins/tools/maven/apache-maven-3.0.4
Setting JDK_1_8_LATEST__HOME=/home/jenkins/tools/java/latest1.8
ERROR: Step ?Publish JUnit test result report? failed: No test report files were found. Configuration
error?
Setting ANT_1_9_7_HOME=/home/jenkins/tools/ant/apache-ant-1.9.7
Setting MAVEN_3_0_4_HOME=/home/jenkins/tools/maven/apache-maven-3.0.4
Setting JDK_1_8_LATEST__HOME=/home/jenkins/tools/java/latest1.8

Mime
View raw message