openjpa-commits mailing list archives

Site index · List index
Message view « Date » · « Thread »
Top « Date » · « Thread »
From Apache Jenkins Server <jenk...@builds.apache.org>
Subject Build failed in Jenkins: OpenJPA-master-deploy #99
Date Mon, 27 Apr 2020 14:53:28 GMT
See <https://builds.apache.org/job/OpenJPA-master-deploy/99/display/redirect?page=changes>

Changes:

[rmannibucau] OPENJPA-2811 asm8 support


------------------------------------------
[...truncated 5.13 KB...]
[INFO] OpenJPA Fetching Statistic Tool                                    [jar]
[INFO] OpenJPA Fetching Statistic Tool -- WAS Bundle                      [jar]
[INFO] OpenJPA Features                                                   [pom]
[INFO] OpenJPA JUnit 5                                                    [jar]
[INFO] 
[INFO] -----------------< org.apache.openjpa:openjpa-parent >------------------
[INFO] Building OpenJPA Parent POM 3.1.2-SNAPSHOT                        [1/31]
[INFO] --------------------------------[ pom ]---------------------------------
[INFO] 
[INFO] --- maven-clean-plugin:3.1.0:clean (default-clean) @ openjpa-parent ---
[INFO] 
[INFO] --- buildnumber-maven-plugin:1.4:create (default) @ openjpa-parent ---
[INFO] Executing: /bin/sh -c cd '<https://builds.apache.org/job/OpenJPA-master-deploy/ws/'>
&& 'git' 'rev-parse' '--verify' 'HEAD'
[INFO] Working directory: <https://builds.apache.org/job/OpenJPA-master-deploy/ws/>
[INFO] Storing buildNumber: a975a3d1c63a82a6897b79a5cc9fcc4a3ebbb01f at timestamp: April 27,
2020 at 2:52 PM
[WARNING] Cannot get the branch information from the git repository: 
Detecting the current branch failed: fatal: ref HEAD is not a symbolic ref

[INFO] Executing: /bin/sh -c cd '<https://builds.apache.org/job/OpenJPA-master-deploy/ws/'>
&& 'git' 'rev-parse' '--verify' 'HEAD'
[INFO] Working directory: <https://builds.apache.org/job/OpenJPA-master-deploy/ws/>
[INFO] Storing buildScmBranch: UNKNOWN
[INFO] 
[INFO] --- maven-enforcer-plugin:1.4.1:enforce (enforce-maven-version) @ openjpa-parent ---
[INFO] 
[INFO] --- maven-enforcer-plugin:1.4.1:enforce (default) @ openjpa-parent ---
[INFO] 
[INFO] --- maven-checkstyle-plugin:3.1.1:checkstyle (default) @ openjpa-parent ---
[INFO] 
[INFO] --- maven-remote-resources-plugin:1.7.0:process (process-resource-bundles) @ openjpa-parent
---
[INFO] Preparing remote bundle org.apache:apache-jar-resource-bundle:1.4
[INFO] Copying 3 resources from 1 bundle.
[INFO] 
[INFO] --- maven-compiler-plugin:3.8.0:testCompile (test-source-compile) @ openjpa-parent
---
[INFO] No sources to compile
[INFO] 
[INFO] --- maven-site-plugin:3.7.1:attach-descriptor (attach-descriptor) @ openjpa-parent
---
[INFO] Attaching 'src/site/site.xml' site descriptor with classifier 'site'.
[INFO] 
[INFO] --- apache-rat-plugin:0.12:check (default) @ openjpa-parent ---
[INFO] Enabled default license matchers.
[INFO] Will parse SCM ignores for exclusions...
[INFO] Parsing exclusions from <https://builds.apache.org/job/OpenJPA-master-deploy/ws/.gitignore>
[INFO] Finished adding exclusions from SCM ignore files.
[INFO] 70 implicit excludes (use -debug for more details).
[INFO] Exclude: **/.*/**
[INFO] Exclude: **/target/**/*
[INFO] 4953 resources included (use -debug for more details)
[INFO] Rat check: Summary over all files. Unapproved: 0, unknown: 0, generated: 0, approved:
4944 licenses.
[INFO] 
[INFO] --- maven-install-plugin:2.5.2:install (default-install) @ openjpa-parent ---
[INFO] Installing <https://builds.apache.org/job/OpenJPA-master-deploy/ws/pom.xml> to
/home/jenkins/.m2/repository/org/apache/openjpa/openjpa-parent/3.1.2-SNAPSHOT/openjpa-parent-3.1.2-SNAPSHOT.pom
[INFO] Installing <https://builds.apache.org/job/OpenJPA-master-deploy/ws/target/openjpa-parent-3.1.2-SNAPSHOT-site.xml>
to /home/jenkins/.m2/repository/org/apache/openjpa/openjpa-parent/3.1.2-SNAPSHOT/openjpa-parent-3.1.2-SNAPSHOT-site.xml
[INFO] 
[INFO] --- maven-deploy-plugin:2.8.2:deploy (default-deploy) @ openjpa-parent ---
Downloading from apache.snapshots.https: https://repository.apache.org/content/repositories/snapshots/org/apache/openjpa/openjpa-parent/3.1.2-SNAPSHOT/maven-metadata.xml
Progress (1): 820 B                   Downloaded from apache.snapshots.https: https://repository.apache.org/content/repositories/snapshots/org/apache/openjpa/openjpa-parent/3.1.2-SNAPSHOT/maven-metadata.xml
(820 B at 882 B/s)
Uploading to apache.snapshots.https: https://repository.apache.org/content/repositories/snapshots/org/apache/openjpa/openjpa-parent/3.1.2-SNAPSHOT/openjpa-parent-3.1.2-20200427.145259-10.pom
Progress (1): 2.0/112 kBProgress (1): 4.1/112 kBProgress (1): 6.1/112 kBProgress (1): 8.2/112
kBProgress (1): 10/112 kB Progress (1): 12/112 kBProgress (1): 14/112 kBProgress (1): 16/112
kBProgress (1): 18/112 kBProgress (1): 20/112 kBProgress (1): 23/112 kBProgress (1): 25/112
kBProgress (1): 27/112 kBProgress (1): 29/112 kBProgress (1): 31/112 kBProgress (1): 33/112
kBProgress (1): 35/112 kBProgress (1): 37/112 kBProgress (1): 39/112 kBProgress (1): 41/112
kBProgress (1): 43/112 kBProgress (1): 45/112 kBProgress (1): 47/112 kBProgress (1): 49/112
kBProgress (1): 51/112 kBProgress (1): 53/112 kBProgress (1): 55/112 kBProgress (1): 57/112
kBProgress (1): 59/112 kBProgress (1): 61/112 kBProgress (1): 63/112 kBProgress (1): 66/112
kBProgress (1): 68/112 kBProgress (1): 70/112 kBProgress (1): 72/112 kBProgress (1): 74/112
kBProgress (1): 76/112 kBProgress (1): 78/112 kBProgress (1): 80/112 kBProgress (1): 82/112
kBProgress (1): 84/112 kBProgress (1): 86/112 kBProgress (1): 88/112 kBProgress (1): 90/112
kBProgress (1): 92/112 kBProgress (1): 94/112 kBProgress (1): 96/112 kBProgress (1): 98/112
kBProgress (1): 100/112 kBProgress (1): 102/112 kBProgress (1): 104/112 kBProgress (1): 106/112
kBProgress (1): 109/112 kBProgress (1): 111/112 kBProgress (1): 112 kB                   
    Uploaded to apache.snapshots.https: https://repository.apache.org/content/repositories/snapshots/org/apache/openjpa/openjpa-parent/3.1.2-SNAPSHOT/openjpa-parent-3.1.2-20200427.145259-10.pom
(112 kB at 79 kB/s)
Downloading from apache.snapshots.https: https://repository.apache.org/content/repositories/snapshots/org/apache/openjpa/openjpa-parent/maven-metadata.xml
Progress (1): 674 B                   Downloaded from apache.snapshots.https: https://repository.apache.org/content/repositories/snapshots/org/apache/openjpa/openjpa-parent/maven-metadata.xml
(674 B at 1.1 kB/s)
Uploading to apache.snapshots.https: https://repository.apache.org/content/repositories/snapshots/org/apache/openjpa/openjpa-parent/3.1.2-SNAPSHOT/maven-metadata.xml
Progress (1): 822 B                   Uploaded to apache.snapshots.https: https://repository.apache.org/content/repositories/snapshots/org/apache/openjpa/openjpa-parent/3.1.2-SNAPSHOT/maven-metadata.xml
(822 B at 735 B/s)
Uploading to apache.snapshots.https: https://repository.apache.org/content/repositories/snapshots/org/apache/openjpa/openjpa-parent/maven-metadata.xml
Progress (1): 674 B                   Uploaded to apache.snapshots.https: https://repository.apache.org/content/repositories/snapshots/org/apache/openjpa/openjpa-parent/maven-metadata.xml
(674 B at 591 B/s)
Uploading to apache.snapshots.https: https://repository.apache.org/content/repositories/snapshots/org/apache/openjpa/openjpa-parent/3.1.2-SNAPSHOT/openjpa-parent-3.1.2-20200427.145259-10-site.xml
Progress (1): 1.6 kB                    Uploaded to apache.snapshots.https: https://repository.apache.org/content/repositories/snapshots/org/apache/openjpa/openjpa-parent/3.1.2-SNAPSHOT/openjpa-parent-3.1.2-20200427.145259-10-site.xml
(1.6 kB at 1.5 kB/s)
Uploading to apache.snapshots.https: https://repository.apache.org/content/repositories/snapshots/org/apache/openjpa/openjpa-parent/3.1.2-SNAPSHOT/maven-metadata.xml
Progress (1): 823 B                   Uploaded to apache.snapshots.https: https://repository.apache.org/content/repositories/snapshots/org/apache/openjpa/openjpa-parent/3.1.2-SNAPSHOT/maven-metadata.xml
(823 B at 733 B/s)
[INFO] 
[INFO] -------------------< org.apache.openjpa:openjpa-lib >-------------------
[INFO] Building OpenJPA Utilities Library 3.1.2-SNAPSHOT                 [2/31]
[INFO] --------------------------------[ jar ]---------------------------------
[INFO] 
[INFO] --- maven-clean-plugin:3.1.0:clean (default-clean) @ openjpa-lib ---
[INFO] 
[INFO] --- buildnumber-maven-plugin:1.4:create (default) @ openjpa-lib ---
[INFO] 
[INFO] --- maven-enforcer-plugin:1.4.1:enforce (enforce-maven-version) @ openjpa-lib ---
[INFO] 
[INFO] --- maven-enforcer-plugin:1.4.1:enforce (default) @ openjpa-lib ---
[INFO] 
[INFO] --- maven-checkstyle-plugin:3.1.1:checkstyle (default) @ openjpa-lib ---
[INFO] Starting audit...
Audit done.
[WARNING] Unable to locate Source XRef to link to - DISABLED
[INFO] 
[INFO] --- maven-remote-resources-plugin:1.7.0:process (process-resource-bundles) @ openjpa-lib
---
[INFO] Preparing remote bundle org.apache:apache-jar-resource-bundle:1.4
[INFO] Copying 3 resources from 1 bundle.
[INFO] 
[INFO] --- maven-resources-plugin:3.1.0:resources (default-resources) @ openjpa-lib ---
[INFO] Using 'UTF-8' encoding to copy filtered resources.
[INFO] Copying 9 resources
[INFO] Copying 3 resources
[INFO] 
[INFO] --- maven-compiler-plugin:3.8.0:compile (default-compile) @ openjpa-lib ---
[INFO] Changes detected - recompiling the module!
[INFO] Compiling 162 source files to <https://builds.apache.org/job/OpenJPA-master-deploy/ws/openjpa-lib/target/classes>
[INFO] <https://builds.apache.org/job/OpenJPA-master-deploy/ws/openjpa-lib/src/main/java/org/apache/openjpa/lib/util/Files.java>:
Some input files use or override a deprecated API.
[INFO] <https://builds.apache.org/job/OpenJPA-master-deploy/ws/openjpa-lib/src/main/java/org/apache/openjpa/lib/util/Files.java>:
Recompile with -Xlint:deprecation for details.
[INFO] <https://builds.apache.org/job/OpenJPA-master-deploy/ws/openjpa-lib/src/main/java/org/apache/openjpa/lib/conf/Value.java>:
Some input files use unchecked or unsafe operations.
[INFO] <https://builds.apache.org/job/OpenJPA-master-deploy/ws/openjpa-lib/src/main/java/org/apache/openjpa/lib/conf/Value.java>:
Recompile with -Xlint:unchecked for details.
[INFO] 
[INFO] --- maven-antrun-plugin:1.8:run (set git version) @ openjpa-lib ---
[INFO] Executing tasks

main:
     [echo] Determining if there are uncommitted changes...
     [echo] Getting the 'GIT' revision value
     [echo] Revision: a975a3d
     [echo] Getting the 'PCEnhancer' revision value
     [echo] openjpa.enhancer.revision=73672b7
     [echo] OpenJPA version: 3.1.2-SNAPSHOT
[INFO] Executed tasks
[INFO] 
[INFO] --- maven-compiler-plugin:3.8.0:testCompile (test-source-compile) @ openjpa-lib ---
[INFO] Changes detected - recompiling the module!
[INFO] Compiling 42 source files to <https://builds.apache.org/job/OpenJPA-master-deploy/ws/openjpa-lib/target/test-classes>
[INFO] <https://builds.apache.org/job/OpenJPA-master-deploy/ws/openjpa-lib/src/test/java/org/apache/openjpa/lib/util/TestPropertiesParser.java>:
<https://builds.apache.org/job/OpenJPA-master-deploy/ws/openjpa-lib/src/test/java/org/apache/openjpa/lib/util/TestPropertiesParser.java>
uses or overrides a deprecated API.
[INFO] <https://builds.apache.org/job/OpenJPA-master-deploy/ws/openjpa-lib/src/test/java/org/apache/openjpa/lib/util/TestPropertiesParser.java>:
Recompile with -Xlint:deprecation for details.
[INFO] <https://builds.apache.org/job/OpenJPA-master-deploy/ws/openjpa-lib/src/test/java/org/apache/openjpa/lib/conf/TestConfigurationProviderPrefixes.java>:
Some input files use unchecked or unsafe operations.
[INFO] <https://builds.apache.org/job/OpenJPA-master-deploy/ws/openjpa-lib/src/test/java/org/apache/openjpa/lib/conf/TestConfigurationProviderPrefixes.java>:
Recompile with -Xlint:unchecked for details.
[INFO] 
[INFO] --- maven-resources-plugin:3.1.0:testResources (default-testResources) @ openjpa-lib
---
[INFO] Using 'UTF-8' encoding to copy filtered resources.
[INFO] Copying 8 resources
[INFO] Copying 3 resources
[INFO] 
[INFO] --- maven-compiler-plugin:3.8.0:testCompile (default-testCompile) @ openjpa-lib ---
[INFO] Changes detected - recompiling the module!
[INFO] Compiling 42 source files to <https://builds.apache.org/job/OpenJPA-master-deploy/ws/openjpa-lib/target/test-classes>
[INFO] <https://builds.apache.org/job/OpenJPA-master-deploy/ws/openjpa-lib/src/test/java/org/apache/openjpa/lib/util/TestPropertiesParser.java>:
<https://builds.apache.org/job/OpenJPA-master-deploy/ws/openjpa-lib/src/test/java/org/apache/openjpa/lib/util/TestPropertiesParser.java>
uses or overrides a deprecated API.
[INFO] <https://builds.apache.org/job/OpenJPA-master-deploy/ws/openjpa-lib/src/test/java/org/apache/openjpa/lib/util/TestPropertiesParser.java>:
Recompile with -Xlint:deprecation for details.
[INFO] <https://builds.apache.org/job/OpenJPA-master-deploy/ws/openjpa-lib/src/test/java/org/apache/openjpa/lib/conf/TestConfigurationProviderPrefixes.java>:
Some input files use unchecked or unsafe operations.
[INFO] <https://builds.apache.org/job/OpenJPA-master-deploy/ws/openjpa-lib/src/test/java/org/apache/openjpa/lib/conf/TestConfigurationProviderPrefixes.java>:
Recompile with -Xlint:unchecked for details.
[INFO] 
[INFO] --- maven-surefire-plugin:3.0.0-M4:test (default-test) @ openjpa-lib ---
[INFO] Tests are skipped.
[INFO] 
[INFO] --- maven-jar-plugin:3.1.0:jar (default-jar) @ openjpa-lib ---
[INFO] Building jar: <https://builds.apache.org/job/OpenJPA-master-deploy/ws/openjpa-lib/target/openjpa-lib-3.1.2-SNAPSHOT.jar>
[INFO] 
[INFO] --- maven-site-plugin:3.7.1:attach-descriptor (attach-descriptor) @ openjpa-lib ---
[INFO] Skipping because packaging 'jar' is not pom.
[INFO] 
[INFO] --- maven-jar-plugin:3.1.0:test-jar (attach-tests) @ openjpa-lib ---
[INFO] Building jar: <https://builds.apache.org/job/OpenJPA-master-deploy/ws/openjpa-lib/target/openjpa-lib-3.1.2-SNAPSHOT-tests.jar>
[INFO] 
[INFO] --- apache-rat-plugin:0.12:check (default) @ openjpa-lib ---
[INFO] Enabled default license matchers.
[INFO] Will parse SCM ignores for exclusions...
[INFO] Finished adding exclusions from SCM ignore files.
[INFO] 61 implicit excludes (use -debug for more details).
[INFO] Exclude: **/.*/**
[INFO] Exclude: **/target/**/*
[INFO] 230 resources included (use -debug for more details)
[INFO] Rat check: Summary over all files. Unapproved: 0, unknown: 0, generated: 0, approved:
230 licenses.
[INFO] 
[INFO] --- maven-install-plugin:2.5.2:install (default-install) @ openjpa-lib ---
[INFO] Installing <https://builds.apache.org/job/OpenJPA-master-deploy/ws/openjpa-lib/target/openjpa-lib-3.1.2-SNAPSHOT.jar>
to /home/jenkins/.m2/repository/org/apache/openjpa/openjpa-lib/3.1.2-SNAPSHOT/openjpa-lib-3.1.2-SNAPSHOT.jar
[INFO] Installing <https://builds.apache.org/job/OpenJPA-master-deploy/ws/openjpa-lib/pom.xml>
to /home/jenkins/.m2/repository/org/apache/openjpa/openjpa-lib/3.1.2-SNAPSHOT/openjpa-lib-3.1.2-SNAPSHOT.pom
[INFO] Installing <https://builds.apache.org/job/OpenJPA-master-deploy/ws/openjpa-lib/target/openjpa-lib-3.1.2-SNAPSHOT-tests.jar>
to /home/jenkins/.m2/repository/org/apache/openjpa/openjpa-lib/3.1.2-SNAPSHOT/openjpa-lib-3.1.2-SNAPSHOT-tests.jar
[INFO] 
[INFO] --- maven-deploy-plugin:2.8.2:deploy (default-deploy) @ openjpa-lib ---
Downloading from apache.snapshots.https: https://repository.apache.org/content/repositories/snapshots/org/apache/openjpa/openjpa-lib/3.1.2-SNAPSHOT/maven-metadata.xml
Progress (1): 991 B                   Downloaded from apache.snapshots.https: https://repository.apache.org/content/repositories/snapshots/org/apache/openjpa/openjpa-lib/3.1.2-SNAPSHOT/maven-metadata.xml
(991 B at 1.5 kB/s)
Uploading to apache.snapshots.https: https://repository.apache.org/content/repositories/snapshots/org/apache/openjpa/openjpa-lib/3.1.2-SNAPSHOT/openjpa-lib-3.1.2-20200427.145317-10.jar
Progress (1): 2.0/473 kBProgress (1): 4.1/473 kBProgress (1): 6.1/473 kBProgress (1): 8.2/473
kBProgress (1): 10/473 kB Progress (1): 12/473 kBProgress (1): 14/473 kBProgress (1): 16/473
kBProgress (1): 18/473 kBProgress (1): 20/473 kBProgress (1): 23/473 kBProgress (1): 25/473
kBProgress (1): 27/473 kBProgress (1): 29/473 kBProgress (1): 31/473 kBProgress (1): 33/473
kBProgress (1): 35/473 kBProgress (1): 37/473 kBProgress (1): 39/473 kBProgress (1): 41/473
kBProgress (1): 43/473 kBProgress (1): 45/473 kBProgress (1): 47/473 kBProgress (1): 49/473
kBProgress (1): 51/473 kBProgress (1): 53/473 kBProgress (1): 55/473 kBProgress (1): 57/473
kBProgress (1): 59/473 kBProgress (1): 61/473 kBProgress (1): 63/473 kBProgress (1): 66/473
kBProgress (1): 68/473 kBProgress (1): 70/473 kBProgress (1): 72/473 kBProgress (1): 74/473
kBProgress (1): 76/473 kBProgress (1): 78/473 kBProgress (1): 80/473 kBProgress (1): 82/473
kBProgress (1): 84/473 kBProgress (1): 86/473 kBProgress (1): 88/473 kBProgress (1): 90/473
kBProgress (1): 92/473 kBProgress (1): 94/473 kBProgress (1): 96/473 kBProgress (1): 98/473
kBProgress (1): 100/473 kBProgress (1): 102/473 kBProgress (1): 104/473 kBProgress (1): 106/473
kBProgress (1): 109/473 kBProgress (1): 111/473 kBProgress (1): 113/473 kBProgress (1): 115/473
kBProgress (1): 117/473 kBProgress (1): 119/473 kBProgress (1): 121/473 kBProgress (1): 123/473
kBProgress (1): 125/473 kBProgress (1): 127/473 kBProgress (1): 129/473 kBProgress (1): 131/473
kBProgress (1): 133/473 kBProgress (1): 135/473 kBProgress (1): 137/473 kBProgress (1): 139/473
kBProgress (1): 141/473 kBProgress (1): 143/473 kBProgress (1): 145/473 kBProgress (1): 147/473
kBProgress (1): 150/473 kBProgress (1): 152/473 kBProgress (1): 154/473 kBProgress (1): 156/473
kBProgress (1): 158/473 kBProgress (1): 160/473 kBProgress (1): 162/473 kBProgress (1): 164/473
kBProgress (1): 166/473 kBProgress (1): 168/473 kBProgress (1): 170/473 kBProgress (1): 172/473
kBProgress (1): 174/473 kBProgress (1): 176/473 kBProgress (1): 178/473 kBProgress (1): 180/473
kBProgress (1): 182/473 kBProgress (1): 184/473 kBProgress (1): 186/473 kBProgress (1): 188/473
kBProgress (1): 190/473 kBProgress (1): 193/473 kBProgress (1): 195/473 kBProgress (1): 197/473
kBProgress (1): 199/473 kBProgress (1): 201/473 kBProgress (1): 203/473 kBProgress (1): 205/473
kBProgress (1): 207/473 kBProgress (1): 209/473 kBProgress (1): 211/473 kBProgress (1): 213/473
kBProgress (1): 215/473 kBProgress (1): 217/473 kBProgress (1): 219/473 kBProgress (1): 221/473
kBProgress (1): 223/473 kBProgress (1): 225/473 kBProgress (1): 227/473 kBProgress (1): 229/473
kBProgress (1): 231/473 kBProgress (1): 233/473 kBProgress (1): 236/473 kBProgress (1): 238/473
kBProgress (1): 240/473 kBProgress (1): 242/473 kBProgress (1): 244/473 kBProgress (1): 246/473
kBProgress (1): 248/473 kBProgress (1): 250/473 kBProgress (1): 252/473 kBProgress (1): 254/473
kBProgress (1): 256/473 kBProgress (1): 258/473 kBProgress (1): 260/473 kBProgress (1): 262/473
kBProgress (1): 264/473 kBProgress (1): 266/473 kBProgress (1): 268/473 kBProgress (1): 270/473
kBProgress (1): 272/473 kBProgress (1): 274/473 kBProgress (1): 276/473 kBProgress (1): 279/473
kBProgress (1): 281/473 kBProgress (1): 283/473 kBProgress (1): 285/473 kBProgress (1): 287/473
kBProgress (1): 289/473 kBProgress (1): 291/473 kBProgress (1): 293/473 kBProgress (1): 295/473
kBProgress (1): 297/473 kBProgress (1): 299/473 kBProgress (1): 301/473 kBProgress (1): 303/473
kBProgress (1): 305/473 kBProgress (1): 307/473 kBProgress (1): 309/473 kBProgress (1): 311/473
kBProgress (1): 313/473 kBProgress (1): 315/473 kBProgress (1): 317/473 kBProgress (1): 319/473
kBProgress (1): 322/473 kBProgress (1): 324/473 kBProgress (1): 326/473 kBProgress (1): 328/473
kBProgress (1): 330/473 kBProgress (1): 332/473 kBProgress (1): 334/473 kBProgress (1): 336/473
kBProgress (1): 338/473 kBProgress (1): 340/473 kBProgress (1): 342/473 kBProgress (1): 344/473
kBProgress (1): 346/473 kBProgress (1): 348/473 kBProgress (1): 350/473 kBProgress (1): 352/473
kBProgress (1): 354/473 kBProgress (1): 356/473 kBProgress (1): 358/473 kBProgress (1): 360/473
kBProgress (1): 362/473 kBProgress (1): 365/473 kBProgress (1): 367/473 kBProgress (1): 369/473
kBProgress (1): 371/473 kBProgress (1): 373/473 kBProgress (1): 375/473 kBProgress (1): 377/473
kBProgress (1): 379/473 kBProgress (1): 381/473 kBProgress (1): 383/473 kBProgress (1): 385/473
kBProgress (1): 387/473 kBProgress (1): 389/473 kBProgress (1): 391/473 kBProgress (1): 393/473
kBProgress (1): 395/473 kBProgress (1): 397/473 kBProgress (1): 399/473 kBProgress (1): 401/473
kBProgress (1): 403/473 kBProgress (1): 406/473 kBProgress (1): 408/473 kBProgress (1): 410/473
kBProgress (1): 412/473 kBProgress (1): 414/473 kBProgress (1): 416/473 kBProgress (1): 418/473
kBProgress (1): 420/473 kBProgress (1): 422/473 kBProgress (1): 424/473 kBProgress (1): 426/473
kBProgress (1): 428/473 kBProgress (1): 430/473 kBProgress (1): 432/473 kBProgress (1): 434/473
kBProgress (1): 436/473 kBProgress (1): 438/473 kBProgress (1): 440/473 kBProgress (1): 442/473
kBProgress (1): 444/473 kBProgress (1): 446/473 kBProgress (1): 449/473 kBProgress (1): 451/473
kBProgress (1): 453/473 kBProgress (1): 455/473 kBProgress (1): 457/473 kBProgress (1): 459/473
kBProgress (1): 461/473 kBProgress (1): 463/473 kBProgress (1): 465/473 kBProgress (1): 467/473
kBProgress (1): 469/473 kBProgress (1): 471/473 kBProgress (1): 473/473 kBProgress (1): 473
kB                        Uploaded to apache.snapshots.https: https://repository.apache.org/content/repositories/snapshots/org/apache/openjpa/openjpa-lib/3.1.2-SNAPSHOT/openjpa-lib-3.1.2-20200427.145317-10.jar
(473 kB at 308 kB/s)
Uploading to apache.snapshots.https: https://repository.apache.org/content/repositories/snapshots/org/apache/openjpa/openjpa-lib/3.1.2-SNAPSHOT/openjpa-lib-3.1.2-20200427.145317-10.pom
Progress (1): 2.0/7.1 kBProgress (1): 4.1/7.1 kBProgress (1): 6.1/7.1 kBProgress (1): 7.1
kB                        Uploaded to apache.snapshots.https: https://repository.apache.org/content/repositories/snapshots/org/apache/openjpa/openjpa-lib/3.1.2-SNAPSHOT/openjpa-lib-3.1.2-20200427.145317-10.pom
(7.1 kB at 6.2 kB/s)
Downloading from apache.snapshots.https: https://repository.apache.org/content/repositories/snapshots/org/apache/openjpa/openjpa-lib/maven-metadata.xml
Progress (1): 671 B                   Downloaded from apache.snapshots.https: https://repository.apache.org/content/repositories/snapshots/org/apache/openjpa/openjpa-lib/maven-metadata.xml
(671 B at 1.0 kB/s)
Uploading to apache.snapshots.https: https://repository.apache.org/content/repositories/snapshots/org/apache/openjpa/openjpa-lib/3.1.2-SNAPSHOT/maven-metadata.xml
Progress (1): 994 B                   Uploaded to apache.snapshots.https: https://repository.apache.org/content/repositories/snapshots/org/apache/openjpa/openjpa-lib/3.1.2-SNAPSHOT/maven-metadata.xml
(994 B at 892 B/s)
Uploading to apache.snapshots.https: https://repository.apache.org/content/repositories/snapshots/org/apache/openjpa/openjpa-lib/maven-metadata.xml
Progress (1): 671 B                   Uploaded to apache.snapshots.https: https://repository.apache.org/content/repositories/snapshots/org/apache/openjpa/openjpa-lib/maven-metadata.xml
(671 B at 580 B/s)
Uploading to apache.snapshots.https: https://repository.apache.org/content/repositories/snapshots/org/apache/openjpa/openjpa-lib/3.1.2-SNAPSHOT/openjpa-lib-3.1.2-20200427.145317-10-tests.jar
Progress (1): 2.0/96 kBProgress (1): 4.1/96 kBProgress (1): 6.1/96 kBProgress (1): 8.2/96
kBProgress (1): 10/96 kB Progress (1): 12/96 kBProgress (1): 14/96 kBProgress (1): 16/96 kBProgress
(1): 18/96 kBProgress (1): 20/96 kBProgress (1): 23/96 kBProgress (1): 25/96 kBProgress (1):
27/96 kBProgress (1): 29/96 kBProgress (1): 31/96 kBProgress (1): 33/96 kBProgress (1): 35/96
kBProgress (1): 37/96 kBProgress (1): 39/96 kBProgress (1): 41/96 kBProgress (1): 43/96 kBProgress
(1): 45/96 kBProgress (1): 47/96 kBProgress (1): 49/96 kBProgress (1): 51/96 kBProgress (1):
53/96 kBProgress (1): 55/96 kBProgress (1): 57/96 kBProgress (1): 59/96 kBProgress (1): 61/96
kBProgress (1): 63/96 kBProgress (1): 66/96 kBProgress (1): 68/96 kBProgress (1): 70/96 kBProgress
(1): 72/96 kBProgress (1): 74/96 kBProgress (1): 76/96 kBProgress (1): 78/96 kBProgress (1):
80/96 kBProgress (1): 82/96 kBProgress (1): 84/96 kBProgress (1): 86/96 kBProgress (1): 88/96
kBProgress (1): 90/96 kBProgress (1): 92/96 kBProgress (1): 94/96 kBProgress (1): 96/96 kBProgress
(1): 96 kB                      Uploaded to apache.snapshots.https: https://repository.apache.org/content/repositories/snapshots/org/apache/openjpa/openjpa-lib/3.1.2-SNAPSHOT/openjpa-lib-3.1.2-20200427.145317-10-tests.jar
(96 kB at 74 kB/s)
Uploading to apache.snapshots.https: https://repository.apache.org/content/repositories/snapshots/org/apache/openjpa/openjpa-lib/3.1.2-SNAPSHOT/maven-metadata.xml
Progress (1): 995 B                   Uploaded to apache.snapshots.https: https://repository.apache.org/content/repositories/snapshots/org/apache/openjpa/openjpa-lib/3.1.2-SNAPSHOT/maven-metadata.xml
(995 B at 898 B/s)
[INFO] 
[INFO] -----------------< org.apache.openjpa:openjpa-kernel >------------------
[INFO] Building OpenJPA Kernel 3.1.2-SNAPSHOT                            [3/31]
[INFO] --------------------------------[ jar ]---------------------------------
Downloading from seasar-repo: https://www.seasar.org/maven/maven2/org/apache/xbean/xbean-asm8-shaded/4.17/xbean-asm8-shaded-4.17.pom
Downloading from central: https://repo.maven.apache.org/maven2/org/apache/xbean/xbean-asm8-shaded/4.17/xbean-asm8-shaded-4.17.pom
[WARNING] The POM for org.apache.xbean:xbean-asm8-shaded:jar:4.17 is missing, no dependency
information available
Downloading from seasar-repo: https://www.seasar.org/maven/maven2/org/apache/xbean/xbean-asm8-shaded/4.17/xbean-asm8-shaded-4.17.jar
Downloading from central: https://repo.maven.apache.org/maven2/org/apache/xbean/xbean-asm8-shaded/4.17/xbean-asm8-shaded-4.17.jar
[INFO] ------------------------------------------------------------------------
[INFO] Reactor Summary:
[INFO] 
[INFO] OpenJPA Parent POM 3.1.2-SNAPSHOT .................. SUCCESS [ 13.456 s]
[INFO] OpenJPA Utilities Library .......................... SUCCESS [ 19.245 s]
[INFO] OpenJPA Kernel ..................................... FAILURE [  1.115 s]
[INFO] OpenJPA JDBC ....................................... SKIPPED
[INFO] OpenJPA Persistence ................................ SKIPPED
[INFO] OpenJPA Persistence JDBC ........................... SKIPPED
[INFO] OpenJPA Persistence Locking Tests .................. SKIPPED
[INFO] OpenJPA tools ...................................... SKIPPED
[INFO] OpenJPA Maven Plugin ............................... SKIPPED
[INFO] OpenJPA XML Store .................................. SKIPPED
[INFO] OpenJPA Slice ...................................... SKIPPED
[INFO] OpenJPA JEST ....................................... SKIPPED
[INFO] OpenJPA Kubernetes ................................. SKIPPED
[INFO] OpenJPA Aggregate Jar .............................. SKIPPED
[INFO] OpenJPA Aggregate Jar with Dependencies ............ SKIPPED
[INFO] OpenJPA Project Docs and Assemblies ................ SKIPPED
[INFO] OpenJPA Examples ................................... SKIPPED
[INFO] OpenJPA Examples - Simple .......................... SKIPPED
[INFO] OpenJPA Examples - image-gallery ................... SKIPPED
[INFO] OpenJPA Examples - OpenBooks ....................... SKIPPED
[INFO] OpenJPA Integration Tests .......................... SKIPPED
[INFO] OpenJPA Integration Tests - Daytrader .............. SKIPPED
[INFO] OpenJPA Integration Tests - Examples ............... SKIPPED
[INFO] OpenJPA Integration Tests - SLF4JLogFactory ........ SKIPPED
[INFO] OpenJPA Integration Tests - JPA TCK ................ SKIPPED
[INFO] OpenJPA Integration Tests - Bean Validation ........ SKIPPED
[INFO] OpenJPA Integration Tests - JMX Platform MBeans .... SKIPPED
[INFO] OpenJPA Fetching Statistic Tool .................... SKIPPED
[INFO] OpenJPA Fetching Statistic Tool -- WAS Bundle ...... SKIPPED
[INFO] OpenJPA Features ................................... SKIPPED
[INFO] OpenJPA JUnit 5 3.1.2-SNAPSHOT ..................... SKIPPED
[INFO] ------------------------------------------------------------------------
[INFO] BUILD FAILURE
[INFO] ------------------------------------------------------------------------
[INFO] Total time: 35.262 s
[INFO] Finished at: 2020-04-27T14:53:26Z
[INFO] ------------------------------------------------------------------------
[ERROR] Failed to execute goal on project openjpa-kernel: Could not resolve dependencies for
project org.apache.openjpa:openjpa-kernel:jar:3.1.2-SNAPSHOT: Could not find artifact org.apache.xbean:xbean-asm8-shaded:jar:4.17
in seasar-repo (https://www.seasar.org/maven/maven2) -> [Help 1]
[ERROR] 
[ERROR] To see the full stack trace of the errors, re-run Maven with the -e switch.
[ERROR] Re-run Maven using the -X switch to enable full debug logging.
[ERROR] 
[ERROR] For more information about the errors and possible solutions, please read the following
articles:
[ERROR] [Help 1] http://cwiki.apache.org/confluence/display/MAVEN/DependencyResolutionException
[ERROR] 
[ERROR] After correcting the problems, you can resume the build with the command
[ERROR]   mvn <goals> -rf :openjpa-kernel
Build step 'Execute shell' marked build as failure
Archiving artifacts
Setting ANT_1_9_7_HOME=/home/jenkins/tools/ant/apache-ant-1.9.7
ERROR: No tool found matching MAVEN_3_0_4_HOME
Setting JDK_1_8_LATEST__HOME=/home/jenkins/tools/java/latest1.8
Setting MAVEN_3_5_4_HOME=/home/jenkins/tools/maven/apache-maven-3.5.4
Setting ANT_1_9_7_HOME=/home/jenkins/tools/ant/apache-ant-1.9.7
ERROR: No tool found matching MAVEN_3_0_4_HOME
Setting JDK_1_8_LATEST__HOME=/home/jenkins/tools/java/latest1.8
Setting MAVEN_3_5_4_HOME=/home/jenkins/tools/maven/apache-maven-3.5.4

Mime
View raw message