openjpa-commits mailing list archives

Site index · List index
Message view « Date » · « Thread »
Top « Date » · « Thread »
From Apache Jenkins Server <jenk...@builds.apache.org>
Subject Build failed in Jenkins: OpenJPA-master #112
Date Thu, 07 May 2020 07:40:10 GMT
See <https://builds.apache.org/job/OpenJPA-master/112/display/redirect?page=changes>

Changes:

[rmannibucau] commenting seasar-repo since it should be useless now (and try to get


------------------------------------------
[...truncated 8.49 KB...]
[INFO] --- maven-clean-plugin:3.1.0:clean (default-clean) @ openjpa-lib ---
[INFO] Deleting <https://builds.apache.org/job/OpenJPA-master/ws/openjpa-lib/target>
[INFO] 
[INFO] --- buildnumber-maven-plugin:1.4:create (default) @ openjpa-lib ---
[INFO] 
[INFO] --- maven-enforcer-plugin:1.4.1:enforce (enforce-maven-version) @ openjpa-lib ---
[INFO] 
[INFO] --- maven-enforcer-plugin:1.4.1:enforce (default) @ openjpa-lib ---
[INFO] 
[INFO] --- maven-checkstyle-plugin:3.1.1:checkstyle (default) @ openjpa-lib ---
[INFO] Starting audit...
Audit done.
[WARNING] Unable to locate Source XRef to link to - DISABLED
[INFO] 
[INFO] --- maven-remote-resources-plugin:1.7.0:process (process-resource-bundles) @ openjpa-lib
---
[INFO] Preparing remote bundle org.apache:apache-jar-resource-bundle:1.4
[INFO] Copying 3 resources from 1 bundle.
[INFO] 
[INFO] --- maven-resources-plugin:3.1.0:resources (default-resources) @ openjpa-lib ---
[INFO] Using 'UTF-8' encoding to copy filtered resources.
[INFO] Copying 9 resources
[INFO] Copying 3 resources
[INFO] 
[INFO] --- maven-compiler-plugin:3.8.0:compile (default-compile) @ openjpa-lib ---
[INFO] Changes detected - recompiling the module!
[INFO] Compiling 162 source files to <https://builds.apache.org/job/OpenJPA-master/ws/openjpa-lib/target/classes>
[INFO] <https://builds.apache.org/job/OpenJPA-master/ws/openjpa-lib/src/main/java/org/apache/openjpa/lib/meta/ClassMetaDataIterator.java>:
Some input files use or override a deprecated API.
[INFO] <https://builds.apache.org/job/OpenJPA-master/ws/openjpa-lib/src/main/java/org/apache/openjpa/lib/meta/ClassMetaDataIterator.java>:
Recompile with -Xlint:deprecation for details.
[INFO] <https://builds.apache.org/job/OpenJPA-master/ws/openjpa-lib/src/main/java/org/apache/openjpa/lib/jdbc/DelegatingDataSource.java>:
Some input files use unchecked or unsafe operations.
[INFO] <https://builds.apache.org/job/OpenJPA-master/ws/openjpa-lib/src/main/java/org/apache/openjpa/lib/jdbc/DelegatingDataSource.java>:
Recompile with -Xlint:unchecked for details.
[INFO] 
[INFO] --- maven-antrun-plugin:1.8:run (set git version) @ openjpa-lib ---
[INFO] Executing tasks

main:
     [echo] Determining if there are uncommitted changes...
     [echo] Getting the 'GIT' revision value
     [echo] Revision: 560a850
     [echo] Getting the 'PCEnhancer' revision value
     [echo] openjpa.enhancer.revision=73672b7
     [echo] OpenJPA version: 3.1.2-SNAPSHOT
[INFO] Executed tasks
[INFO] 
[INFO] --- maven-compiler-plugin:3.8.0:testCompile (test-source-compile) @ openjpa-lib ---
[INFO] Changes detected - recompiling the module!
[INFO] Compiling 42 source files to <https://builds.apache.org/job/OpenJPA-master/ws/openjpa-lib/target/test-classes>
[INFO] <https://builds.apache.org/job/OpenJPA-master/ws/openjpa-lib/src/test/java/org/apache/openjpa/lib/util/TestPropertiesParser.java>:
<https://builds.apache.org/job/OpenJPA-master/ws/openjpa-lib/src/test/java/org/apache/openjpa/lib/util/TestPropertiesParser.java>
uses or overrides a deprecated API.
[INFO] <https://builds.apache.org/job/OpenJPA-master/ws/openjpa-lib/src/test/java/org/apache/openjpa/lib/util/TestPropertiesParser.java>:
Recompile with -Xlint:deprecation for details.
[INFO] <https://builds.apache.org/job/OpenJPA-master/ws/openjpa-lib/src/test/java/org/apache/openjpa/lib/util/TestUUIDGenerator.java>:
Some input files use unchecked or unsafe operations.
[INFO] <https://builds.apache.org/job/OpenJPA-master/ws/openjpa-lib/src/test/java/org/apache/openjpa/lib/util/TestUUIDGenerator.java>:
Recompile with -Xlint:unchecked for details.
[INFO] 
[INFO] --- maven-resources-plugin:3.1.0:testResources (default-testResources) @ openjpa-lib
---
[INFO] Using 'UTF-8' encoding to copy filtered resources.
[INFO] Copying 8 resources
[INFO] Copying 3 resources
[INFO] 
[INFO] --- maven-compiler-plugin:3.8.0:testCompile (default-testCompile) @ openjpa-lib ---
[INFO] Changes detected - recompiling the module!
[INFO] Compiling 42 source files to <https://builds.apache.org/job/OpenJPA-master/ws/openjpa-lib/target/test-classes>
[INFO] <https://builds.apache.org/job/OpenJPA-master/ws/openjpa-lib/src/test/java/org/apache/openjpa/lib/util/TestPropertiesParser.java>:
<https://builds.apache.org/job/OpenJPA-master/ws/openjpa-lib/src/test/java/org/apache/openjpa/lib/util/TestPropertiesParser.java>
uses or overrides a deprecated API.
[INFO] <https://builds.apache.org/job/OpenJPA-master/ws/openjpa-lib/src/test/java/org/apache/openjpa/lib/util/TestPropertiesParser.java>:
Recompile with -Xlint:deprecation for details.
[INFO] <https://builds.apache.org/job/OpenJPA-master/ws/openjpa-lib/src/test/java/org/apache/openjpa/lib/util/TestUUIDGenerator.java>:
Some input files use unchecked or unsafe operations.
[INFO] <https://builds.apache.org/job/OpenJPA-master/ws/openjpa-lib/src/test/java/org/apache/openjpa/lib/util/TestUUIDGenerator.java>:
Recompile with -Xlint:unchecked for details.
[INFO] 
[INFO] --- maven-surefire-plugin:3.0.0-M4:test (default-test) @ openjpa-lib ---
[INFO] 
[INFO] -------------------------------------------------------
[INFO]  T E S T S
[INFO] -------------------------------------------------------
[INFO] Running org.apache.openjpa.lib.rop.TestSoftRandomAccessResultList
[INFO] Tests run: 17, Failures: 0, Errors: 0, Skipped: 0, Time elapsed: 0.101 s - in org.apache.openjpa.lib.rop.TestSoftRandomAccessResultList
[INFO] Running org.apache.openjpa.lib.rop.TestLazyForwardResultList
[INFO] Tests run: 17, Failures: 0, Errors: 0, Skipped: 0, Time elapsed: 0.005 s - in org.apache.openjpa.lib.rop.TestLazyForwardResultList
[INFO] Running org.apache.openjpa.lib.rop.TestRangeResultObjectProvider
[INFO] Tests run: 17, Failures: 0, Errors: 0, Skipped: 0, Time elapsed: 0.008 s - in org.apache.openjpa.lib.rop.TestRangeResultObjectProvider
[INFO] Running org.apache.openjpa.lib.rop.TestMergedResultObjectProvider
[INFO] Tests run: 17, Failures: 0, Errors: 0, Skipped: 0, Time elapsed: 0.022 s - in org.apache.openjpa.lib.rop.TestMergedResultObjectProvider
[INFO] Running org.apache.openjpa.lib.rop.TestListResultList
[INFO] Tests run: 17, Failures: 0, Errors: 0, Skipped: 0, Time elapsed: 0.009 s - in org.apache.openjpa.lib.rop.TestListResultList
[INFO] Running org.apache.openjpa.lib.rop.TestEagerResultList
[INFO] Tests run: 17, Failures: 0, Errors: 0, Skipped: 0, Time elapsed: 0.006 s - in org.apache.openjpa.lib.rop.TestEagerResultList
[INFO] Running org.apache.openjpa.lib.rop.TestWindowResultList
[INFO] Tests run: 17, Failures: 0, Errors: 0, Skipped: 0, Time elapsed: 0.007 s - in org.apache.openjpa.lib.rop.TestWindowResultList
[INFO] Running org.apache.openjpa.lib.rop.TestRandomAccessResultList
[INFO] Tests run: 17, Failures: 0, Errors: 0, Skipped: 0, Time elapsed: 0.009 s - in org.apache.openjpa.lib.rop.TestRandomAccessResultList
[INFO] Running org.apache.openjpa.lib.rop.TestOrderedMergedResultObjectProvider
[INFO] Tests run: 17, Failures: 0, Errors: 0, Skipped: 0, Time elapsed: 0.024 s - in org.apache.openjpa.lib.rop.TestOrderedMergedResultObjectProvider
[INFO] Running org.apache.openjpa.lib.rop.TestSimpleResultList
[INFO] Tests run: 17, Failures: 0, Errors: 0, Skipped: 0, Time elapsed: 0.007 s - in org.apache.openjpa.lib.rop.TestSimpleResultList
[INFO] Running org.apache.openjpa.lib.identifier.TestIdentifiers
[INFO] Tests run: 1, Failures: 0, Errors: 0, Skipped: 0, Time elapsed: 0.004 s - in org.apache.openjpa.lib.identifier.TestIdentifiers
[INFO] Running org.apache.openjpa.lib.util.TestOptions
[INFO] Tests run: 2, Failures: 0, Errors: 0, Skipped: 0, Time elapsed: 0.008 s - in org.apache.openjpa.lib.util.TestOptions
[INFO] Running org.apache.openjpa.lib.util.TestTemporaryClassLoader
[INFO] Tests run: 1, Failures: 0, Errors: 0, Skipped: 0, Time elapsed: 0.004 s - in org.apache.openjpa.lib.util.TestTemporaryClassLoader
[INFO] Running org.apache.openjpa.lib.util.TestAbstractEventManager
[INFO] Tests run: 2, Failures: 0, Errors: 0, Skipped: 0, Time elapsed: 0.002 s - in org.apache.openjpa.lib.util.TestAbstractEventManager
[INFO] Running org.apache.openjpa.lib.util.ClassUtilTest
[WARNING] Tests run: 5, Failures: 0, Errors: 0, Skipped: 1, Time elapsed: 0.007 s - in org.apache.openjpa.lib.util.ClassUtilTest
[INFO] Running org.apache.openjpa.lib.util.git.TestGitUtils
[INFO] Tests run: 5, Failures: 0, Errors: 0, Skipped: 0, Time elapsed: 0.01 s - in org.apache.openjpa.lib.util.git.TestGitUtils
[INFO] Running org.apache.openjpa.lib.util.TestParameterTemplate
[INFO] Tests run: 1, Failures: 0, Errors: 0, Skipped: 0, Time elapsed: 0.002 s - in org.apache.openjpa.lib.util.TestParameterTemplate
[INFO] Running org.apache.openjpa.lib.util.StringUtilTest
[WARNING] Tests run: 11, Failures: 0, Errors: 0, Skipped: 3, Time elapsed: 0.006 s - in org.apache.openjpa.lib.util.StringUtilTest
[INFO] Running org.apache.openjpa.lib.util.TestUUIDGenerator
[INFO] Tests run: 7, Failures: 0, Errors: 0, Skipped: 0, Time elapsed: 0.169 s - in org.apache.openjpa.lib.util.TestUUIDGenerator
[INFO] Running org.apache.openjpa.lib.util.TestReferenceSet
[INFO] Tests run: 4, Failures: 0, Errors: 0, Skipped: 0, Time elapsed: 0.005 s - in org.apache.openjpa.lib.util.TestReferenceSet
[INFO] Running org.apache.openjpa.lib.util.TestPropertiesParser
[INFO] Tests run: 13, Failures: 0, Errors: 0, Skipped: 0, Time elapsed: 0.154 s - in org.apache.openjpa.lib.util.TestPropertiesParser
[INFO] Running org.apache.openjpa.lib.util.TestTypedProperties
[INFO] Tests run: 4, Failures: 0, Errors: 0, Skipped: 0, Time elapsed: 0.002 s - in org.apache.openjpa.lib.util.TestTypedProperties
[INFO] Running org.apache.openjpa.lib.util.TestMultiClassLoader
[INFO] Tests run: 2, Failures: 0, Errors: 0, Skipped: 0, Time elapsed: 0.005 s - in org.apache.openjpa.lib.util.TestMultiClassLoader
[INFO] Running org.apache.openjpa.lib.util.TestSimpleRegex
[INFO] Tests run: 1, Failures: 0, Errors: 0, Skipped: 0, Time elapsed: 0.002 s - in org.apache.openjpa.lib.util.TestSimpleRegex
[INFO] Running org.apache.openjpa.lib.util.TestLocalizer
[INFO] Tests run: 7, Failures: 0, Errors: 0, Skipped: 0, Time elapsed: 0.008 s - in org.apache.openjpa.lib.util.TestLocalizer
[INFO] Running org.apache.openjpa.lib.conf.TestValue
[INFO] Tests run: 3, Failures: 0, Errors: 0, Skipped: 0, Time elapsed: 0.002 s - in org.apache.openjpa.lib.conf.TestValue
[INFO] Running org.apache.openjpa.lib.conf.TestXMLCaseConversions
[INFO] Tests run: 1, Failures: 0, Errors: 0, Skipped: 0, Time elapsed: 0.007 s - in org.apache.openjpa.lib.conf.TestXMLCaseConversions
[INFO] Running org.apache.openjpa.lib.conf.TestConfigurationProviderPrefixes
[INFO] Tests run: 7, Failures: 0, Errors: 0, Skipped: 0, Time elapsed: 0.015 s - in org.apache.openjpa.lib.conf.TestConfigurationProviderPrefixes
[INFO] Running org.apache.openjpa.lib.conf.TestConfigurations
[INFO] Tests run: 3, Failures: 0, Errors: 0, Skipped: 0, Time elapsed: 0.012 s - in org.apache.openjpa.lib.conf.TestConfigurations
[INFO] Running org.apache.openjpa.lib.conf.test.TestPluginValue
[INFO] Tests run: 3, Failures: 0, Errors: 0, Skipped: 0, Time elapsed: 0.003 s - in org.apache.openjpa.lib.conf.test.TestPluginValue
[INFO] Running org.apache.openjpa.lib.conf.test.TestConfigurationImpl
[INFO] Tests run: 8, Failures: 0, Errors: 0, Skipped: 0, Time elapsed: 0.05 s - in org.apache.openjpa.lib.conf.test.TestConfigurationImpl
[INFO] Running org.apache.openjpa.lib.graph.TestGraph
[INFO] Tests run: 3, Failures: 0, Errors: 0, Skipped: 0, Time elapsed: 0.003 s - in org.apache.openjpa.lib.graph.TestGraph
[INFO] Running org.apache.openjpa.lib.graph.TestDepthFirstAnalysis
[INFO] Tests run: 4, Failures: 0, Errors: 0, Skipped: 0, Time elapsed: 0.009 s - in org.apache.openjpa.lib.graph.TestDepthFirstAnalysis
[INFO] Running org.apache.openjpa.lib.xml.TestDocTypeReader
[INFO] Tests run: 3, Failures: 0, Errors: 0, Skipped: 0, Time elapsed: 0.052 s - in org.apache.openjpa.lib.xml.TestDocTypeReader
[INFO] Running org.apache.openjpa.lib.xml.TestXMLWriter
[INFO] Tests run: 1, Failures: 0, Errors: 0, Skipped: 0, Time elapsed: 0.043 s - in org.apache.openjpa.lib.xml.TestXMLWriter
[INFO] 
[INFO] Results:
[INFO] 
[WARNING] Tests run: 272, Failures: 0, Errors: 0, Skipped: 4
[INFO] 
[INFO] 
[INFO] --- maven-jar-plugin:3.1.0:jar (default-jar) @ openjpa-lib ---
[INFO] Building jar: <https://builds.apache.org/job/OpenJPA-master/ws/openjpa-lib/target/openjpa-lib-3.1.2-SNAPSHOT.jar>
[INFO] 
[INFO] --- maven-site-plugin:3.7.1:attach-descriptor (attach-descriptor) @ openjpa-lib ---
[INFO] Skipping because packaging 'jar' is not pom.
[INFO] 
[INFO] --- maven-jar-plugin:3.1.0:test-jar (attach-tests) @ openjpa-lib ---
[INFO] Building jar: <https://builds.apache.org/job/OpenJPA-master/ws/openjpa-lib/target/openjpa-lib-3.1.2-SNAPSHOT-tests.jar>
[INFO] 
[INFO] --- apache-rat-plugin:0.12:check (default) @ openjpa-lib ---
[INFO] Enabled default license matchers.
[INFO] Will parse SCM ignores for exclusions...
[INFO] Finished adding exclusions from SCM ignore files.
[INFO] 61 implicit excludes (use -debug for more details).
[INFO] Exclude: **/.*/**
[INFO] Exclude: **/target/**/*
[INFO] 230 resources included (use -debug for more details)
[INFO] Rat check: Summary over all files. Unapproved: 0, unknown: 0, generated: 0, approved:
230 licenses.
[INFO] 
[INFO] --- maven-install-plugin:2.5.2:install (default-install) @ openjpa-lib ---
[INFO] Installing <https://builds.apache.org/job/OpenJPA-master/ws/openjpa-lib/target/openjpa-lib-3.1.2-SNAPSHOT.jar>
to /home/jenkins/.m2/repository/org/apache/openjpa/openjpa-lib/3.1.2-SNAPSHOT/openjpa-lib-3.1.2-SNAPSHOT.jar
[INFO] Installing <https://builds.apache.org/job/OpenJPA-master/ws/openjpa-lib/pom.xml>
to /home/jenkins/.m2/repository/org/apache/openjpa/openjpa-lib/3.1.2-SNAPSHOT/openjpa-lib-3.1.2-SNAPSHOT.pom
[INFO] Installing <https://builds.apache.org/job/OpenJPA-master/ws/openjpa-lib/target/openjpa-lib-3.1.2-SNAPSHOT-tests.jar>
to /home/jenkins/.m2/repository/org/apache/openjpa/openjpa-lib/3.1.2-SNAPSHOT/openjpa-lib-3.1.2-SNAPSHOT-tests.jar
[INFO] 
[INFO] -----------------< org.apache.openjpa:openjpa-kernel >------------------
[INFO] Building OpenJPA Kernel 3.1.2-SNAPSHOT                            [3/31]
[INFO] --------------------------------[ jar ]---------------------------------
Downloading from central: https://repo.maven.apache.org/maven2/com/ibm/websphere/uow_api/6/uow_api-6.pom
[WARNING] The POM for com.ibm.websphere:uow_api:jar:6 is missing, no dependency information
available
Downloading from central: https://repo.maven.apache.org/maven2/org/apache/xbean/xbean-asm8-shaded/4.17/xbean-asm8-shaded-4.17.pom
Progress (1): 2.2/4.2 kBProgress (1): 4.2 kB                        Downloaded from central:
https://repo.maven.apache.org/maven2/org/apache/xbean/xbean-asm8-shaded/4.17/xbean-asm8-shaded-4.17.pom
(4.2 kB at 107 kB/s)
Downloading from central: https://repo.maven.apache.org/maven2/org/apache/xbean/xbean/4.17/xbean-4.17.pom
Progress (1): 2.2/19 kBProgress (1): 5.0/19 kBProgress (1): 7.8/19 kBProgress (1): 11/19 kB
Progress (1): 13/19 kBProgress (1): 16/19 kBProgress (1): 19/19 kBProgress (1): 19 kB    
                 Downloaded from central: https://repo.maven.apache.org/maven2/org/apache/xbean/xbean/4.17/xbean-4.17.pom
(19 kB at 733 kB/s)
Downloading from central: https://repo.maven.apache.org/maven2/com/ibm/websphere/uow_api/6/uow_api-6.jar
Downloading from central: https://repo.maven.apache.org/maven2/org/apache/xbean/xbean-asm8-shaded/4.17/xbean-asm8-shaded-4.17.jar
Progress (1): 2.2/293 kBProgress (1): 5.0/293 kBProgress (1): 7.7/293 kBProgress (1): 10/293
kB Progress (1): 13/293 kBProgress (1): 16/293 kBProgress (1): 19/293 kBProgress (1): 21/293
kBProgress (1): 24/293 kBProgress (1): 27/293 kBProgress (1): 30/293 kBProgress (1): 32/293
kBProgress (1): 36/293 kBProgress (1): 40/293 kBProgress (1): 45/293 kBProgress (1): 49/293
kBProgress (1): 53/293 kBProgress (1): 57/293 kBProgress (1): 61/293 kBProgress (1): 65/293
kBProgress (1): 69/293 kBProgress (1): 73/293 kBProgress (1): 77/293 kBProgress (1): 81/293
kBProgress (1): 85/293 kBProgress (1): 90/293 kBProgress (1): 94/293 kBProgress (1): 98/293
kBProgress (1): 102/293 kBProgress (1): 106/293 kBProgress (1): 110/293 kBProgress (1): 114/293
kBProgress (1): 118/293 kBProgress (1): 122/293 kBProgress (1): 126/293 kBProgress (1): 131/293
kBProgress (1): 135/293 kBProgress (1): 139/293 kBProgress (1): 143/293 kBProgress (1): 147/293
kBProgress (1): 151/293 kBProgress (1): 155/293 kBProgress (1): 159/293 kBProgress (1): 163/293
kBProgress (1): 167/293 kBProgress (1): 171/293 kBProgress (1): 176/293 kBProgress (1): 180/293
kBProgress (1): 184/293 kBProgress (1): 188/293 kBProgress (1): 192/293 kBProgress (1): 196/293
kBProgress (1): 200/293 kBProgress (1): 204/293 kBProgress (1): 208/293 kBProgress (1): 212/293
kBProgress (1): 217/293 kBProgress (1): 221/293 kBProgress (1): 225/293 kBProgress (1): 229/293
kBProgress (1): 233/293 kBProgress (1): 237/293 kBProgress (1): 241/293 kBProgress (1): 245/293
kBProgress (1): 249/293 kBProgress (1): 253/293 kBProgress (1): 258/293 kBProgress (1): 262/293
kBProgress (1): 266/293 kBProgress (1): 270/293 kBProgress (1): 274/293 kBProgress (1): 278/293
kBProgress (1): 282/293 kBProgress (1): 286/293 kBProgress (1): 290/293 kBProgress (1): 293
kB                        Downloaded from central: https://repo.maven.apache.org/maven2/org/apache/xbean/xbean-asm8-shaded/4.17/xbean-asm8-shaded-4.17.jar
(293 kB at 3.6 MB/s)
[INFO] ------------------------------------------------------------------------
[INFO] Reactor Summary:
[INFO] 
[INFO] OpenJPA Parent POM 3.1.2-SNAPSHOT .................. SUCCESS [ 12.987 s]
[INFO] OpenJPA Utilities Library .......................... SUCCESS [ 14.248 s]
[INFO] OpenJPA Kernel ..................................... FAILURE [  1.648 s]
[INFO] OpenJPA JDBC ....................................... SKIPPED
[INFO] OpenJPA Persistence ................................ SKIPPED
[INFO] OpenJPA Persistence JDBC ........................... SKIPPED
[INFO] OpenJPA Persistence Locking Tests .................. SKIPPED
[INFO] OpenJPA tools ...................................... SKIPPED
[INFO] OpenJPA Maven Plugin ............................... SKIPPED
[INFO] OpenJPA XML Store .................................. SKIPPED
[INFO] OpenJPA Slice ...................................... SKIPPED
[INFO] OpenJPA JEST ....................................... SKIPPED
[INFO] OpenJPA Kubernetes ................................. SKIPPED
[INFO] OpenJPA Aggregate Jar .............................. SKIPPED
[INFO] OpenJPA Aggregate Jar with Dependencies ............ SKIPPED
[INFO] OpenJPA Project Docs and Assemblies ................ SKIPPED
[INFO] OpenJPA Examples ................................... SKIPPED
[INFO] OpenJPA Examples - Simple .......................... SKIPPED
[INFO] OpenJPA Examples - image-gallery ................... SKIPPED
[INFO] OpenJPA Examples - OpenBooks ....................... SKIPPED
[INFO] OpenJPA Integration Tests .......................... SKIPPED
[INFO] OpenJPA Integration Tests - Daytrader .............. SKIPPED
[INFO] OpenJPA Integration Tests - Examples ............... SKIPPED
[INFO] OpenJPA Integration Tests - SLF4JLogFactory ........ SKIPPED
[INFO] OpenJPA Integration Tests - JPA TCK ................ SKIPPED
[INFO] OpenJPA Integration Tests - Bean Validation ........ SKIPPED
[INFO] OpenJPA Integration Tests - JMX Platform MBeans .... SKIPPED
[INFO] OpenJPA Fetching Statistic Tool .................... SKIPPED
[INFO] OpenJPA Fetching Statistic Tool -- WAS Bundle ...... SKIPPED
[INFO] OpenJPA Features ................................... SKIPPED
[INFO] OpenJPA JUnit 5 3.1.2-SNAPSHOT ..................... SKIPPED
[INFO] ------------------------------------------------------------------------
[INFO] BUILD FAILURE
[INFO] ------------------------------------------------------------------------
[INFO] Total time: 30.779 s
[INFO] Finished at: 2020-05-07T07:40:05Z
[INFO] ------------------------------------------------------------------------
[ERROR] Failed to execute goal on project openjpa-kernel: Could not resolve dependencies for
project org.apache.openjpa:openjpa-kernel:jar:3.1.2-SNAPSHOT: Could not find artifact com.ibm.websphere:uow_api:jar:6
in central (https://repo.maven.apache.org/maven2) -> [Help 1]
[ERROR] 
[ERROR] To see the full stack trace of the errors, re-run Maven with the -e switch.
[ERROR] Re-run Maven using the -X switch to enable full debug logging.
[ERROR] 
[ERROR] For more information about the errors and possible solutions, please read the following
articles:
[ERROR] [Help 1] http://cwiki.apache.org/confluence/display/MAVEN/DependencyResolutionException
[ERROR] 
[ERROR] After correcting the problems, you can resume the build with the command
[ERROR]   mvn <goals> -rf :openjpa-kernel
Build step 'Execute shell' marked build as failure
Archiving artifacts
Setting ANT_1_9_7_HOME=/home/jenkins/tools/ant/apache-ant-1.9.7
Setting JDK_1_8_LATEST__HOME=/home/jenkins/tools/java/latest1.8
Setting MAVEN_3_3_9_HOME=/home/jenkins/tools/maven/apache-maven-3.3.9
ERROR: No tool found matching MAVEN_3_3_3_HOME
Setting MAVEN_3_5_4_HOME=/home/jenkins/tools/maven/apache-maven-3.5.4
Recording test results
Setting ANT_1_9_7_HOME=/home/jenkins/tools/ant/apache-ant-1.9.7
Setting JDK_1_8_LATEST__HOME=/home/jenkins/tools/java/latest1.8
Setting MAVEN_3_3_9_HOME=/home/jenkins/tools/maven/apache-maven-3.3.9
ERROR: No tool found matching MAVEN_3_3_3_HOME
Setting MAVEN_3_5_4_HOME=/home/jenkins/tools/maven/apache-maven-3.5.4
Setting ANT_1_9_7_HOME=/home/jenkins/tools/ant/apache-ant-1.9.7
Setting JDK_1_8_LATEST__HOME=/home/jenkins/tools/java/latest1.8
Setting MAVEN_3_3_9_HOME=/home/jenkins/tools/maven/apache-maven-3.3.9
ERROR: No tool found matching MAVEN_3_3_3_HOME
Setting MAVEN_3_5_4_HOME=/home/jenkins/tools/maven/apache-maven-3.5.4

Mime
View raw message