openjpa-commits mailing list archives

Site index · List index
Message view « Date » · « Thread »
Top « Date » · « Thread »
From Apache Jenkins Server <jenk...@builds.apache.org>
Subject Build failed in Jenkins: OpenJPA-master #113
Date Thu, 07 May 2020 07:47:18 GMT
See <https://builds.apache.org/job/OpenJPA-master/113/display/redirect?page=changes>

Changes:

[rmannibucau] activating back seasar repo for uow-api now xbean had been downloaded on


------------------------------------------
[...truncated 29.03 KB...]
[INFO] 
[INFO] -------------------------------------------------------
[INFO]  T E S T S
[INFO] -------------------------------------------------------
[INFO] Running org.apache.openjpa.enhance.TestPCSubclassNameConversion
[INFO] Tests run: 1, Failures: 0, Errors: 0, Skipped: 0, Time elapsed: 0.088 s - in org.apache.openjpa.enhance.TestPCSubclassNameConversion
[INFO] Running org.apache.openjpa.enhance.TestGetDeclaredMethod
[INFO] Tests run: 3, Failures: 0, Errors: 0, Skipped: 0, Time elapsed: 0.02 s - in org.apache.openjpa.enhance.TestGetDeclaredMethod
[INFO] Running org.apache.openjpa.enhance.TestAsmAdaptor
[INFO] Tests run: 1, Failures: 0, Errors: 0, Skipped: 0, Time elapsed: 0.016 s - in org.apache.openjpa.enhance.TestAsmAdaptor
[INFO] Running org.apache.openjpa.ee.TestWASManagedRuntime
[INFO] Tests run: 1, Failures: 0, Errors: 0, Skipped: 0, Time elapsed: 0.003 s - in org.apache.openjpa.ee.TestWASManagedRuntime
[INFO] Running org.apache.openjpa.ee.TestOSGiManagedRuntime
[INFO] Tests run: 4, Failures: 0, Errors: 0, Skipped: 0, Time elapsed: 0.008 s - in org.apache.openjpa.ee.TestOSGiManagedRuntime
[INFO] Running org.apache.openjpa.util.TestProxyManager
[INFO] Tests run: 44, Failures: 0, Errors: 0, Skipped: 0, Time elapsed: 0.259 s - in org.apache.openjpa.util.TestProxyManager
[INFO] Running org.apache.openjpa.util.TestResultShape
[INFO] Tests run: 8, Failures: 0, Errors: 0, Skipped: 0, Time elapsed: 0.011 s - in org.apache.openjpa.util.TestResultShape
[INFO] Running org.apache.openjpa.meta.TestJavaTypes
[INFO] Tests run: 1, Failures: 0, Errors: 0, Skipped: 0, Time elapsed: 0.005 s - in org.apache.openjpa.meta.TestJavaTypes
[INFO] Running org.apache.openjpa.meta.TestMemberProvider
[INFO] Tests run: 2, Failures: 0, Errors: 0, Skipped: 0, Time elapsed: 0.08 s - in org.apache.openjpa.meta.TestMemberProvider
[INFO] Running org.apache.openjpa.meta.TestAccessCode
[INFO] Tests run: 8, Failures: 0, Errors: 0, Skipped: 0, Time elapsed: 0.006 s - in org.apache.openjpa.meta.TestAccessCode
[INFO] Running org.apache.openjpa.conf.TestSpecification
[INFO] Tests run: 3, Failures: 0, Errors: 0, Skipped: 0, Time elapsed: 0.002 s - in org.apache.openjpa.conf.TestSpecification
[INFO] 
[INFO] Results:
[INFO] 
[INFO] Tests run: 76, Failures: 0, Errors: 0, Skipped: 0
[INFO] 
[INFO] 
[INFO] --- maven-jar-plugin:3.1.0:jar (default-jar) @ openjpa-kernel ---
[INFO] Building jar: <https://builds.apache.org/job/OpenJPA-master/ws/openjpa-kernel/target/openjpa-kernel-3.1.2-SNAPSHOT.jar>
[INFO] 
[INFO] --- maven-site-plugin:3.7.1:attach-descriptor (attach-descriptor) @ openjpa-kernel
---
[INFO] Skipping because packaging 'jar' is not pom.
[INFO] 
[INFO] --- maven-jar-plugin:3.1.0:test-jar (attach-tests) @ openjpa-kernel ---
[INFO] Building jar: <https://builds.apache.org/job/OpenJPA-master/ws/openjpa-kernel/target/openjpa-kernel-3.1.2-SNAPSHOT-tests.jar>
[INFO] 
[INFO] --- apache-rat-plugin:0.12:check (default) @ openjpa-kernel ---
[INFO] Enabled default license matchers.
[INFO] Will parse SCM ignores for exclusions...
[INFO] Finished adding exclusions from SCM ignore files.
[INFO] 61 implicit excludes (use -debug for more details).
[INFO] Exclude: **/.*/**
[INFO] Exclude: **/target/**/*
[INFO] 543 resources included (use -debug for more details)
[INFO] Rat check: Summary over all files. Unapproved: 0, unknown: 0, generated: 0, approved:
543 licenses.
[INFO] 
[INFO] --- maven-install-plugin:2.5.2:install (default-install) @ openjpa-kernel ---
[INFO] Installing <https://builds.apache.org/job/OpenJPA-master/ws/openjpa-kernel/target/openjpa-kernel-3.1.2-SNAPSHOT.jar>
to /home/jenkins/.m2/repository/org/apache/openjpa/openjpa-kernel/3.1.2-SNAPSHOT/openjpa-kernel-3.1.2-SNAPSHOT.jar
[INFO] Installing <https://builds.apache.org/job/OpenJPA-master/ws/openjpa-kernel/pom.xml>
to /home/jenkins/.m2/repository/org/apache/openjpa/openjpa-kernel/3.1.2-SNAPSHOT/openjpa-kernel-3.1.2-SNAPSHOT.pom
[INFO] Installing <https://builds.apache.org/job/OpenJPA-master/ws/openjpa-kernel/target/openjpa-kernel-3.1.2-SNAPSHOT-tests.jar>
to /home/jenkins/.m2/repository/org/apache/openjpa/openjpa-kernel/3.1.2-SNAPSHOT/openjpa-kernel-3.1.2-SNAPSHOT-tests.jar
[INFO] 
[INFO] ------------------< org.apache.openjpa:openjpa-jdbc >-------------------
[INFO] Building OpenJPA JDBC 3.1.2-SNAPSHOT                              [4/31]
[INFO] --------------------------------[ jar ]---------------------------------
[INFO] 
[INFO] --- maven-clean-plugin:3.1.0:clean (default-clean) @ openjpa-jdbc ---
[INFO] Deleting <https://builds.apache.org/job/OpenJPA-master/ws/openjpa-jdbc/target>
[INFO] 
[INFO] --- buildnumber-maven-plugin:1.4:create (default) @ openjpa-jdbc ---
[INFO] 
[INFO] --- maven-enforcer-plugin:1.4.1:enforce (enforce-maven-version) @ openjpa-jdbc ---
[INFO] 
[INFO] --- maven-enforcer-plugin:1.4.1:enforce (default) @ openjpa-jdbc ---
[INFO] 
[INFO] --- maven-checkstyle-plugin:3.1.1:checkstyle (default) @ openjpa-jdbc ---
[INFO] Starting audit...
Audit done.
[WARNING] Unable to locate Source XRef to link to - DISABLED
[INFO] 
[INFO] --- maven-remote-resources-plugin:1.7.0:process (process-resource-bundles) @ openjpa-jdbc
---
[INFO] Preparing remote bundle org.apache:apache-jar-resource-bundle:1.4
[INFO] Copying 3 resources from 1 bundle.
[INFO] 
[INFO] --- maven-resources-plugin:3.1.0:resources (default-resources) @ openjpa-jdbc ---
[INFO] Using 'UTF-8' encoding to copy filtered resources.
[INFO] Copying 14 resources
[INFO] Copying 3 resources
[INFO] 
[INFO] --- maven-compiler-plugin:3.8.0:compile (default-compile) @ openjpa-jdbc ---
[INFO] Changes detected - recompiling the module!
[INFO] Compiling 364 source files to <https://builds.apache.org/job/OpenJPA-master/ws/openjpa-jdbc/target/classes>
[INFO] <https://builds.apache.org/job/OpenJPA-master/ws/openjpa-jdbc/src/main/java/org/apache/openjpa/jdbc/kernel/JDBCStoreQuery.java>:
Some input files use or override a deprecated API.
[INFO] <https://builds.apache.org/job/OpenJPA-master/ws/openjpa-jdbc/src/main/java/org/apache/openjpa/jdbc/kernel/JDBCStoreQuery.java>:
Recompile with -Xlint:deprecation for details.
[INFO] <https://builds.apache.org/job/OpenJPA-master/ws/openjpa-jdbc/src/main/java/org/apache/openjpa/jdbc/meta/strats/AbstractVersionStrategy.java>:
Some input files use unchecked or unsafe operations.
[INFO] <https://builds.apache.org/job/OpenJPA-master/ws/openjpa-jdbc/src/main/java/org/apache/openjpa/jdbc/meta/strats/AbstractVersionStrategy.java>:
Recompile with -Xlint:unchecked for details.
[INFO] 
[INFO] --- maven-compiler-plugin:3.8.0:testCompile (test-source-compile) @ openjpa-jdbc ---
[INFO] Changes detected - recompiling the module!
[INFO] Compiling 10 source files to <https://builds.apache.org/job/OpenJPA-master/ws/openjpa-jdbc/target/test-classes>
[INFO] <https://builds.apache.org/job/OpenJPA-master/ws/openjpa-jdbc/src/test/java/org/apache/openjpa/jdbc/sql/TestBooleanRepresentation.java>:
Some input files use or override a deprecated API.
[INFO] <https://builds.apache.org/job/OpenJPA-master/ws/openjpa-jdbc/src/test/java/org/apache/openjpa/jdbc/sql/TestBooleanRepresentation.java>:
Recompile with -Xlint:deprecation for details.
[INFO] <https://builds.apache.org/job/OpenJPA-master/ws/openjpa-jdbc/src/test/java/org/apache/openjpa/jdbc/kernel/TestUpdateManagerFlushException.java>:
Some input files use unchecked or unsafe operations.
[INFO] <https://builds.apache.org/job/OpenJPA-master/ws/openjpa-jdbc/src/test/java/org/apache/openjpa/jdbc/kernel/TestUpdateManagerFlushException.java>:
Recompile with -Xlint:unchecked for details.
[INFO] 
[INFO] --- maven-resources-plugin:3.1.0:testResources (default-testResources) @ openjpa-jdbc
---
[INFO] Using 'UTF-8' encoding to copy filtered resources.
[INFO] skip non existing resourceDirectory <https://builds.apache.org/job/OpenJPA-master/ws/openjpa-jdbc/src/test/resources>
[INFO] Copying 3 resources
[INFO] 
[INFO] --- maven-compiler-plugin:3.8.0:testCompile (default-testCompile) @ openjpa-jdbc ---
[INFO] Changes detected - recompiling the module!
[INFO] Compiling 10 source files to <https://builds.apache.org/job/OpenJPA-master/ws/openjpa-jdbc/target/test-classes>
[INFO] <https://builds.apache.org/job/OpenJPA-master/ws/openjpa-jdbc/src/test/java/org/apache/openjpa/jdbc/sql/TestBooleanRepresentation.java>:
Some input files use or override a deprecated API.
[INFO] <https://builds.apache.org/job/OpenJPA-master/ws/openjpa-jdbc/src/test/java/org/apache/openjpa/jdbc/sql/TestBooleanRepresentation.java>:
Recompile with -Xlint:deprecation for details.
[INFO] <https://builds.apache.org/job/OpenJPA-master/ws/openjpa-jdbc/src/test/java/org/apache/openjpa/jdbc/kernel/TestUpdateManagerFlushException.java>:
Some input files use unchecked or unsafe operations.
[INFO] <https://builds.apache.org/job/OpenJPA-master/ws/openjpa-jdbc/src/test/java/org/apache/openjpa/jdbc/kernel/TestUpdateManagerFlushException.java>:
Recompile with -Xlint:unchecked for details.
[INFO] 
[INFO] --- maven-surefire-plugin:3.0.0-M4:test (default-test) @ openjpa-jdbc ---
[INFO] 
[INFO] -------------------------------------------------------
[INFO]  T E S T S
[INFO] -------------------------------------------------------
[INFO] Running org.apache.openjpa.jdbc.sql.TestBooleanRepresentation
[INFO] Tests run: 1, Failures: 0, Errors: 0, Skipped: 0, Time elapsed: 0.113 s - in org.apache.openjpa.jdbc.sql.TestBooleanRepresentation
[INFO] Running org.apache.openjpa.jdbc.sql.identifier.TestDBIdentifiers
[INFO] Tests run: 5, Failures: 0, Errors: 0, Skipped: 0, Time elapsed: 0.024 s - in org.apache.openjpa.jdbc.sql.identifier.TestDBIdentifiers
[INFO] Running org.apache.openjpa.jdbc.sql.TestDBDictionary
[INFO] Tests run: 1, Failures: 0, Errors: 0, Skipped: 0, Time elapsed: 0.022 s - in org.apache.openjpa.jdbc.sql.TestDBDictionary
[INFO] Running org.apache.openjpa.jdbc.sql.TestDB2Dictionary
[INFO] Tests run: 5, Failures: 0, Errors: 0, Skipped: 0, Time elapsed: 0.221 s - in org.apache.openjpa.jdbc.sql.TestDB2Dictionary
[INFO] Running org.apache.openjpa.jdbc.sql.TestDictionaryFactory
[INFO] Tests run: 1, Failures: 0, Errors: 0, Skipped: 0, Time elapsed: 0.005 s - in org.apache.openjpa.jdbc.sql.TestDictionaryFactory
[INFO] Running org.apache.openjpa.jdbc.sql.TestMySQLDictionary
[INFO] Tests run: 3, Failures: 0, Errors: 0, Skipped: 0, Time elapsed: 0.074 s - in org.apache.openjpa.jdbc.sql.TestMySQLDictionary
[INFO] Running org.apache.openjpa.jdbc.sql.TestDBDictionaryGeneratedSQL
[INFO] Tests run: 5, Failures: 0, Errors: 0, Skipped: 0, Time elapsed: 0.031 s - in org.apache.openjpa.jdbc.sql.TestDBDictionaryGeneratedSQL
[INFO] Running org.apache.openjpa.jdbc.meta.TestMappingDefaultsImpl
[ERROR] Tests run: 1, Failures: 1, Errors: 0, Skipped: 0, Time elapsed: 0.154 s <<<
FAILURE! - in org.apache.openjpa.jdbc.meta.TestMappingDefaultsImpl
[ERROR] org.apache.openjpa.jdbc.meta.TestMappingDefaultsImpl.testPopulateWithLongColumnNames
 Time elapsed: 0.153 s  <<< FAILURE!
java.lang.AssertionError: column names are conflicted : LONGNAMELONGNAMELONGNAMELONGNA
	at org.junit.Assert.fail(Assert.java:88)
	at org.junit.Assert.assertTrue(Assert.java:41)
	at org.junit.Assert.assertFalse(Assert.java:64)
	at org.apache.openjpa.jdbc.meta.TestMappingDefaultsImpl.testPopulateWithLongColumnNames(TestMappingDefaultsImpl.java:55)
	at sun.reflect.NativeMethodAccessorImpl.invoke0(Native Method)
	at sun.reflect.NativeMethodAccessorImpl.invoke(NativeMethodAccessorImpl.java:62)
	at sun.reflect.DelegatingMethodAccessorImpl.invoke(DelegatingMethodAccessorImpl.java:43)
	at java.lang.reflect.Method.invoke(Method.java:498)
	at org.junit.runners.model.FrameworkMethod$1.runReflectiveCall(FrameworkMethod.java:50)
	at org.junit.internal.runners.model.ReflectiveCallable.run(ReflectiveCallable.java:12)
	at org.junit.runners.model.FrameworkMethod.invokeExplosively(FrameworkMethod.java:47)
	at org.junit.internal.runners.statements.InvokeMethod.evaluate(InvokeMethod.java:17)
	at org.junit.runners.ParentRunner.runLeaf(ParentRunner.java:325)
	at org.junit.runners.BlockJUnit4ClassRunner.runChild(BlockJUnit4ClassRunner.java:78)
	at org.junit.runners.BlockJUnit4ClassRunner.runChild(BlockJUnit4ClassRunner.java:57)
	at org.junit.runners.ParentRunner$3.run(ParentRunner.java:290)
	at org.junit.runners.ParentRunner$1.schedule(ParentRunner.java:71)
	at org.junit.runners.ParentRunner.runChildren(ParentRunner.java:288)
	at org.junit.runners.ParentRunner.access$000(ParentRunner.java:58)
	at org.junit.runners.ParentRunner$2.evaluate(ParentRunner.java:268)
	at org.junit.runners.ParentRunner.run(ParentRunner.java:363)
	at org.apache.maven.surefire.junit4.JUnit4Provider.execute(JUnit4Provider.java:365)
	at org.apache.maven.surefire.junit4.JUnit4Provider.executeWithRerun(JUnit4Provider.java:273)
	at org.apache.maven.surefire.junit4.JUnit4Provider.executeTestSet(JUnit4Provider.java:238)
	at org.apache.maven.surefire.junit4.JUnit4Provider.invoke(JUnit4Provider.java:159)
	at org.apache.maven.surefire.booter.ForkedBooter.runSuitesInProcess(ForkedBooter.java:377)
	at org.apache.maven.surefire.booter.ForkedBooter.execute(ForkedBooter.java:138)
	at org.apache.maven.surefire.booter.ForkedBooter.run(ForkedBooter.java:465)
	at org.apache.maven.surefire.booter.ForkedBooter.main(ForkedBooter.java:451)

[INFO] Running org.apache.openjpa.jdbc.kernel.TestSQLStoreParamsSubstitution
[INFO] Tests run: 1, Failures: 0, Errors: 0, Skipped: 0, Time elapsed: 0.002 s - in org.apache.openjpa.jdbc.kernel.TestSQLStoreParamsSubstitution
[INFO] Running org.apache.openjpa.jdbc.kernel.TestUpdateManagerFlushException
[INFO] Tests run: 1, Failures: 0, Errors: 0, Skipped: 0, Time elapsed: 0.047 s - in org.apache.openjpa.jdbc.kernel.TestUpdateManagerFlushException
[INFO] 
[INFO] Results:
[INFO] 
[ERROR] Failures: 
[ERROR]   TestMappingDefaultsImpl.testPopulateWithLongColumnNames:55 column names are conflicted
: LONGNAMELONGNAMELONGNAMELONGNA
[INFO] 
[ERROR] Tests run: 24, Failures: 1, Errors: 0, Skipped: 0
[INFO] 
[INFO] ------------------------------------------------------------------------
[INFO] Reactor Summary:
[INFO] 
[INFO] OpenJPA Parent POM 3.1.2-SNAPSHOT .................. SUCCESS [  4.294 s]
[INFO] OpenJPA Utilities Library .......................... SUCCESS [ 11.654 s]
[INFO] OpenJPA Kernel ..................................... SUCCESS [ 13.994 s]
[INFO] OpenJPA JDBC ....................................... FAILURE [  9.396 s]
[INFO] OpenJPA Persistence ................................ SKIPPED
[INFO] OpenJPA Persistence JDBC ........................... SKIPPED
[INFO] OpenJPA Persistence Locking Tests .................. SKIPPED
[INFO] OpenJPA tools ...................................... SKIPPED
[INFO] OpenJPA Maven Plugin ............................... SKIPPED
[INFO] OpenJPA XML Store .................................. SKIPPED
[INFO] OpenJPA Slice ...................................... SKIPPED
[INFO] OpenJPA JEST ....................................... SKIPPED
[INFO] OpenJPA Kubernetes ................................. SKIPPED
[INFO] OpenJPA Aggregate Jar .............................. SKIPPED
[INFO] OpenJPA Aggregate Jar with Dependencies ............ SKIPPED
[INFO] OpenJPA Project Docs and Assemblies ................ SKIPPED
[INFO] OpenJPA Examples ................................... SKIPPED
[INFO] OpenJPA Examples - Simple .......................... SKIPPED
[INFO] OpenJPA Examples - image-gallery ................... SKIPPED
[INFO] OpenJPA Examples - OpenBooks ....................... SKIPPED
[INFO] OpenJPA Integration Tests .......................... SKIPPED
[INFO] OpenJPA Integration Tests - Daytrader .............. SKIPPED
[INFO] OpenJPA Integration Tests - Examples ............... SKIPPED
[INFO] OpenJPA Integration Tests - SLF4JLogFactory ........ SKIPPED
[INFO] OpenJPA Integration Tests - JPA TCK ................ SKIPPED
[INFO] OpenJPA Integration Tests - Bean Validation ........ SKIPPED
[INFO] OpenJPA Integration Tests - JMX Platform MBeans .... SKIPPED
[INFO] OpenJPA Fetching Statistic Tool .................... SKIPPED
[INFO] OpenJPA Fetching Statistic Tool -- WAS Bundle ...... SKIPPED
[INFO] OpenJPA Features ................................... SKIPPED
[INFO] OpenJPA JUnit 5 3.1.2-SNAPSHOT ..................... SKIPPED
[INFO] ------------------------------------------------------------------------
[INFO] BUILD FAILURE
[INFO] ------------------------------------------------------------------------
[INFO] Total time: 40.688 s
[INFO] Finished at: 2020-05-07T07:47:14Z
[INFO] ------------------------------------------------------------------------
[ERROR] Failed to execute goal org.apache.maven.plugins:maven-surefire-plugin:3.0.0-M4:test
(default-test) on project openjpa-jdbc: There are test failures.
[ERROR] 
[ERROR] Please refer to <https://builds.apache.org/job/OpenJPA-master/ws/openjpa-jdbc/target/surefire-reports>
for the individual test results.
[ERROR] Please refer to dump files (if any exist) [date].dump, [date]-jvmRun[N].dump and [date].dumpstream.
[ERROR] -> [Help 1]
[ERROR] 
[ERROR] To see the full stack trace of the errors, re-run Maven with the -e switch.
[ERROR] Re-run Maven using the -X switch to enable full debug logging.
[ERROR] 
[ERROR] For more information about the errors and possible solutions, please read the following
articles:
[ERROR] [Help 1] http://cwiki.apache.org/confluence/display/MAVEN/MojoFailureException
[ERROR] 
[ERROR] After correcting the problems, you can resume the build with the command
[ERROR]   mvn <goals> -rf :openjpa-jdbc
Build step 'Execute shell' marked build as failure
Archiving artifacts
Setting ANT_1_9_7_HOME=/home/jenkins/tools/ant/apache-ant-1.9.7
Setting JDK_1_8_LATEST__HOME=/home/jenkins/tools/java/latest1.8
Setting MAVEN_3_3_9_HOME=/home/jenkins/tools/maven/apache-maven-3.3.9
ERROR: No tool found matching MAVEN_3_3_3_HOME
Setting MAVEN_3_5_4_HOME=/home/jenkins/tools/maven/apache-maven-3.5.4
Recording test results
Setting ANT_1_9_7_HOME=/home/jenkins/tools/ant/apache-ant-1.9.7
Setting JDK_1_8_LATEST__HOME=/home/jenkins/tools/java/latest1.8
Setting MAVEN_3_3_9_HOME=/home/jenkins/tools/maven/apache-maven-3.3.9
ERROR: No tool found matching MAVEN_3_3_3_HOME
Setting MAVEN_3_5_4_HOME=/home/jenkins/tools/maven/apache-maven-3.5.4
Setting ANT_1_9_7_HOME=/home/jenkins/tools/ant/apache-ant-1.9.7
Setting JDK_1_8_LATEST__HOME=/home/jenkins/tools/java/latest1.8
Setting MAVEN_3_3_9_HOME=/home/jenkins/tools/maven/apache-maven-3.3.9
ERROR: No tool found matching MAVEN_3_3_3_HOME
Setting MAVEN_3_5_4_HOME=/home/jenkins/tools/maven/apache-maven-3.5.4

Mime
View raw message