poi-dev mailing list archives

Site index · List index
Message view « Date » · « Thread »
Top « Date » · « Thread »
From Apache Jenkins Server <jenk...@builds.apache.org>
Subject Build failed in Jenkins: POI-DSL-API-Check #428
Date Wed, 13 Nov 2019 23:57:39 GMT
See <https://builds.apache.org/job/POI-DSL-API-Check/428/display/redirect?page=changes>

Changes:

[kiwiwings] Update sonar links

[kiwiwings] replace withCredentials with credentialBindings


------------------------------------------
[...truncated 379.26 KB...]
AU        src/documentation/resources/images/POIFSLifeCycle.gif
AU        src/documentation/resources/images/logoAdria1.png
AU        src/documentation/resources/images/logoAdria2.png
AU        src/documentation/resources/images/logoAdria3.png
AU        src/documentation/resources/images/remove.jpg
AU        src/documentation/resources/images/logoKarmokar3s.png
AU        src/documentation/resources/images/logoGlenStampoutlzis.png
AU        src/documentation/resources/images/logoKarmokar1.png
AU        src/documentation/resources/images/POIFSInitialization.gif
AU        src/documentation/resources/images/logoKarmokar2.png
AU        src/documentation/resources/images/logoRaPiGmbH10.png
AU        src/documentation/resources/images/logoKarmokar3.png
AU        src/documentation/resources/images/logoRaPiGmbH11.png
AU        src/documentation/resources/images/logoMichaelMosmann.png
AU        src/documentation/resources/images/logoKarmokar4.png
AU        src/documentation/resources/images/logoRaPiGmbH12.png
AU        src/documentation/resources/images/logoKarmokar5.png
AU        src/documentation/resources/images/logoKarmokar6.png
AU        src/documentation/resources/images/ApacheConEu08.jpg
AU        src/documentation/resources/images/BlockClassDiagram.gif
AU        src/documentation/resources/images/calculatePayment.jpg
AU        src/documentation/resources/images/PropertyTableClassDiagram.gif
AU        src/documentation/resources/images/logoRussellBeattie1.png
AU        src/documentation/resources/images/logoRussellBeattie2.png
AU        src/documentation/resources/images/logoRussellBeattie3.png
A         src/documentation/resources/schema
A         src/documentation/resources/schema/catalog.xcat
AU        src/documentation/resources/schema/changes-poi.dtd
AU        src/documentation/resources/schema/changes-poi.mod
A         src/documentation/sitemap.xmap
AU        src/documentation/skinconf.xml
AU        src/documentation/release-guide.txt
A         src/documentation/cli.xconf
AU        src/documentation/RELEASE-NOTES.txt
AU        src/documentation/README.txt
A         src/documentation/classes
A         src/documentation/classes/CatalogManager.properties
At revision 1869772


<-- Got one external: forrest.properties, svn url: https://svn.apache.org/repos/asf/poi/site/forrest.properties
-->
Fetching 'https://svn.apache.org/repos/asf/poi/site/forrest.properties' at -1 into '<https://builds.apache.org/job/POI-DSL-API-Check/ws/forrest.properties'>
A         forrest.properties
At revision 1869772

At revision 1869772

No changes for https://svn.apache.org/repos/asf/poi/site/src/documentation since the previous
build
No changes for https://svn.apache.org/repos/asf/poi/site/forrest.properties since the previous
build
[POI-DSL-API-Check] $ /bin/bash -xe /tmp/jenkins8759847883506933679.sh
+ svn status
    X   forrest.properties
X       src/documentation

Performing status on external item at 'src/documentation':
+ echo Java-Home: /home/jenkins/tools/java/latest1.8
Java-Home: /home/jenkins/tools/java/latest1.8
+ ls -al /home/jenkins/tools/java/latest1.8/
total 26000
drwxr-xr-x  7 root root     4096 Oct  3 18:32 .
drwxr-xr-x 27 root root     4096 Oct 13 18:29 ..
drwxr-xr-x  2 root root     4096 Oct  3 18:32 bin
-r--r--r--  1 root root     3244 Oct  6  2018 COPYRIGHT
drwxr-xr-x  3 root root     4096 Oct  3 18:32 include
-rw-r--r--  1 root root  5207154 Sep 12  2018 javafx-src.zip
drwxr-xr-x  5 root root     4096 Oct  3 18:32 jre
drwxr-xr-x  5 root root     4096 Oct  3 18:32 lib
-r--r--r--  1 root root       40 Oct  6  2018 LICENSE
drwxr-xr-x  4 root root     4096 Oct  3 18:32 man
-r--r--r--  1 root root      159 Oct  6  2018 README.html
-rw-r--r--  1 root root      424 Oct  6  2018 release
-rw-r--r--  1 root root 21101479 Oct  6  2018 src.zip
-rw-r--r--  1 root root   108062 Sep 12  2018 THIRDPARTYLICENSEREADME-JAVAFX.txt
-r--r--r--  1 root root   155003 Oct  6  2018 THIRDPARTYLICENSEREADME.txt
+ ls -al /home/jenkins/tools/java/latest1.8/bin
total 904
drwxr-xr-x 2 root root   4096 Oct  3 18:32 .
drwxr-xr-x 7 root root   4096 Oct  3 18:32 ..
-rwxr-xr-x 1 root root   8592 Oct  6  2018 appletviewer
lrwxrwxrwx 1 root root      8 Oct  6  2018 ControlPanel -> jcontrol
-rwxr-xr-x 1 root root   8584 Oct  6  2018 extcheck
-rwxr-xr-x 1 root root   8584 Oct  6  2018 idlj
-rwxr-xr-x 1 root root   8584 Oct  6  2018 jar
-rwxr-xr-x 1 root root   8584 Oct  6  2018 jarsigner
-rwxr-xr-x 1 root root   8464 Oct  6  2018 java
-rwxr-xr-x 1 root root   8584 Oct  6  2018 javac
-rwxr-xr-x 1 root root   8584 Oct  6  2018 javadoc
-rwxr-xr-x 1 root root   2293 Sep 12  2018 javafxpackager
-rwxr-xr-x 1 root root   8584 Oct  6  2018 javah
-rwxr-xr-x 1 root root   8584 Oct  6  2018 javap
-rwxr-xr-x 1 root root   2293 Sep 12  2018 javapackager
-rwxr-xr-x 1 root root   1809 Oct  6  2018 java-rmi.cgi
-rwxr-xr-x 1 root root 140248 Oct  6  2018 javaws
-rwxr-xr-x 1 root root   8584 Oct  6  2018 jcmd
-rwxr-xr-x 1 root root   8608 Oct  6  2018 jconsole
-rwxr-xr-x 1 root root   6264 Oct  6  2018 jcontrol
-rwxr-xr-x 1 root root   8600 Oct  6  2018 jdb
-rwxr-xr-x 1 root root   8584 Oct  6  2018 jdeps
-rwxr-xr-x 1 root root   8584 Oct  6  2018 jhat
-rwxr-xr-x 1 root root   8648 Oct  6  2018 jinfo
-rwxr-xr-x 1 root root   8584 Oct  6  2018 jjs
-rwxr-xr-x 1 root root   8648 Oct  6  2018 jmap
-rwxr-xr-x 1 root root  74675 Dec  8  2017 jmc
-rwxr-xr-x 1 root root    402 Dec  8  2017 jmc.ini
-rwxr-xr-x 1 root root   8584 Oct  6  2018 jps
-rwxr-xr-x 1 root root   8592 Oct  6  2018 jrunscript
-rwxr-xr-x 1 root root   8600 Oct  6  2018 jsadebugd
-rwxr-xr-x 1 root root   8648 Oct  6  2018 jstack
-rwxr-xr-x 1 root root   8584 Oct  6  2018 jstat
-rwxr-xr-x 1 root root   8584 Oct  6  2018 jstatd
-rwxr-xr-x 1 root root   5110 Jan 14  2017 jvisualvm
-rwxr-xr-x 1 root root   8584 Oct  6  2018 keytool
-rwxr-xr-x 1 root root   8592 Oct  6  2018 native2ascii
-rwxr-xr-x 1 root root   8656 Oct  6  2018 orbd
-rwxr-xr-x 1 root root   8584 Oct  6  2018 pack200
-rwxr-xr-x 1 root root   8592 Oct  6  2018 policytool
-rwxr-xr-x 1 root root   8584 Oct  6  2018 rmic
-rwxr-xr-x 1 root root   8584 Oct  6  2018 rmid
-rwxr-xr-x 1 root root   8592 Oct  6  2018 rmiregistry
-rwxr-xr-x 1 root root   8584 Oct  6  2018 schemagen
-rwxr-xr-x 1 root root   8584 Oct  6  2018 serialver
-rwxr-xr-x 1 root root   8592 Oct  6  2018 servertool
-rwxr-xr-x 1 root root   8656 Oct  6  2018 tnameserv
-rwxr-xr-x 1 root root 182536 Oct  6  2018 unpack200
-rwxr-xr-x 1 root root   8584 Oct  6  2018 wsgen
-rwxr-xr-x 1 root root   8584 Oct  6  2018 wsimport
-rwxr-xr-x 1 root root   8584 Oct  6  2018 xjc
+ /home/jenkins/tools/java/latest1.8/bin/java -version
java version "1.8.0_191"
Java(TM) SE Runtime Environment (build 1.8.0_191-b12)
Java HotSpot(TM) 64-Bit Server VM (build 25.191-b12, mixed mode)
+ echo which java
which java
+ which java
/home/jenkins/tools/java/latest1.8/bin/java
+ java -version
java version "1.8.0_191"
Java(TM) SE Runtime Environment (build 1.8.0_191-b12)
Java HotSpot(TM) 64-Bit Server VM (build 25.191-b12, mixed mode)
+ echo which javac
which javac
+ which javac
/home/jenkins/tools/java/latest1.8/bin/javac
+ javac -version
javac 1.8.0_191
+ echo Ant-Home:
Ant-Home:
+ ls -al
total 464
drwxr-xr-x  15 jenkins jenkins   4096 Nov 13 23:57 .
drwxr-xr-x 284 jenkins jenkins  20480 Nov 13 23:55 ..
-rw-r--r--   1 jenkins jenkins  11175 Nov 13 23:55 build.gradle
-rw-r--r--   1 jenkins jenkins 142582 Nov 13 23:56 build.xml
-rw-r--r--   1 jenkins jenkins   3279 Nov 13 23:56 .classpath
drwxr-xr-x   2 jenkins jenkins   4096 Nov 13 23:56 compile-lib
-rw-r--r--   1 jenkins jenkins   5987 Nov 13 23:56 doap_POI.rdf
-rw-r--r--   1 jenkins jenkins   2596 Nov 13 23:56 file-leak-detector.exclude
-rw-r--r--   1 jenkins jenkins   6229 Nov 13 23:57 forrest.properties
-rw-r--r--   1 jenkins jenkins     53 Nov 13 23:56 .gitattributes
-rw-r--r--   1 jenkins jenkins    493 Nov 13 23:56 .gitignore
drwxr-xr-x   3 jenkins jenkins   4096 Nov 13 23:56 gradle
-rwxr-xr-x   1 jenkins jenkins   5917 Nov 13 23:56 gradlew
-rw-r--r--   1 jenkins jenkins   2842 Nov 13 23:56 gradlew.bat
drwxr-xr-x   2 jenkins jenkins   4096 Nov 13 23:55 jenkins
-rw-r--r--   1 jenkins jenkins 166411 Nov 13 23:56 KEYS
drwxr-xr-x   2 jenkins jenkins   4096 Nov 13 23:56 legal
drwxr-xr-x   2 jenkins jenkins   4096 Nov 13 23:56 lib
drwxr-xr-x   2 jenkins jenkins   4096 Nov 13 23:56 maven
drwxr-xr-x   2 jenkins jenkins   4096 Nov 13 23:56 ooxml-lib
drwxr-xr-x   4 jenkins jenkins   4096 Nov 13 23:56 osgi
-rw-r--r--   1 jenkins jenkins   4813 Nov 13 23:56 patch.xml
-rw-r--r--   1 jenkins jenkins    426 Nov 13 23:56 .project
-rw-r--r--   1 jenkins jenkins   4280 Nov 13 23:56 README.rst
drwxr-xr-x   2 jenkins jenkins   4096 Nov 13 23:56 .settings
-rw-r--r--   1 jenkins jenkins    556 Nov 13 23:56 settings.gradle
drwxr-xr-x  10 jenkins jenkins   4096 Nov 13 23:56 sonar
drwxr-xr-x  15 jenkins jenkins   4096 Nov 13 23:57 src
drwxr-xr-x   4 jenkins jenkins   4096 Nov 13 23:57 .svn
drwxr-xr-x  14 jenkins jenkins   4096 Nov 13 23:56 test-data
-rw-r--r--   1 jenkins jenkins    136 Nov 13 23:56 .travis.yml
+ echo which ant
which ant
+ which ant
/usr/bin/ant
+ ant -version
Apache Ant(TM) version 1.10.5 compiled on March 28 2019
+ echo '<project default="test"><target name="test"><echo>Java ${ant.java.version}/${java.version}</echo><exec
executable="javac"><arg value="-version"/></exec></target></project>'
+ ant -f build.javacheck.xml -v
Apache Ant(TM) version 1.10.5 compiled on March 28 2019
Buildfile: <https://builds.apache.org/job/POI-DSL-API-Check/ws/build.javacheck.xml>
Detected Java version: 1.8 in: /usr/local/asfpackages/java/jdk1.8.0_191/jre
Detected OS: Linux
parsing buildfile <https://builds.apache.org/job/POI-DSL-API-Check/ws/build.javacheck.xml>
with URI = <https://builds.apache.org/job/POI-DSL-API-Check/ws/build.javacheck.xml>
Project base dir set to: <https://builds.apache.org/job/POI-DSL-API-Check/ws/>
Build sequence for target(s) `test' is [test]
Complete build sequence is [test, ]

test:
parsing buildfile jar:file:/usr/share/ant/lib/ant.jar!/org/apache/tools/ant/antlib.xml with
URI = jar:file:/usr/share/ant/lib/ant.jar!/org/apache/tools/ant/antlib.xml from a zip file
     [echo] Java 1.8/1.8.0_191
     [exec] Current OS is Linux
     [exec] Executing 'javac' with arguments:
     [exec] '-version'
     [exec] 
     [exec] The ' characters around the executable and arguments are
     [exec] not part of the command.
     [exec] javac 1.8.0_191

BUILD SUCCESSFUL
Total time: 0 seconds
+ exit 0
[Gradle] - Launching build.
[POI-DSL-API-Check] $ <https://builds.apache.org/job/POI-DSL-API-Check/ws/gradlew> japicmp
Downloading https://services.gradle.org/distributions/gradle-5.5.1-bin.zip
.....................................................................................

Welcome to Gradle 5.5.1!

Here are the highlights of this release:
 - Kickstart Gradle plugin development with gradle init
 - Distribute organization-wide Gradle properties in custom Gradle distributions
 - Transform dependency artifacts on resolution

For more details see https://docs.gradle.org/5.5.1/release-notes.html

To honour the JVM settings for this build a new JVM will be forked. Please consider using
the daemon: https://docs.gradle.org/5.5.1/userguide/gradle_daemon.html.
Daemon will be stopped at the end of the build stopping after processing

> Configure project :
Trying to override old definition of datatype junit

FAILURE: Build failed with an exception.

* Where:
Build file '<https://builds.apache.org/job/POI-DSL-API-Check/ws/build.gradle'> line:
163

* What went wrong:
A problem occurred evaluating root project 'poi'.
> Could not get unknown property 'me' for project ':examples' of type org.gradle.api.Project.

* Try:
Run with --stacktrace option to get the stack trace. Run with --info or --debug option to
get more log output. Run with --scan to get full insights.

* Get more help at https://help.gradle.org

BUILD FAILED in 24s
Build step 'Invoke Gradle script' changed build result to FAILURE
Build step 'Invoke Gradle script' marked build as failure
Archiving artifacts

---------------------------------------------------------------------
To unsubscribe, e-mail: dev-unsubscribe@poi.apache.org
For additional commands, e-mail: dev-help@poi.apache.org


Mime
View raw message