qpid-dev mailing list archives

Site index · List index
Message view « Date » · « Thread »
Top « Date » · « Thread »
From Rajith Attapattu <rajit...@gmail.com>
Subject Re: [Fwd: [ptol] qpid-java-cpp test failed on el5-64]
Date Tue, 18 Aug 2009 15:44:11 GMT
I have already added this test to the 010Excludes file as this test is
for the java broker.

Regards,

Rajith

On Tue, Aug 18, 2009 at 11:26 AM, Rafael Schloming<rafaels@redhat.com> wrote:
> Looks like the cpp profiles are failing as well.
>
> --Rafael
>
>
> Cycle
>
>  Status      test failed
>  Server      el5-64
>  Project     qpid-java-cpp
>  Revision    -
>  Start time  2009-08-17 00:12:41 EDT
>  End time    2009-08-17 00:26:12 EDT
>  URL         http://mrg18.lab.bos.redhat.com:2765/qpid-java-cpp/640
>
> Changes
>
>  r804768     robbie
>  r804781     robbie
>  r804811     ritchiem
>  r804813     ritchiem
>  r804814     ritchiem
>
> Output
>
>  [http://mrg18.lab.bos.redhat.com:2765/qpid-java-cpp/640/test.out.gz]
>
>  [snip]
>
>  jar.nomanifest:
>
>  jar:
>
>  precompile-tests:
>
>  compile-tests:
>
>  jar-tests:
>
>  libs:
>
>  copy-bin:
>
>  copy-etc:
>
>  postbuild:
>
>  build:
>
>  test:
>       [echo] Running ant for module : integrationtests
>
>  prepare:
>
>  precompile:
>
>  compile:
>       [echo] Targeting : 1.5
>
>  jar.manifest:
>
>  jar.nomanifest:
>
>  jar:
>
>  precompile-tests:
>
>  compile-tests:
>
>  jar-tests:
>
>  libs:
>
>  copy-bin:
>
>  copy-etc:
>
>  postbuild:
>
>  build:
>
>  test:
>       [echo] Running ant for module : testkit
>
>  prepare:
>
>  precompile:
>
>  compile:
>       [echo] Targeting : 1.5
>
>  jar.manifest:
>
>  jar.nomanifest:
>
>  jar:
>
>  precompile-tests:
>
>  compile-tests:
>
>  jar-tests:
>
>  libs:
>
>  copy-bin:
>
>  copy-etc:
>
>  postbuild:
>
>  build:
>
>  test:
>
>  BUILD FAILED
>  /var/lib/ptolemy/sources/qpid/java/build.xml:85: TEST SUITE FAILED
>
>  Total time: 13 minutes 19 seconds
>  00:26:01,202 INFO  [log] Shutdown hook executing
>  00:26:01,202 INFO  [log] Shutdown hook complete
>  + local code=1
>  ++ broker-pids
>  ++ set +x
>  + local bpids=
>  + [[ -n '' ]]
>  + [[ 1 != 0 ]]
>  + echo '== profile '\''cpp'\'' =='
>  == profile 'cpp' ==
>  + print-failures /tmp/tmp.itSie23236/cpp.out
>  + set +x
>  Testsuite: org.apache.qpid.server.BrokerStartupTest
>  Tests run: 1, Failures: 0, Errors: 1, Time elapsed: 0.009 sec
>
>  Testcase: testInvalidLog4jConfigurationFile took 0.003 sec
>        Caused an ERROR
>  String index out of range: -1
>  java.lang.StringIndexOutOfBoundsException: String index out of range: -1
>        at java.lang.String.substring(String.java:1938)
>        at
> org.apache.qpid.server.BrokerStartupTest.testInvalidLog4jConfigurationFile(BrokerStartupTest.java:76)
>        at
> org.apache.qpid.test.utils.QpidTestCase.runBare(QpidTestCase.java:224)
>        at org.apache.qpid.test.utils.QpidTestCase.run(QpidTestCase.java:270)
>
>  --
>  + save-results cpp
>  + tar -czf /var/lib/ptolemy/cycles/qpid-java-cpp/640/results.tgz --exclude
> '*.xml' -C build results
>  + ant clean-results
>  Buildfile: build.xml
>
>  clean-results:
>     [delete] Deleting directory
> /var/lib/ptolemy/sources/qpid/java/build/results
>
>  BUILD SUCCESSFUL
>  Total time: 0 seconds
>  + rm -rf /tmp/tmp.itSie23236
>  + return 1
>
>
>
> ---------------------------------------------------------------------
> Apache Qpid - AMQP Messaging Implementation
> Project:      http://qpid.apache.org
> Use/Interact: mailto:dev-subscribe@qpid.apache.org
>

---------------------------------------------------------------------
Apache Qpid - AMQP Messaging Implementation
Project:      http://qpid.apache.org
Use/Interact: mailto:dev-subscribe@qpid.apache.org


Mime
View raw message