qpid-dev mailing list archives

Site index · List index
Message view « Date » · « Thread »
Top « Date » · « Thread »
From Jafar Honarmand <Jafar.Honarm...@dreamworks.com>
Subject qpiqd build error
Date Tue, 08 Nov 2011 20:18:48 GMT
Hi,

I'm trying to build qpid-0.10 on RHEL5 and get an error message, 
apparently due to missing a host entry in *amqp-0-10-qpid-errata.xml.  
*I'm not familiar with qpid and odn't know much about xml.  I have no 
idea where I'm missing a host or even what command is spitting this 
error! If you please give me a hint on the issue.

Advanced thanks,

jafar honarmand


running install
running build
running build_py
running build_scripts
running build_doc
epydoc qpid.messaging to build/doc
running install_lib
caching 
*/work/proddev/jhonarmand/cm-third-party_current/qpid/builds/qpid/0.10-19/debug-ws5-x86_64-gccWS5_64/qpid-cpp-mrg-0.10/cpp/src/tests/python/qpid/specs/amqp-0-10-qpid-errata.xml

to amqp-0-10-qpid-errata.pcl
error: no host given*
make[2]: *** [python_prep] Error 1
make[2]: Leaving directory 
`/work/proddev/jhonarmand/cm-third-party_current/qpid/builds/qpid/0.10-19/debug-ws5-x86_64-gccWS5_64/qpid-cpp-mrg-0.10/cpp/src/tests'
make[1]: *** [install-recursive] Error 1
make[1]: Leaving directory 
`/work/proddev/jhonarmand/cm-third-party_current/qpid/builds/qpid/0.10-19/debug-ws5-x86_64-gccWS5_64/qpid-cpp-mrg-0.10/cpp/src'
make: *** [install-recursive] Error 1



Mime
  • Unnamed multipart/alternative (inline, None, 0 bytes)
View raw message