ranger-dev mailing list archives

Site index · List index
Message view « Date » · « Thread »
Top « Date » · « Thread »
From "Pradeep Agrawal (JIRA)" <j...@apache.org>
Subject [jira] [Reopened] (RANGER-1184) Ranger compiler failed under Windows
Date Thu, 05 Jan 2017 05:01:58 GMT

     [ https://issues.apache.org/jira/browse/RANGER-1184?page=com.atlassian.jira.plugin.system.issuetabpanels:all-tabpanel
]

Pradeep Agrawal reopened RANGER-1184:
-------------------------------------

Opening this issue as it seems the indentation is causing build failure in some environment.

> Ranger compiler failed under Windows
> ------------------------------------
>
>                 Key: RANGER-1184
>                 URL: https://issues.apache.org/jira/browse/RANGER-1184
>             Project: Ranger
>          Issue Type: Bug
>          Components: Ranger
>    Affects Versions: 0.6.1
>            Reporter: Qiang Zhang
>            Assignee: Qiang Zhang
>            Priority: Minor
>              Labels: patch
>             Fix For: 0.7.0
>
>         Attachments: 0001-RANGER-1184.patch
>
>
> 1、Under the environment of the Cygwin
> 2、mvn clean compile package assembly:assembly install -DskipTests
> [ERROR] Failed to execute goal org.apache.maven.plugins:maven-compiler-plugin:3.3:compile
(default-compile) on project r
> anger-util: Compilation failure: Compilation failure:
> [ERROR] F:\code\ranger-incubating\ranger-util\target\gen\org\apache\ranger\common\package-info.java:[21,241]
Error: illegal escape characters
> [ERROR] F:\code\ranger-incubating\ranger-util\target\gen\org\apache\ranger\common\package-info.java:[21,276]
Error: illegal escape characters
> [ERROR] -> [Help 1]
> org.apache.maven.lifecycle.LifecycleExecutionException: Failed to execute goal org.apache.maven.plugins:maven-compiler-p
> lugin:3.3:compile (default-compile) on project ranger-util: Compilation failure
>         at org.apache.maven.lifecycle.internal.MojoExecutor.execute(MojoExecutor.java:212)
>         at org.apache.maven.lifecycle.internal.MojoExecutor.execute(MojoExecutor.java:153)
>         at org.apache.maven.lifecycle.internal.MojoExecutor.execute(MojoExecutor.java:145)
>         at org.apache.maven.lifecycle.internal.LifecycleModuleBuilder.buildProject(LifecycleModuleBuilder.java:116)
>         at org.apache.maven.lifecycle.internal.LifecycleModuleBuilder.buildProject(LifecycleModuleBuilder.java:80)
>         at org.apache.maven.lifecycle.internal.builder.singlethreaded.SingleThreadedBuilder.build(SingleThreadedBuilder.
> java:51)
>         at org.apache.maven.lifecycle.internal.LifecycleStarter.execute(LifecycleStarter.java:128)
>         at org.apache.maven.DefaultMaven.doExecute(DefaultMaven.java:307)
>         at org.apache.maven.DefaultMaven.doExecute(DefaultMaven.java:193)
>         at org.apache.maven.DefaultMaven.execute(DefaultMaven.java:106)
>         at org.apache.maven.cli.MavenCli.execute(MavenCli.java:863)
>         at org.apache.maven.cli.MavenCli.doMain(MavenCli.java:288)
>         at org.apache.maven.cli.MavenCli.main(MavenCli.java:199)
>         at sun.reflect.NativeMethodAccessorImpl.invoke0(Native Method)
>         at sun.reflect.NativeMethodAccessorImpl.invoke(NativeMethodAccessorImpl.java:57)
>         at sun.reflect.DelegatingMethodAccessorImpl.invoke(DelegatingMethodAccessorImpl.java:43)
>         at java.lang.reflect.Method.invoke(Method.java:606)
>         at org.codehaus.plexus.classworlds.launcher.Launcher.launchEnhanced(Launcher.java:289)
>         at org.codehaus.plexus.classworlds.launcher.Launcher.launch(Launcher.java:229)
>         at org.codehaus.plexus.classworlds.launcher.Launcher.mainWithExitCode(Launcher.java:415)
>         at org.codehaus.plexus.classworlds.launcher.Launcher.main(Launcher.java:356)
> Caused by: org.apache.maven.plugin.compiler.CompilationFailureException: Compilation
failure
>         at org.apache.maven.plugin.compiler.AbstractCompilerMojo.execute(AbstractCompilerMojo.java:911)
>         at org.apache.maven.plugin.compiler.CompilerMojo.execute(CompilerMojo.java:129)
>         at org.apache.maven.plugin.DefaultBuildPluginManager.executeMojo(DefaultBuildPluginManager.java:134)
>         at org.apache.maven.lifecycle.internal.MojoExecutor.execute(MojoExecutor.java:207)



--
This message was sent by Atlassian JIRA
(v6.3.4#6332)

Mime
View raw message