ranger-dev mailing list archives

Site index · List index
Message view « Date » · « Thread »
Top « Date » · « Thread »
From Velmurugan Periasamy <vperias...@hortonworks.com>
Subject Re: Review Request 67697: RANGER-2140: Upgrade spring and guava libraries
Date Fri, 22 Jun 2018 18:51:54 GMT

-----------------------------------------------------------
This is an automatically generated e-mail. To reply, visit:
https://reviews.apache.org/r/67697/#review205245
-----------------------------------------------------------




pom.xml
Line 159 (original), 158 (patched)
<https://reviews.apache.org/r/67697/#comment288178>

    I get test failures with this patch. Please check and fix them.
    
    ```
    -------------------------------------------------------------------------------
    Test set: org.apache.ranger.services.knox.KnoxRangerTest
    -------------------------------------------------------------------------------
    Tests run: 10, Failures: 5, Errors: 0, Skipped: 0, Time elapsed: 16.777 s <<<
FAILURE! - in org.apache.ranger.services.knox.KnoxRangerTest
    testHDFSAllowed(org.apache.ranger.services.knox.KnoxRangerTest)  Time elapsed: 1.8 s 
<<< FAILURE!
    java.lang.AssertionError: 
    1 expectation failed.
    Expected status code <200> but was <500>.
    
    	at org.apache.ranger.services.knox.KnoxRangerTest.makeWebHDFSInvocation(KnoxRangerTest.java:207)
    	at org.apache.ranger.services.knox.KnoxRangerTest.testHDFSAllowed(KnoxRangerTest.java:133)
    
    testSolrAllowed(org.apache.ranger.services.knox.KnoxRangerTest)  Time elapsed: 0.031 s
 <<< FAILURE!
    java.lang.AssertionError: 
    1 expectation failed.
    Expected status code <200> but was <403>.
    
    	at org.apache.ranger.services.knox.KnoxRangerTest.makeSolrInvocation(KnoxRangerTest.java:317)
    	at org.apache.ranger.services.knox.KnoxRangerTest.testSolrAllowed(KnoxRangerTest.java:173)
    
    testKafkaAllowed(org.apache.ranger.services.knox.KnoxRangerTest)  Time elapsed: 0.024
s  <<< FAILURE!
    java.lang.AssertionError: 
    1 expectation failed.
    Expected status code <200> but was <403>.
    
    	at org.apache.ranger.services.knox.KnoxRangerTest.makeKafkaInvocation(KnoxRangerTest.java:287)
    	at org.apache.ranger.services.knox.KnoxRangerTest.testKafkaAllowed(KnoxRangerTest.java:163)
    
    testStormUiAllowed(org.apache.ranger.services.knox.KnoxRangerTest)  Time elapsed: 0.022
s  <<< FAILURE!
    java.lang.AssertionError: 
    1 expectation failed.
    Expected status code <200> but was <403>.
    
    	at org.apache.ranger.services.knox.KnoxRangerTest.makeStormUIInvocation(KnoxRangerTest.java:238)
    	at org.apache.ranger.services.knox.KnoxRangerTest.testStormUiAllowed(KnoxRangerTest.java:143)
    
    testHBaseAllowed(org.apache.ranger.services.knox.KnoxRangerTest)  Time elapsed: 0.017
s  <<< FAILURE!
    java.lang.AssertionError: 
    1 expectation failed.
    Expected status code <200> but was <403>.
    
    	at org.apache.ranger.services.knox.KnoxRangerTest.makeHBaseInvocation(KnoxRangerTest.java:267)
    	at org.apache.ranger.services.knox.KnoxRangerTest.testHBaseAllowed(KnoxRangerTest.java:153)
    ```


- Velmurugan Periasamy


On June 22, 2018, 7:32 a.m., Pradeep Agrawal wrote:
> 
> -----------------------------------------------------------
> This is an automatically generated e-mail. To reply, visit:
> https://reviews.apache.org/r/67697/
> -----------------------------------------------------------
> 
> (Updated June 22, 2018, 7:32 a.m.)
> 
> 
> Review request for ranger, Ankita Sinha, deepak sharma, Gautam Borad, Mehul Parikh, suja
s, and Velmurugan Periasamy.
> 
> 
> Bugs: RANGER-2140
>     https://issues.apache.org/jira/browse/RANGER-2140
> 
> 
> Repository: ranger
> 
> 
> Description
> -------
> 
> Here I am proposing to change Guava version to 25.1, currently there are three different
version are being used. Also proposing to change Spring Security to 4.2.7 and Spring Framework
to 4.3.18.
> 
> 
> Diffs
> -----
> 
>   kms/pom.xml 9ca9270 
>   plugin-atlas/pom.xml a1f0c37 
>   pom.xml 0795210 
>   src/main/assembly/kms.xml 7fbc141 
>   src/main/assembly/plugin-atlas.xml 8f4a64c 
>   src/main/assembly/plugin-kms.xml 6d15f2a 
>   src/main/assembly/plugin-solr.xml de30bfb 
>   ugsync/pom.xml c636f9f 
>   unixauthclient/pom.xml f859fff 
>   unixauthservice/pom.xml c4fe07d 
> 
> 
> Diff: https://reviews.apache.org/r/67697/diff/1/
> 
> 
> Testing
> -------
> 
> Tested Ranger admin installation, user login, usersync and other crud operations on service,
policy, user and group module.
> 
> 
> Thanks,
> 
> Pradeep Agrawal
> 
>


Mime
  • Unnamed multipart/alternative (inline, None, 0 bytes)
View raw message