rave-dev mailing list archives

Site index · List index
Message view « Date » · « Thread »
Top « Date » · « Thread »
From Jasha Joachimsthal <ja...@apache.org>
Subject Re: Build failed in Jenkins: rave-project-trunk #687
Date Sun, 30 Dec 2012 19:34:08 GMT
Strange, I cannot reproduce this locally. Does anyone have an idea how to
reproduce or fix this?
It happens when the archetype tries to generate a project from itself.

On 30 December 2012 20:20, Apache Jenkins Server
<jenkins@builds.apache.org>wrote:

> See <https://builds.apache.org/job/rave-project-trunk/687/changes>
>
> Changes:
>
> [Jasha Joachimsthal] RAVE-864 force local archetype repo
>
> ------------------------------------------
> [...truncated 6583 lines...]
> [INFO] --- maven-resources-plugin:2.6:resources (default-resources) @
> rave-custom-project-archetype ---
> [INFO] Using 'UTF-8' encoding to copy filtered resources.
> [INFO] Copying 1 resource
> [INFO] Copying 12 resources
> [INFO] Copying 3 resources
> mojoSucceeded
> org.apache.maven.plugins:maven-resources-plugin:2.6(default-resources)
> mojoStarted
> org.apache.maven.plugins:maven-resources-plugin:2.6(default-testResources)[INFO]
> Using 'UTF-8' encoding to copy filtered resources.
> [INFO] Copying 2 resources
> [INFO] Copying 3 resources
>
> [INFO]
> [INFO] --- maven-resources-plugin:2.6:testResources
> (default-testResources) @ rave-custom-project-archetype ---
> mojoSucceeded
> org.apache.maven.plugins:maven-resources-plugin:2.6(default-testResources)
> mojoStarted
> org.apache.maven.plugins:maven-archetype-plugin:2.2(default-jar)
> [INFO]
> [INFO] --- maven-archetype-plugin:2.2:jar (default-jar) @
> rave-custom-project-archetype ---
> [INFO] Building archetype jar: <
> https://builds.apache.org/job/rave-project-trunk/ws/trunk/rave-custom-project-archetype/target/rave-custom-project-archetype-0.19-SNAPSHOT
> >
> mojoSucceeded
> org.apache.maven.plugins:maven-archetype-plugin:2.2(default-jar)
> mojoStarted
> org.apache.maven.plugins:maven-site-plugin:3.0(attach-descriptor)
> [INFO]
> [INFO] --- maven-site-plugin:3.0:attach-descriptor (attach-descriptor) @
> rave-custom-project-archetype ---
> mojoSucceeded
> org.apache.maven.plugins:maven-site-plugin:3.0(attach-descriptor)
> mojoStarted
> org.apache.maven.plugins:maven-archetype-plugin:2.2(default-integration-test)
> [INFO] Processing Archetype IT project: basic
> [INFO]
> [INFO] --- maven-archetype-plugin:2.2:integration-test
> (default-integration-test) @ rave-custom-project-archetype ---
> [INFO]
> ----------------------------------------------------------------------------
> [INFO] Using following parameters for creating project from Archetype:
> rave-custom-project-archetype:0.19-SNAPSHOT
> [INFO]
> ----------------------------------------------------------------------------
> [INFO] Parameter: groupId, Value: archetype.it
> [INFO] Parameter: artifactId, Value: basic
> [INFO] Parameter: version, Value: 0.1-SNAPSHOT
> [INFO] Parameter: package, Value: it.pkg
> [INFO] Parameter: packageInPathFormat, Value: it/pkg
> [INFO] Parameter: version, Value: 0.1-SNAPSHOT
> [INFO] Parameter: package, Value: it.pkg
> [INFO] Parameter: projectName, Value: project
> [INFO] Parameter: groupId, Value: archetype.it
> [INFO] Parameter: artifactId, Value: basic
> [INFO] Parent element not overwritten in <
> https://builds.apache.org/job/rave-project-trunk/ws/trunk/rave-custom-project-archetype/target/test-classes/projects/basic/project/basic/basic-portal/pom.xml
> >
> [INFO] Parent element not overwritten in <
> https://builds.apache.org/job/rave-project-trunk/ws/trunk/rave-custom-project-archetype/target/test-classes/projects/basic/project/basic/basic-shindig/pom.xml
> >
> [INFO] project created from Archetype in dir: <
> https://builds.apache.org/job/rave-project-trunk/ws/trunk/rave-custom-project-archetype/target/test-classes/projects/basic/project/basic
> >
> [INFO] No post-archetype-generation goals to invoke.
> mojoSucceeded
> org.apache.maven.plugins:maven-archetype-plugin:2.2(default-integration-test)
> mojoStarted
> org.apache.maven.plugins:maven-source-plugin:2.2.1(attach-sources)
> [INFO]
> [INFO] --- maven-source-plugin:2.2.1:jar-no-fork (attach-sources) @
> rave-custom-project-archetype ---
> [INFO] Building jar: <
> https://builds.apache.org/job/rave-project-trunk/ws/trunk/rave-custom-project-archetype/target/rave-custom-project-archetype-0.19-SNAPSHOT-sources.jar
> >
> mojoSucceeded
> org.apache.maven.plugins:maven-source-plugin:2.2.1(attach-sources)
> mojoStarted
> org.apache.maven.plugins:maven-install-plugin:2.3.1(default-install)[INFO]
> Installing <
> https://builds.apache.org/job/rave-project-trunk/ws/trunk/rave-custom-project-archetype/target/rave-custom-project-archetype-0.19-SNAPSHOT.jar>
> to
> /home/hudson/hudson-slave/maven-repositories/1/org/apache/rave/rave-custom-project-archetype/0.19-SNAPSHOT/rave-custom-project-archetype-0.19-SNAPSHOT.jar
> [INFO] Installing <
> https://builds.apache.org/job/rave-project-trunk/ws/trunk/rave-custom-project-archetype/pom.xml>
> to
> /home/hudson/hudson-slave/maven-repositories/1/org/apache/rave/rave-custom-project-archetype/0.19-SNAPSHOT/rave-custom-project-archetype-0.19-SNAPSHOT.pom
> [INFO] Installing <
> https://builds.apache.org/job/rave-project-trunk/ws/trunk/rave-custom-project-archetype/target/rave-custom-project-archetype-0.19-SNAPSHOT-sources.jar>
> to
> /home/hudson/hudson-slave/maven-repositories/1/org/apache/rave/rave-custom-project-archetype/0.19-SNAPSHOT/rave-custom-project-archetype-0.19-SNAPSHOT-sources.jar
>
> [INFO]
> [INFO] --- maven-install-plugin:2.3.1:install (default-install) @
> rave-custom-project-archetype ---
> mojoSucceeded
> org.apache.maven.plugins:maven-install-plugin:2.3.1(default-install)
> mojoStarted
> org.apache.maven.plugins:maven-archetype-plugin:2.2(default-update-local-catalog)
> [INFO]
> [INFO] --- maven-archetype-plugin:2.2:update-local-catalog
> (default-update-local-catalog) @ rave-custom-project-archetype ---
> mojoSucceeded
> org.apache.maven.plugins:maven-archetype-plugin:2.2(default-update-local-catalog)
> mojoStarted
> org.apache.maven.plugins:maven-antrun-plugin:1.7(generate-and-install-custom-rave-project)
> [INFO]
> [INFO] --- maven-antrun-plugin:1.7:run
> (generate-and-install-custom-rave-project) @ rave-custom-project-archetype
> ---
> [INFO] Executing tasks
>
> main:
>      [echo] $$$$$ Deleting the existing custom Rave project if it exists.
> $$$$$
>      [echo] $$$$$ Generating a custom Rave project from the archetype $$$$$
>      [java] Permissions can not be set this way in forked mode.
>      [java] [INFO] Scanning for projects...
>      [java] [INFO]
>      [java] [INFO]
> ------------------------------------------------------------------------
>      [java] [INFO] Building Maven Stub Project (No POM) 1
>      [java] [INFO]
> ------------------------------------------------------------------------
>      [java] [INFO]
>      [java] [INFO] >>> maven-archetype-plugin:2.2:generate (default-cli) @
> standalone-pom >>>
>      [java] [INFO]
>      [java] [INFO] <<< maven-archetype-plugin:2.2:generate (default-cli) @
> standalone-pom <<<
>      [java] [INFO]
>      [java] [INFO] --- maven-archetype-plugin:2.2:generate (default-cli) @
> standalone-pom ---
>      [java] [INFO] Generating project in Batch mode
>      [java] [INFO] Archetype repository missing. Using the one from
> [org.apache.rave:rave-custom-project-archetype:0.19-SNAPSHOT] found in
> catalog local
>      [java] [INFO]
> ------------------------------------------------------------------------
>      [java] [INFO] BUILD FAILURE
>      [java] [INFO]
> ------------------------------------------------------------------------
>      [java] [INFO] Total time: 4.487s
>      [java] [INFO] Finished at: Sun Dec 30 19:12:24 UTC 2012
>      [java] [INFO] Final Memory: 5M/63M
>      [java] [INFO]
> ------------------------------------------------------------------------
>      [java] [ERROR] Failed to execute goal
> org.apache.maven.plugins:maven-archetype-plugin:2.2:generate (default-cli)
> on project standalone-pom: The desired archetype does not exist
> (org.apache.rave:rave-custom-project-archetype:0.19-SNAPSHOT) -> [Help 1]
>      [java] [ERROR]
>      [java] [ERROR] To see the full stack trace of the errors, re-run
> Maven with the -e switch.
>      [java] [ERROR] Re-run Maven using the -X switch to enable full debug
> logging.
>      [java] [ERROR]
>      [java] [ERROR] For more information about the errors and possible
> solutions, please read the following articles:
>      [java] [ERROR] [Help 1]
> http://cwiki.apache.org/confluence/display/MAVEN/MojoFailureException
> mojoFailed
> org.apache.maven.plugins:maven-antrun-plugin:1.7(generate-and-install-custom-rave-project)
> projectFailed org.apache.rave:rave-custom-project-archetype:0.19-SNAPSHOT
> sessionEnded
> [INFO]
> ------------------------------------------------------------------------
> [INFO] Reactor Summary:
> [INFO]
> [INFO] Apache Rave :: rave-project ....................... SUCCESS
> [22.711s]
> [INFO] Apache Rave :: rave-components .................... SUCCESS [1.256s]
> [INFO] Apache Rave :: rave-commons ....................... SUCCESS
> [30.923s]
> [INFO] Apache Rave :: rave-core .......................... SUCCESS
> [28.853s]
> [INFO] Apache Rave :: rave-jpa ........................... SUCCESS
> [44.197s]
> [INFO] Apache Rave :: rave-web ........................... SUCCESS
> [20.361s]
> [INFO] Apache Rave :: rave-providers ..................... SUCCESS [2.318s]
> [INFO] Apache Rave :: rave-opensocial-provider ........... SUCCESS [2.890s]
> [INFO] Apache Rave :: rave-opensocial-client ............. SUCCESS [9.959s]
> [INFO] Apache Rave :: rave-opensocial-core ............... SUCCESS
> [21.772s]
> [INFO] Apache Rave :: rave-opensocial-server ............. SUCCESS [1.927s]
> [INFO] Apache Rave :: rave-shindig ....................... SUCCESS
> [15.553s]
> [INFO] Apache Rave :: rave-w3c-provider .................. SUCCESS
> [15.748s]
> [INFO] Apache Rave :: rave-portal-resources .............. SUCCESS
> [1:02.689s]
> [INFO] Apache Rave :: rave-portal-dependencies ........... SUCCESS [3.613s]
> [INFO] Apache Rave :: Demo Gadgets ....................... SUCCESS [3.467s]
> [INFO] Apache Rave :: rave-portal ........................ SUCCESS
> [26.814s]
> [INFO] Apache Rave :: rave-integration-tests ............. SUCCESS [8.147s]
> [INFO] Apache Rave :: rave-core-tests .................... SUCCESS
> [19.404s]
> [INFO] Apache Rave :: rave-newuser-tests ................. SUCCESS [6.568s]
> [INFO] Apache Rave :: rave-admin-tests ................... SUCCESS [6.296s]
> [INFO] Apache Rave :: rave-default-account-tests ......... SUCCESS [7.868s]
> [INFO] Apache Rave :: rave-custom-project-archetype ...... FAILURE
> [10.473s]
> [INFO]
> ------------------------------------------------------------------------
> [INFO] BUILD FAILURE
> [INFO]
> ------------------------------------------------------------------------
> [INFO] Total time: 6:24.451s
> [INFO] Finished at: Sun Dec 30 19:12:25 UTC 2012
> [INFO] Final Memory: 71M/494M
> [INFO]
> ------------------------------------------------------------------------
> Projects to build: [MavenProject:
> org.apache.rave:rave-project:0.19-SNAPSHOT @ <
> https://builds.apache.org/job/rave-project-trunk/ws/trunk/pom.xml,>
> MavenProject: org.apache.rave:rave-components:0.19-SNAPSHOT @ <
> https://builds.apache.org/job/rave-project-trunk/ws/trunk/rave-components/pom.xml,>
> MavenProject: org.apache.rave:rave-commons:0.19-SNAPSHOT @ <
> https://builds.apache.org/job/rave-project-trunk/ws/trunk/rave-components/rave-commons/pom.xml,>
> MavenProject: org.apache.rave:rave-core:0.19-SNAPSHOT @ <
> https://builds.apache.org/job/rave-project-trunk/ws/trunk/rave-components/rave-core/pom.xml,>
> MavenProject: org.apache.rave:rave-jpa:0.19-SNAPSHOT @ <
> https://builds.apache.org/job/rave-project-trunk/ws/trunk/rave-components/rave-jpa/pom.xml,>
> MavenProject: org.apache.rave:rave-web:0.19-SNAPSHOT @ <
> https://builds.apache.org/job/rave-project-trunk/ws/trunk/rave-components/rave-web/pom.xml,>
> MavenProject: org.apache.rave:rave-providers:0.19-SNAPSHOT @ <
> https://builds.apache.org/job/rave-project-trunk/ws/trunk/rave-providers/pom.xml,>
> MavenProject: org.apache.rave:rave-opensocial-provider:0.19-SNAPSHOT @ <
> https://builds.apache.org/job/rave-project-trunk/ws/trunk/rave-providers/rave-opensocial-provider/pom.xml,>
> MavenProject: org.apache.rave:rave-opensocial-client:0.19-SNAPSHOT @ <
> https://builds.apache.org/job/rave-project-trunk/ws/trunk/rave-providers/rave-opensocial-provider/rave-opensocial-client/pom.xml,>
> MavenProject: org.apache.rave:rave-opensocial-core:0.19-SNAPSHOT @ <
> https://builds.apache.org/job/rave-project-trunk/ws/trunk/rave-providers/rave-opensocial-provider/rave-opensocial-core/pom.xml,>
> MavenProject: org.apache.rave:rave-opensocial-server:0.19-SNAPSHOT @ <
> https://builds.apache.org/job/rave-project-trunk/ws/trunk/rave-providers/rave-opensocial-provider/rave-opensocial-server/pom.xml,>
> MavenProject: org.apache.rave:rave-shindig:0.19-SNAPSHOT @ <
> https://builds.apache.org/job/rave-project-trunk/ws/trunk/rave-providers/rave-opensocial-provider/rave-opensocial-server/rave-shindig/pom.xml,>
> MavenProject: org.apache.rave:rave-w3c-provider:0.19-SNAPSHOT @ <
> https://builds.apache.org/job/rave-project-trunk/ws/trunk/rave-providers/rave-w3c-provider/pom.xml,>
> MavenProject: org.apache.rave:rave-portal-resources:0.19-SNAPSHOT @ <
> https://builds.apache.org/job/rave-project-trunk/ws/trunk/rave-portal-resources/pom.xml,>
> MavenProject: org.apache.rave:rave-portal-dependencies:0.19-SNAPSHOT @ <
> https://builds.apache.org/job/rave-project-trunk/ws/trunk/rave-portal-dependencies/pom.xml,>
> MavenProject: org.apache.rave:rave-demo-gadgets:0.19-SNAPSHOT @ <
> https://builds.apache.org/job/rave-project-trunk/ws/trunk/rave-demo-gadgets/pom.xml,>
> MavenProject: org.apache.rave:rave-portal:0.19-SNAPSHOT @ <
> https://builds.apache.org/job/rave-project-trunk/ws/trunk/rave-portal/pom.xml,>
> MavenProject:
> org.apache.rave.integration-tests:rave-integration-tests:0.19-SNAPSHOT @ <
> https://builds.apache.org/job/rave-project-trunk/ws/trunk/rave-integration-tests/pom.xml,>
> MavenProject:
> org.apache.rave.integration-tests:rave-core-tests:0.19-SNAPSHOT @ <
> https://builds.apache.org/job/rave-project-trunk/ws/trunk/rave-integration-tests/rave-core-tests/pom.xml,>
> MavenProject:
> org.apache.rave.integration-tests:rave-newuser-tests:0.19-SNAPSHOT @ <
> https://builds.apache.org/job/rave-project-trunk/ws/trunk/rave-integration-tests/rave-newuser-tests/pom.xml,>
> MavenProject:
> org.apache.rave.integration-tests:rave-admin-tests:0.19-SNAPSHOT @ <
> https://builds.apache.org/job/rave-project-trunk/ws/trunk/rave-integration-tests/rave-admin-tests/pom.xml,>
> MavenProject:
> org.apache.rave.integration-tests:rave-default-account-tests:0.19-SNAPSHOT
> @ <
> https://builds.apache.org/job/rave-project-trunk/ws/trunk/rave-integration-tests/rave-default-account-tests/pom.xml,>
> MavenProject: org.apache.rave:rave-custom-project-archetype:0.19-SNAPSHOT @
> <
> https://builds.apache.org/job/rave-project-trunk/ws/trunk/rave-custom-project-archetype/pom.xml
> ]>
> [JENKINS] Archiving <
> https://builds.apache.org/job/rave-project-trunk/ws/trunk/rave-providers/rave-opensocial-provider/rave-opensocial-client/pom.xml>
> to
> /home/hudson/hudson/jobs/rave-project-trunk/modules/org.apache.rave$rave-opensocial-client/builds/2012-12-30_19-05-39/archive/org.apache.rave/rave-opensocial-client/0.19-SNAPSHOT/rave-opensocial-client-0.19-SNAPSHOT.pom
> [JENKINS] Archiving <
> https://builds.apache.org/job/rave-project-trunk/ws/trunk/rave-providers/rave-opensocial-provider/rave-opensocial-client/target/rave-opensocial-client-0.19-SNAPSHOT.jar>
> to
> /home/hudson/hudson/jobs/rave-project-trunk/modules/org.apache.rave$rave-opensocial-client/builds/2012-12-30_19-05-39/archive/org.apache.rave/rave-opensocial-client/0.19-SNAPSHOT/rave-opensocial-client-0.19-SNAPSHOT.jar
> [JENKINS] Archiving <
> https://builds.apache.org/job/rave-project-trunk/ws/trunk/rave-providers/rave-opensocial-provider/rave-opensocial-client/target/rave-opensocial-client-0.19-SNAPSHOT-sources.jar>
> to
> /home/hudson/hudson/jobs/rave-project-trunk/modules/org.apache.rave$rave-opensocial-client/builds/2012-12-30_19-05-39/archive/org.apache.rave/rave-opensocial-client/0.19-SNAPSHOT/rave-opensocial-client-0.19-SNAPSHOT-sources.jar
> [JENKINS] Archiving <
> https://builds.apache.org/job/rave-project-trunk/ws/trunk/rave-components/pom.xml>
> to
> /home/hudson/hudson/jobs/rave-project-trunk/modules/org.apache.rave$rave-components/builds/2012-12-30_19-05-39/archive/org.apache.rave/rave-components/0.19-SNAPSHOT/rave-components-0.19-SNAPSHOT.pom
> [JENKINS] Archiving <
> https://builds.apache.org/job/rave-project-trunk/ws/trunk/rave-integration-tests/rave-admin-tests/pom.xml>
> to
> /home/hudson/hudson/jobs/rave-project-trunk/modules/org.apache.rave.integration-tests$rave-admin-tests/builds/2012-12-30_19-05-40/archive/org.apache.rave.integration-tests/rave-admin-tests/0.19-SNAPSHOT/rave-admin-tests-0.19-SNAPSHOT.pom
> [JENKINS] Archiving <
> https://builds.apache.org/job/rave-project-trunk/ws/trunk/rave-integration-tests/rave-admin-tests/target/rave-admin-tests-0.19-SNAPSHOT.jar>
> to
> /home/hudson/hudson/jobs/rave-project-trunk/modules/org.apache.rave.integration-tests$rave-admin-tests/builds/2012-12-30_19-05-40/archive/org.apache.rave.integration-tests/rave-admin-tests/0.19-SNAPSHOT/rave-admin-tests-0.19-SNAPSHOT.jar
> [JENKINS] Archiving <
> https://builds.apache.org/job/rave-project-trunk/ws/trunk/rave-integration-tests/rave-admin-tests/target/rave-admin-tests-0.19-SNAPSHOT-sources.jar>
> to
> /home/hudson/hudson/jobs/rave-project-trunk/modules/org.apache.rave.integration-tests$rave-admin-tests/builds/2012-12-30_19-05-40/archive/org.apache.rave.integration-tests/rave-admin-tests/0.19-SNAPSHOT/rave-admin-tests-0.19-SNAPSHOT-sources.jar
> [JENKINS] Archiving <
> https://builds.apache.org/job/rave-project-trunk/ws/trunk/rave-integration-tests/pom.xml>
> to
> /home/hudson/hudson/jobs/rave-project-trunk/modules/org.apache.rave.integration-tests$rave-integration-tests/builds/2012-12-30_19-05-40/archive/org.apache.rave.integration-tests/rave-integration-tests/0.19-SNAPSHOT/rave-integration-tests-0.19-SNAPSHOT.pom
> [JENKINS] Archiving <
> https://builds.apache.org/job/rave-project-trunk/ws/trunk/rave-providers/rave-w3c-provider/pom.xml>
> to
> /home/hudson/hudson/jobs/rave-project-trunk/modules/org.apache.rave$rave-w3c-provider/builds/2012-12-30_19-05-40/archive/org.apache.rave/rave-w3c-provider/0.19-SNAPSHOT/rave-w3c-provider-0.19-SNAPSHOT.pom
> [JENKINS] Archiving <
> https://builds.apache.org/job/rave-project-trunk/ws/trunk/rave-providers/rave-w3c-provider/target/rave-w3c-provider-0.19-SNAPSHOT.jar>
> to
> /home/hudson/hudson/jobs/rave-project-trunk/modules/org.apache.rave$rave-w3c-provider/builds/2012-12-30_19-05-40/archive/org.apache.rave/rave-w3c-provider/0.19-SNAPSHOT/rave-w3c-provider-0.19-SNAPSHOT.jar
> [JENKINS] Archiving <
> https://builds.apache.org/job/rave-project-trunk/ws/trunk/rave-providers/rave-w3c-provider/target/rave-w3c-provider-0.19-SNAPSHOT-sources.jar>
> to
> /home/hudson/hudson/jobs/rave-project-trunk/modules/org.apache.rave$rave-w3c-provider/builds/2012-12-30_19-05-40/archive/org.apache.rave/rave-w3c-provider/0.19-SNAPSHOT/rave-w3c-provider-0.19-SNAPSHOT-sources.jar
> [JENKINS] Archiving <
> https://builds.apache.org/job/rave-project-trunk/ws/trunk/rave-components/rave-core/pom.xml>
> to
> /home/hudson/hudson/jobs/rave-project-trunk/modules/org.apache.rave$rave-core/builds/2012-12-30_19-05-39/archive/org.apache.rave/rave-core/0.19-SNAPSHOT/rave-core-0.19-SNAPSHOT.pom
> [JENKINS] Archiving <
> https://builds.apache.org/job/rave-project-trunk/ws/trunk/rave-components/rave-core/target/rave-core-0.19-SNAPSHOT.jar>
> to
> /home/hudson/hudson/jobs/rave-project-trunk/modules/org.apache.rave$rave-core/builds/2012-12-30_19-05-39/archive/org.apache.rave/rave-core/0.19-SNAPSHOT/rave-core-0.19-SNAPSHOT.jar
> [JENKINS] Archiving <
> https://builds.apache.org/job/rave-project-trunk/ws/trunk/rave-components/rave-core/target/rave-core-0.19-SNAPSHOT-sources.jar>
> to
> /home/hudson/hudson/jobs/rave-project-trunk/modules/org.apache.rave$rave-core/builds/2012-12-30_19-05-39/archive/org.apache.rave/rave-core/0.19-SNAPSHOT/rave-core-0.19-SNAPSHOT-sources.jar
> [JENKINS] Archiving <
> https://builds.apache.org/job/rave-project-trunk/ws/trunk/rave-components/rave-commons/pom.xml>
> to
> /home/hudson/hudson/jobs/rave-project-trunk/modules/org.apache.rave$rave-commons/builds/2012-12-30_19-05-39/archive/org.apache.rave/rave-commons/0.19-SNAPSHOT/rave-commons-0.19-SNAPSHOT.pom
> [JENKINS] Archiving <
> https://builds.apache.org/job/rave-project-trunk/ws/trunk/rave-components/rave-commons/target/rave-commons-0.19-SNAPSHOT.jar>
> to
> /home/hudson/hudson/jobs/rave-project-trunk/modules/org.apache.rave$rave-commons/builds/2012-12-30_19-05-39/archive/org.apache.rave/rave-commons/0.19-SNAPSHOT/rave-commons-0.19-SNAPSHOT.jar
> [JENKINS] Archiving <
> https://builds.apache.org/job/rave-project-trunk/ws/trunk/rave-components/rave-commons/target/rave-commons-0.19-SNAPSHOT-sources.jar>
> to
> /home/hudson/hudson/jobs/rave-project-trunk/modules/org.apache.rave$rave-commons/builds/2012-12-30_19-05-39/archive/org.apache.rave/rave-commons/0.19-SNAPSHOT/rave-commons-0.19-SNAPSHOT-sources.jar
> [JENKINS] Archiving <
> https://builds.apache.org/job/rave-project-trunk/ws/trunk/rave-providers/pom.xml>
> to
> /home/hudson/hudson/jobs/rave-project-trunk/modules/org.apache.rave$rave-providers/builds/2012-12-30_19-05-39/archive/org.apache.rave/rave-providers/0.19-SNAPSHOT/rave-providers-0.19-SNAPSHOT.pom
> [JENKINS] Archiving <
> https://builds.apache.org/job/rave-project-trunk/ws/trunk/rave-custom-project-archetype/pom.xml>
> to
> /home/hudson/hudson/jobs/rave-project-trunk/modules/org.apache.rave$rave-custom-project-archetype/builds/2012-12-30_19-05-40/archive/org.apache.rave/rave-custom-project-archetype/0.19-SNAPSHOT/rave-custom-project-archetype-0.19-SNAPSHOT.pom
> [JENKINS] Archiving <
> https://builds.apache.org/job/rave-project-trunk/ws/trunk/rave-custom-project-archetype/target/rave-custom-project-archetype-0.19-SNAPSHOT.jar>
> to
> /home/hudson/hudson/jobs/rave-project-trunk/modules/org.apache.rave$rave-custom-project-archetype/builds/2012-12-30_19-05-40/archive/org.apache.rave/rave-custom-project-archetype/0.19-SNAPSHOT/rave-custom-project-archetype-0.19-SNAPSHOT.jar
> [JENKINS] Archiving <
> https://builds.apache.org/job/rave-project-trunk/ws/trunk/rave-custom-project-archetype/target/rave-custom-project-archetype-0.19-SNAPSHOT-sources.jar>
> to
> /home/hudson/hudson/jobs/rave-project-trunk/modules/org.apache.rave$rave-custom-project-archetype/builds/2012-12-30_19-05-40/archive/org.apache.rave/rave-custom-project-archetype/0.19-SNAPSHOT/rave-custom-project-archetype-0.19-SNAPSHOT-sources.jar
> [JENKINS] Archiving <
> https://builds.apache.org/job/rave-project-trunk/ws/trunk/rave-providers/rave-opensocial-provider/rave-opensocial-server/rave-shindig/pom.xml>
> to
> /home/hudson/hudson/jobs/rave-project-trunk/modules/org.apache.rave$rave-shindig/builds/2012-12-30_19-05-40/archive/org.apache.rave/rave-shindig/0.19-SNAPSHOT/rave-shindig-0.19-SNAPSHOT.pom
> [JENKINS] Archiving <
> https://builds.apache.org/job/rave-project-trunk/ws/trunk/rave-providers/rave-opensocial-provider/rave-opensocial-server/rave-shindig/target/rave-shindig-0.19-SNAPSHOT.war>
> to
> /home/hudson/hudson/jobs/rave-project-trunk/modules/org.apache.rave$rave-shindig/builds/2012-12-30_19-05-40/archive/org.apache.rave/rave-shindig/0.19-SNAPSHOT/rave-shindig-0.19-SNAPSHOT.war
> [JENKINS] Archiving <
> https://builds.apache.org/job/rave-project-trunk/ws/trunk/rave-providers/rave-opensocial-provider/rave-opensocial-server/rave-shindig/target/rave-shindig-0.19-SNAPSHOT-sources.jar>
> to
> /home/hudson/hudson/jobs/rave-project-trunk/modules/org.apache.rave$rave-shindig/builds/2012-12-30_19-05-40/archive/org.apache.rave/rave-shindig/0.19-SNAPSHOT/rave-shindig-0.19-SNAPSHOT-sources.jar
> [JENKINS] Archiving <
> https://builds.apache.org/job/rave-project-trunk/ws/trunk/rave-portal-resources/pom.xml>
> to
> /home/hudson/hudson/jobs/rave-project-trunk/modules/org.apache.rave$rave-portal-resources/builds/2012-12-30_19-05-40/archive/org.apache.rave/rave-portal-resources/0.19-SNAPSHOT/rave-portal-resources-0.19-SNAPSHOT.pom
> [JENKINS] Archiving <
> https://builds.apache.org/job/rave-project-trunk/ws/trunk/rave-portal-resources/target/rave-portal-resources-0.19-SNAPSHOT.war>
> to
> /home/hudson/hudson/jobs/rave-project-trunk/modules/org.apache.rave$rave-portal-resources/builds/2012-12-30_19-05-40/archive/org.apache.rave/rave-portal-resources/0.19-SNAPSHOT/rave-portal-resources-0.19-SNAPSHOT.war
> [JENKINS] Archiving <
> https://builds.apache.org/job/rave-project-trunk/ws/trunk/rave-portal-resources/target/rave-portal-resources-0.19-SNAPSHOT-sources.jar>
> to
> /home/hudson/hudson/jobs/rave-project-trunk/modules/org.apache.rave$rave-portal-resources/builds/2012-12-30_19-05-40/archive/org.apache.rave/rave-portal-resources/0.19-SNAPSHOT/rave-portal-resources-0.19-SNAPSHOT-sources.jar
> [JENKINS] Archiving <
> https://builds.apache.org/job/rave-project-trunk/ws/trunk/rave-providers/rave-opensocial-provider/rave-opensocial-core/pom.xml>
> to
> /home/hudson/hudson/jobs/rave-project-trunk/modules/org.apache.rave$rave-opensocial-core/builds/2012-12-30_19-05-39/archive/org.apache.rave/rave-opensocial-core/0.19-SNAPSHOT/rave-opensocial-core-0.19-SNAPSHOT.pom
> [JENKINS] Archiving <
> https://builds.apache.org/job/rave-project-trunk/ws/trunk/rave-providers/rave-opensocial-provider/rave-opensocial-core/target/rave-opensocial-core-0.19-SNAPSHOT.jar>
> to
> /home/hudson/hudson/jobs/rave-project-trunk/modules/org.apache.rave$rave-opensocial-core/builds/2012-12-30_19-05-39/archive/org.apache.rave/rave-opensocial-core/0.19-SNAPSHOT/rave-opensocial-core-0.19-SNAPSHOT.jar
> [JENKINS] Archiving <
> https://builds.apache.org/job/rave-project-trunk/ws/trunk/rave-providers/rave-opensocial-provider/rave-opensocial-core/target/rave-opensocial-core-0.19-SNAPSHOT-sources.jar>
> to
> /home/hudson/hudson/jobs/rave-project-trunk/modules/org.apache.rave$rave-opensocial-core/builds/2012-12-30_19-05-39/archive/org.apache.rave/rave-opensocial-core/0.19-SNAPSHOT/rave-opensocial-core-0.19-SNAPSHOT-sources.jar
> [JENKINS] Archiving <
> https://builds.apache.org/job/rave-project-trunk/ws/trunk/rave-portal/pom.xml>
> to
> /home/hudson/hudson/jobs/rave-project-trunk/modules/org.apache.rave$rave-portal/builds/2012-12-30_19-05-40/archive/org.apache.rave/rave-portal/0.19-SNAPSHOT/rave-portal-0.19-SNAPSHOT.pom
> [JENKINS] Archiving <
> https://builds.apache.org/job/rave-project-trunk/ws/trunk/rave-portal/target/rave-portal-0.19-SNAPSHOT.war>
> to
> /home/hudson/hudson/jobs/rave-project-trunk/modules/org.apache.rave$rave-portal/builds/2012-12-30_19-05-40/archive/org.apache.rave/rave-portal/0.19-SNAPSHOT/rave-portal-0.19-SNAPSHOT.war
> [JENKINS] Archiving <
> https://builds.apache.org/job/rave-project-trunk/ws/trunk/rave-portal/target/rave-portal-0.19-SNAPSHOT-sources.jar>
> to
> /home/hudson/hudson/jobs/rave-project-trunk/modules/org.apache.rave$rave-portal/builds/2012-12-30_19-05-40/archive/org.apache.rave/rave-portal/0.19-SNAPSHOT/rave-portal-0.19-SNAPSHOT-sources.jar
> [JENKINS] Archiving <
> https://builds.apache.org/job/rave-project-trunk/ws/trunk/rave-portal-dependencies/pom.xml>
> to
> /home/hudson/hudson/jobs/rave-project-trunk/modules/org.apache.rave$rave-portal-dependencies/builds/2012-12-30_19-05-40/archive/org.apache.rave/rave-portal-dependencies/0.19-SNAPSHOT/rave-portal-dependencies-0.19-SNAPSHOT.pom
> [JENKINS] Archiving <
> https://builds.apache.org/job/rave-project-trunk/ws/trunk/rave-integration-tests/rave-default-account-tests/pom.xml>
> to
> /home/hudson/hudson/jobs/rave-project-trunk/modules/org.apache.rave.integration-tests$rave-default-account-tests/builds/2012-12-30_19-05-40/archive/org.apache.rave.integration-tests/rave-default-account-tests/0.19-SNAPSHOT/rave-default-account-tests-0.19-SNAPSHOT.pom
> [JENKINS] Archiving <
> https://builds.apache.org/job/rave-project-trunk/ws/trunk/rave-integration-tests/rave-default-account-tests/target/rave-default-account-tests-0.19-SNAPSHOT.jar>
> to
> /home/hudson/hudson/jobs/rave-project-trunk/modules/org.apache.rave.integration-tests$rave-default-account-tests/builds/2012-12-30_19-05-40/archive/org.apache.rave.integration-tests/rave-default-account-tests/0.19-SNAPSHOT/rave-default-account-tests-0.19-SNAPSHOT.jar
> [JENKINS] Archiving <
> https://builds.apache.org/job/rave-project-trunk/ws/trunk/rave-integration-tests/rave-default-account-tests/target/rave-default-account-tests-0.19-SNAPSHOT-sources.jar>
> to
> /home/hudson/hudson/jobs/rave-project-trunk/modules/org.apache.rave.integration-tests$rave-default-account-tests/builds/2012-12-30_19-05-40/archive/org.apache.rave.integration-tests/rave-default-account-tests/0.19-SNAPSHOT/rave-default-account-tests-0.19-SNAPSHOT-sources.jar
> [JENKINS] Archiving <
> https://builds.apache.org/job/rave-project-trunk/ws/trunk/rave-integration-tests/rave-core-tests/pom.xml>
> to
> /home/hudson/hudson/jobs/rave-project-trunk/modules/org.apache.rave.integration-tests$rave-core-tests/builds/2012-12-30_19-05-40/archive/org.apache.rave.integration-tests/rave-core-tests/0.19-SNAPSHOT/rave-core-tests-0.19-SNAPSHOT.pom
> [JENKINS] Archiving <
> https://builds.apache.org/job/rave-project-trunk/ws/trunk/rave-integration-tests/rave-core-tests/target/rave-core-tests-0.19-SNAPSHOT.jar>
> to
> /home/hudson/hudson/jobs/rave-project-trunk/modules/org.apache.rave.integration-tests$rave-core-tests/builds/2012-12-30_19-05-40/archive/org.apache.rave.integration-tests/rave-core-tests/0.19-SNAPSHOT/rave-core-tests-0.19-SNAPSHOT.jar
> [JENKINS] Archiving <
> https://builds.apache.org/job/rave-project-trunk/ws/trunk/rave-integration-tests/rave-core-tests/target/rave-core-tests-0.19-SNAPSHOT-sources.jar>
> to
> /home/hudson/hudson/jobs/rave-project-trunk/modules/org.apache.rave.integration-tests$rave-core-tests/builds/2012-12-30_19-05-40/archive/org.apache.rave.integration-tests/rave-core-tests/0.19-SNAPSHOT/rave-core-tests-0.19-SNAPSHOT-sources.jar
> [JENKINS] Archiving <
> https://builds.apache.org/job/rave-project-trunk/ws/trunk/rave-providers/rave-opensocial-provider/rave-opensocial-server/pom.xml>
> to
> /home/hudson/hudson/jobs/rave-project-trunk/modules/org.apache.rave$rave-opensocial-server/builds/2012-12-30_19-05-39/archive/org.apache.rave/rave-opensocial-server/0.19-SNAPSHOT/rave-opensocial-server-0.19-SNAPSHOT.pom
> [JENKINS] Archiving <
> https://builds.apache.org/job/rave-project-trunk/ws/trunk/rave-components/rave-web/pom.xml>
> to
> /home/hudson/hudson/jobs/rave-project-trunk/modules/org.apache.rave$rave-web/builds/2012-12-30_19-05-39/archive/org.apache.rave/rave-web/0.19-SNAPSHOT/rave-web-0.19-SNAPSHOT.pom
> [JENKINS] Archiving <
> https://builds.apache.org/job/rave-project-trunk/ws/trunk/rave-components/rave-web/target/rave-web-0.19-SNAPSHOT.jar>
> to
> /home/hudson/hudson/jobs/rave-project-trunk/modules/org.apache.rave$rave-web/builds/2012-12-30_19-05-39/archive/org.apache.rave/rave-web/0.19-SNAPSHOT/rave-web-0.19-SNAPSHOT.jar
> [JENKINS] Archiving <
> https://builds.apache.org/job/rave-project-trunk/ws/trunk/rave-components/rave-web/target/rave-web-0.19-SNAPSHOT-sources.jar>
> to
> /home/hudson/hudson/jobs/rave-project-trunk/modules/org.apache.rave$rave-web/builds/2012-12-30_19-05-39/archive/org.apache.rave/rave-web/0.19-SNAPSHOT/rave-web-0.19-SNAPSHOT-sources.jar
> [JENKINS] Archiving <
> https://builds.apache.org/job/rave-project-trunk/ws/trunk/rave-components/rave-jpa/pom.xml>
> to
> /home/hudson/hudson/jobs/rave-project-trunk/modules/org.apache.rave$rave-jpa/builds/2012-12-30_19-05-39/archive/org.apache.rave/rave-jpa/0.19-SNAPSHOT/rave-jpa-0.19-SNAPSHOT.pom
> [JENKINS] Archiving <
> https://builds.apache.org/job/rave-project-trunk/ws/trunk/rave-components/rave-jpa/target/rave-jpa-0.19-SNAPSHOT.jar>
> to
> /home/hudson/hudson/jobs/rave-project-trunk/modules/org.apache.rave$rave-jpa/builds/2012-12-30_19-05-39/archive/org.apache.rave/rave-jpa/0.19-SNAPSHOT/rave-jpa-0.19-SNAPSHOT.jar
> [JENKINS] Archiving <
> https://builds.apache.org/job/rave-project-trunk/ws/trunk/rave-components/rave-jpa/target/rave-jpa-0.19-SNAPSHOT-sources.jar>
> to
> /home/hudson/hudson/jobs/rave-project-trunk/modules/org.apache.rave$rave-jpa/builds/2012-12-30_19-05-39/archive/org.apache.rave/rave-jpa/0.19-SNAPSHOT/rave-jpa-0.19-SNAPSHOT-sources.jar
> [JENKINS] Archiving <
> https://builds.apache.org/job/rave-project-trunk/ws/trunk/pom.xml> to
> /home/hudson/hudson/jobs/rave-project-trunk/modules/org.apache.rave$rave-project/builds/2012-12-30_19-05-39/archive/org.apache.rave/rave-project/0.19-SNAPSHOT/rave-project-0.19-SNAPSHOT.pom
> [JENKINS] Archiving <
> https://builds.apache.org/job/rave-project-trunk/ws/trunk/rave-demo-gadgets/pom.xml>
> to
> /home/hudson/hudson/jobs/rave-project-trunk/modules/org.apache.rave$rave-demo-gadgets/builds/2012-12-30_19-05-40/archive/org.apache.rave/rave-demo-gadgets/0.19-SNAPSHOT/rave-demo-gadgets-0.19-SNAPSHOT.pom
> [JENKINS] Archiving <
> https://builds.apache.org/job/rave-project-trunk/ws/trunk/rave-demo-gadgets/target/rave-demo-gadgets-0.19-SNAPSHOT.war>
> to
> /home/hudson/hudson/jobs/rave-project-trunk/modules/org.apache.rave$rave-demo-gadgets/builds/2012-12-30_19-05-40/archive/org.apache.rave/rave-demo-gadgets/0.19-SNAPSHOT/rave-demo-gadgets-0.19-SNAPSHOT.war
> [JENKINS] Archiving <
> https://builds.apache.org/job/rave-project-trunk/ws/trunk/rave-demo-gadgets/target/rave-demo-gadgets-0.19-SNAPSHOT-sources.jar>
> to
> /home/hudson/hudson/jobs/rave-project-trunk/modules/org.apache.rave$rave-demo-gadgets/builds/2012-12-30_19-05-40/archive/org.apache.rave/rave-demo-gadgets/0.19-SNAPSHOT/rave-demo-gadgets-0.19-SNAPSHOT-sources.jar
> [JENKINS] Archiving <
> https://builds.apache.org/job/rave-project-trunk/ws/trunk/rave-providers/rave-opensocial-provider/pom.xml>
> to
> /home/hudson/hudson/jobs/rave-project-trunk/modules/org.apache.rave$rave-opensocial-provider/builds/2012-12-30_19-05-39/archive/org.apache.rave/rave-opensocial-provider/0.19-SNAPSHOT/rave-opensocial-provider-0.19-SNAPSHOT.pom
> [JENKINS] Archiving <
> https://builds.apache.org/job/rave-project-trunk/ws/trunk/rave-integration-tests/rave-newuser-tests/pom.xml>
> to
> /home/hudson/hudson/jobs/rave-project-trunk/modules/org.apache.rave.integration-tests$rave-newuser-tests/builds/2012-12-30_19-05-40/archive/org.apache.rave.integration-tests/rave-newuser-tests/0.19-SNAPSHOT/rave-newuser-tests-0.19-SNAPSHOT.pom
> [JENKINS] Archiving <
> https://builds.apache.org/job/rave-project-trunk/ws/trunk/rave-integration-tests/rave-newuser-tests/target/rave-newuser-tests-0.19-SNAPSHOT.jar>
> to
> /home/hudson/hudson/jobs/rave-project-trunk/modules/org.apache.rave.integration-tests$rave-newuser-tests/builds/2012-12-30_19-05-40/archive/org.apache.rave.integration-tests/rave-newuser-tests/0.19-SNAPSHOT/rave-newuser-tests-0.19-SNAPSHOT.jar
> [JENKINS] Archiving <
> https://builds.apache.org/job/rave-project-trunk/ws/trunk/rave-integration-tests/rave-newuser-tests/target/rave-newuser-tests-0.19-SNAPSHOT-sources.jar>
> to
> /home/hudson/hudson/jobs/rave-project-trunk/modules/org.apache.rave.integration-tests$rave-newuser-tests/builds/2012-12-30_19-05-40/archive/org.apache.rave.integration-tests/rave-newuser-tests/0.19-SNAPSHOT/rave-newuser-tests-0.19-SNAPSHOT-sources.jar
> Waiting for Jenkins to finish collecting data
> mavenExecutionResult exceptions not empty
> message : Failed to execute goal
> org.apache.maven.plugins:maven-antrun-plugin:1.7:run
> (generate-and-install-custom-rave-project) on project
> rave-custom-project-archetype: An Ant BuildException has occured: Java
> returned: 1
> around Ant part ...<java fork="true" dir="<
> https://builds.apache.org/job/rave-project-trunk/ws/trunk/rave-custom-project-archetype/target">
> classname="org.codehaus.classworlds.Launcher" failonerror="true">... @
> 7:190 in <
> https://builds.apache.org/job/rave-project-trunk/ws/trunk/rave-custom-project-archetype/target/antrun/build-main.xml
> >
> cause : An Ant BuildException has occured: Java returned: 1
> around Ant part ...<java fork="true" dir="<
> https://builds.apache.org/job/rave-project-trunk/ws/trunk/rave-custom-project-archetype/target">
> classname="org.codehaus.classworlds.Launcher" failonerror="true">... @
> 7:190 in <
> https://builds.apache.org/job/rave-project-trunk/ws/trunk/rave-custom-project-archetype/target/antrun/build-main.xml
> >
> Stack trace :
> org.apache.maven.lifecycle.LifecycleExecutionException: Failed to execute
> goal org.apache.maven.plugins:maven-antrun-plugin:1.7:run
> (generate-and-install-custom-rave-project) on project
> rave-custom-project-archetype: An Ant BuildException has occured: Java
> returned: 1
> around Ant part ...<java fork="true" dir="<
> https://builds.apache.org/job/rave-project-trunk/ws/trunk/rave-custom-project-archetype/target">
> classname="org.codehaus.classworlds.Launcher" failonerror="true">... @
> 7:190 in <
> https://builds.apache.org/job/rave-project-trunk/ws/trunk/rave-custom-project-archetype/target/antrun/build-main.xml
> >
>         at
> org.apache.maven.lifecycle.internal.MojoExecutor.execute(MojoExecutor.java:217)
>         at
> org.apache.maven.lifecycle.internal.MojoExecutor.execute(MojoExecutor.java:153)
>         at
> org.apache.maven.lifecycle.internal.MojoExecutor.execute(MojoExecutor.java:145)
>         at
> org.apache.maven.lifecycle.internal.LifecycleModuleBuilder.buildProject(LifecycleModuleBuilder.java:84)
>         at
> org.apache.maven.lifecycle.internal.LifecycleModuleBuilder.buildProject(LifecycleModuleBuilder.java:59)
>         at
> org.apache.maven.lifecycle.internal.LifecycleStarter.singleThreadedBuild(LifecycleStarter.java:183)
>         at
> org.apache.maven.lifecycle.internal.LifecycleStarter.execute(LifecycleStarter.java:161)
>         at org.apache.maven.DefaultMaven.doExecute(DefaultMaven.java:319)
>         at org.apache.maven.DefaultMaven.execute(DefaultMaven.java:156)
>         at
> org.jvnet.hudson.maven3.launcher.Maven3Launcher.main(Maven3Launcher.java:79)
>         at sun.reflect.NativeMethodAccessorImpl.invoke0(Native Method)
>         at
> sun.reflect.NativeMethodAccessorImpl.invoke(NativeMethodAccessorImpl.java:39)
>         at
> sun.reflect.DelegatingMethodAccessorImpl.invoke(DelegatingMethodAccessorImpl.java:25)
>         at java.lang.reflect.Method.invoke(Method.java:597)
>         at
> org.codehaus.plexus.classworlds.launcher.Launcher.launchStandard(Launcher.java:329)
>         at
> org.codehaus.plexus.classworlds.launcher.Launcher.launch(Launcher.java:239)
>         at
> org.jvnet.hudson.maven3.agent.Maven3Main.launch(Maven3Main.java:158)
>         at hudson.maven.Maven3Builder.call(Maven3Builder.java:98)
>         at hudson.maven.Maven3Builder.call(Maven3Builder.java:64)
>         at hudson.remoting.UserRequest.perform(UserRequest.java:118)
>         at hudson.remoting.UserRequest.perform(UserRequest.java:48)
>         at hudson.remoting.Request$2.run(Request.java:326)
>         at
> hudson.remoting.InterceptingExecutorService$1.call(InterceptingExecutorService.java:72)
>         at
> java.util.concurrent.FutureTask$Sync.innerRun(FutureTask.java:303)
>         at java.util.concurrent.FutureTask.run(FutureTask.java:138)
>         at
> java.util.concurrent.ThreadPoolExecutor$Worker.runTask(ThreadPoolExecutor.java:886)
>         at
> java.util.concurrent.ThreadPoolExecutor$Worker.run(ThreadPoolExecutor.java:908)
>         at java.lang.Thread.run(Thread.java:662)
> Caused by: org.apache.maven.plugin.MojoExecutionException: An Ant
> BuildException has occured: Java returned: 1
> around Ant part ...<java fork="true" dir="<
> https://builds.apache.org/job/rave-project-trunk/ws/trunk/rave-custom-project-archetype/target">
> classname="org.codehaus.classworlds.Launcher" failonerror="true">... @
> 7:190 in <
> https://builds.apache.org/job/rave-project-trunk/ws/trunk/rave-custom-project-archetype/target/antrun/build-main.xml
> >
>         at
> org.apache.maven.plugin.antrun.AntRunMojo.execute(AntRunMojo.java:355)
>         at
> org.apache.maven.plugin.DefaultBuildPluginManager.executeMojo(DefaultBuildPluginManager.java:101)
>         at
> org.apache.maven.lifecycle.internal.MojoExecutor.execute(MojoExecutor.java:209)
>         ... 27 more
> Caused by: <
> https://builds.apache.org/job/rave-project-trunk/ws/trunk/rave-custom-project-archetype/target/antrun/build-main.xml>:7:
> Java returned: 1
>         at org.apache.tools.ant.taskdefs.Java.execute(Java.java:111)
>         at
> org.apache.tools.ant.UnknownElement.execute(UnknownElement.java:291)
>         at sun.reflect.NativeMethodAccessorImpl.invoke0(Native Method)
>         at
> sun.reflect.NativeMethodAccessorImpl.invoke(NativeMethodAccessorImpl.java:39)
>         at
> sun.reflect.DelegatingMethodAccessorImpl.invoke(DelegatingMethodAccessorImpl.java:25)
>         at java.lang.reflect.Method.invoke(Method.java:597)
>         at
> org.apache.tools.ant.dispatch.DispatchUtils.execute(DispatchUtils.java:106)
>         at org.apache.tools.ant.Task.perform(Task.java:348)
>         at org.apache.tools.ant.Target.execute(Target.java:390)
>         at org.apache.tools.ant.Target.performTasks(Target.java:411)
>         at
> org.apache.tools.ant.Project.executeSortedTargets(Project.java:1399)
>         at org.apache.tools.ant.Project.executeTarget(Project.java:1368)
>         at
> org.apache.maven.plugin.antrun.AntRunMojo.execute(AntRunMojo.java:327)
>         ... 29 more
> Sending e-mails to: commits@rave.apache.org
> channel stopped
> Skipping Cobertura coverage report as build was not UNSTABLE or better ...
>

Mime
  • Unnamed multipart/alternative (inline, None, 0 bytes)
View raw message