spark-dev mailing list archives

Site index · List index
Message view « Date » · « Thread »
Top « Date » · « Thread »
From Sean Owen <so...@cloudera.com>
Subject Re: Spark 1.2.0 build error
Date Mon, 29 Dec 2014 08:52:07 GMT
It means a test failed but you have not shown the test failure. This would
have been logged earlier. You would need to say how you ran tests too. The
tests for 1.2.0 pass for me on several common permutations.
On Dec 29, 2014 3:22 AM, "Naveen Madhire" <vmadhire@umail.iu.edu> wrote:

> Hi,
>
> I am follow the below link for building Spark 1.2.0
>
> https://spark.apache.org/docs/1.2.0/building-spark.html
>
> I am getting the below error during the Maven build. I am using IntelliJ
> IDE.
>
> The build is failing in the scalatest plugin,
>
> [INFO] Reactor Summary:
> [INFO]
> [INFO] Spark Project Parent POM .......................... SUCCESS [3.355s]
> [INFO] Spark Project Networking .......................... SUCCESS [4.017s]
> [INFO] Spark Project Shuffle Streaming Service ........... SUCCESS [2.914s]
> [INFO] Spark Project Core ................................ FAILURE [9.678s]
> [INFO] Spark Project Bagel ............................... SKIPPED
> [INFO] Spark Project GraphX .............................. SKIPPED
>
>
>
> [ERROR] Failed to execute goal
> org.scalatest:scalatest-maven-plugin:1.0:test (test) on project
> spark-core_2.10: There are test failures -> [Help 1]
> org.apache.maven.lifecycle.LifecycleExecutionException: Failed to execute
> goal org.scalatest:scalatest-maven-plugin:1.0:test (test) on project
> spark-core_2.10: There are test failures
> at
>
> org.apache.maven.lifecycle.internal.MojoExecutor.execute(MojoExecutor.java:212)
> at
>
> org.apache.maven.lifecycle.internal.MojoExecutor.execute(MojoExecutor.java:153)
> at
>
> org.apache.maven.lifecycle.internal.MojoExecutor.execute(MojoExecutor.java:145)
> at
>
> org.apache.maven.lifecycle.internal.LifecycleModuleBuilder.buildProject(LifecycleModuleBuilder.java:84)
> at
>
> org.apache.maven.lifecycle.internal.LifecycleModuleBuilder.buildProject(LifecycleModuleBuilder.java:59)
> at
>
> org.apache.maven.lifecycle.internal.LifecycleStarter.singleThreadedBuild(LifecycleStarter.java:183)
> at
>
> org.apache.maven.lifecycle.internal.LifecycleStarter.execute(LifecycleStarter.java:161)
> at org.apache.maven.DefaultMaven.doExecute(DefaultMaven.java:317)
> at org.apache.maven.DefaultMaven.execute(DefaultMaven.java:152)
> at org.apache.maven.cli.MavenCli.execute(MavenCli.java:555)
> at org.apache.maven.cli.MavenCli.doMain(MavenCli.java:214)
>
>
> Is there something which I am missing during the build process. Please
> suggest.
>
> Using
> IntelliJ 13.1.6
> Maven 3.1.1
> Scala 2.10.4
> Spark 1.2.0
>
>
> Thanks
> Naveen
>

Mime
  • Unnamed multipart/alternative (inline, None, 0 bytes)
View raw message