spark-user mailing list archives

Site index · List index
Message view « Date » · « Thread »
Top « Date » · « Thread »
From Rohit Chaddha <rohitchaddha1...@gmail.com>
Subject build error - failing test- Error while building spark 2.0 trunk from github
Date Sun, 31 Jul 2016 16:54:28 GMT
-------------------------------------------------------
 T E S T S
-------------------------------------------------------
Running org.apache.spark.api.java.OptionalSuite
Tests run: 8, Failures: 0, Errors: 0, Skipped: 0, Time elapsed: 0.052 sec -
in org.apache.spark.api.java.OptionalSuite
Running org.apache.spark.JavaAPISuite
Tests run: 90, Failures: 1, Errors: 0, Skipped: 0, Time elapsed: 23.537 sec
<<< FAILURE! - in org.apache.spark.JavaAPISuite
wholeTextFiles(org.apache.spark.JavaAPISuite)  Time elapsed: 0.331 sec  <<<
FAILURE!
java.lang.AssertionError:
expected:<spark is easy to use.
> but was:<null>
        at
org.apache.spark.JavaAPISuite.wholeTextFiles(JavaAPISuite.java:1087)

Running org.apache.spark.JavaJdbcRDDSuite
Tests run: 1, Failures: 0, Errors: 0, Skipped: 0, Time elapsed: 0.799 sec -
in org.apache.spark.JavaJdbcRDDSuite
Running org.apache.spark.launcher.SparkLauncherSuite
Tests run: 2, Failures: 1, Errors: 0, Skipped: 0, Time elapsed: 0.04 sec
<<< FAILURE! - in org.apache.spark.launcher.SparkLauncherSuite
testChildProcLauncher(org.apache.spark.launcher.SparkLauncherSuite)  Time
elapsed: 0.03 sec  <<< FAILURE!
java.lang.AssertionError: expected:<0> but was:<1>
        at
org.apache.spark.launcher.SparkLauncherSuite.testChildProcLauncher(SparkLauncherSuite.java:110)

Running org.apache.spark.memory.TaskMemoryManagerSuite
Tests run: 6, Failures: 0, Errors: 0, Skipped: 0, Time elapsed: 0.011 sec -
in org.apache.spark.memory.TaskMemoryManagerSuite
Running org.apache.spark.shuffle.sort.PackedRecordPointerSuite
Tests run: 6, Failures: 0, Errors: 0, Skipped: 0, Time elapsed: 0.004 sec -
in org.apache.spark.shuffle.sort.PackedRecordPointerSuite
Running org.apache.spark.shuffle.sort.ShuffleInMemoryRadixSorterSuite
Tests run: 3, Failures: 0, Errors: 0, Skipped: 0, Time elapsed: 0.103 sec -
in org.apache.spark.shuffle.sort.ShuffleInMemoryRadixSorterSuite
Running org.apache.spark.shuffle.sort.ShuffleInMemorySorterSuite
Tests run: 3, Failures: 0, Errors: 0, Skipped: 0, Time elapsed: 0.199 sec -
in org.apache.spark.shuffle.sort.ShuffleInMemorySorterSuite
Running org.apache.spark.shuffle.sort.UnsafeShuffleWriterSuite
Tests run: 20, Failures: 0, Errors: 0, Skipped: 0, Time elapsed: 1.67 sec -
in org.apache.spark.shuffle.sort.UnsafeShuffleWriterSuite
Running org.apache.spark.unsafe.map.BytesToBytesMapOffHeapSuite
Tests run: 13, Failures: 0, Errors: 0, Skipped: 0, Time elapsed: 1.97 sec -
in org.apache.spark.unsafe.map.BytesToBytesMapOffHeapSuite
Running org.apache.spark.unsafe.map.BytesToBytesMapOnHeapSuite
Tests run: 13, Failures: 0, Errors: 0, Skipped: 0, Time elapsed: 1.583 sec
- in org.apache.spark.unsafe.map.BytesToBytesMapOnHeapSuite
Running
org.apache.spark.util.collection.unsafe.sort.UnsafeExternalSorterRadixSortSuite
Tests run: 10, Failures: 0, Errors: 0, Skipped: 0, Time elapsed: 0.533 sec
- in
org.apache.spark.util.collection.unsafe.sort.UnsafeExternalSorterRadixSortSuite
Running
org.apache.spark.util.collection.unsafe.sort.UnsafeExternalSorterSuite
Tests run: 10, Failures: 0, Errors: 0, Skipped: 0, Time elapsed: 0.606 sec
- in org.apache.spark.util.collection.unsafe.sort.UnsafeExternalSorterSuite
Running
org.apache.spark.util.collection.unsafe.sort.UnsafeInMemorySorterRadixSortSuite
Tests run: 2, Failures: 0, Errors: 0, Skipped: 0, Time elapsed: 0.007 sec -
in
org.apache.spark.util.collection.unsafe.sort.UnsafeInMemorySorterRadixSortSuite
Running
org.apache.spark.util.collection.unsafe.sort.UnsafeInMemorySorterSuite
Tests run: 2, Failures: 0, Errors: 0, Skipped: 0, Time elapsed: 0.001 sec -
in org.apache.spark.util.collection.unsafe.sort.UnsafeInMemorySorterSuite
Java HotSpot(TM) 64-Bit Server VM warning: ignoring option
MaxPermSize=512m; support was removed in 8.0

Results :

Failed tests:
  JavaAPISuite.wholeTextFiles:1087 expected:<spark is easy to use.
> but was:<null>
  SparkLauncherSuite.testChildProcLauncher:110 expected:<0> but was:<1>

Tests run: 189, Failures: 2, Errors: 0, Skipped: 0

Mime
View raw message