subversion-notifications mailing list archives

Site index · List index
Message view « Date » · « Thread »
Top « Date » · « Thread »
From Apache Hudson Server <hud...@hudson.zones.apache.org>
Subject Build failed in Hudson: subversion-trunk-ubuntu #588
Date Wed, 31 Mar 2010 03:20:40 GMT
See <http://hudson.zones.apache.org/hudson/job/subversion-trunk-ubuntu/588/changes>

Changes:

[gstein] Removing the use of entry_modify2() resulted in copyfrom information in
the database that did NOT get elided. We do this manually (for now),
though the most-correct resolution is to prevent that stray copyfrom
information from getting into the database in the first place.

* subversion/libsvn_wc/workqueue.c:
  (run_revert): go ahead and use db_global_record_fileinfo(), but follow
    it up with a call to db_temp_elide_copyfrom()

------------------------------------------
[...truncated 1486 lines...]
<http://hudson.zones.apache.org/hudson/job/subversion-trunk-ubuntu/ws/subversion-trunk/apr/libtool> --tag=CC --silent --mode=compile gcc -DLINUX=2 -D_REENTRANT -D_GNU_SOURCE  -Wold-style-definition -Wdeclaration-after-statement -Wpointer-arith -Wwrite-strings -Wshadow -ansi -Wall -Wformat=2 -Wunused -Waggregate-return -Wstrict-prototypes -Wmissing-prototypes -Wmissing-declarations -Wno-multichar -Wredundant-decls -Wnested-externs -Wunreachable-code -Winline -Wno-long-long -g -g -Wall -Wmissing-prototypes -Wstrict-prototypes -Wmissing-declarations -pthread -Werror=implicit-function-declaration  -DSVN_DEBUG -DAP_DEBUG  -I./subversion/include -I./subversion -I<http://hudson.zones.apache.org/hudson/job/subversion-trunk-ubuntu/ws/subversion-trunk/apr/include>   -I<http://hudson.zones.apache.org/hudson/job/subversion-trunk-ubuntu/ws/subversion-trunk/apr-util/include> -I<http://hudson.zones.apache.org/hudson/job/subversion-trunk-ubuntu/ws/subversion-trunk/sqlite-amalgamation>  -static  -o subversion/tests/libsvn_subr/cache-test.lo -c subversion/tests/libsvn_subr/cache-test.c
cd subversion/tests/libsvn_subr && <http://hudson.zones.apache.org/hudson/job/subversion-trunk-ubuntu/ws/subversion-trunk/apr/libtool> --tag=CC --silent --mode=link gcc -static  -Wold-style-definition -Wdeclaration-after-statement -Wpointer-arith -Wwrite-strings -Wshadow -ansi -Wall -Wformat=2 -Wunused -Waggregate-return -Wstrict-prototypes -Wmissing-prototypes -Wmissing-declarations -Wno-multichar -Wredundant-decls -Wnested-externs -Wunreachable-code -Winline -Wno-long-long -g -g -Wall -Wmissing-prototypes -Wstrict-prototypes -Wmissing-declarations -pthread -Werror=implicit-function-declaration  -DSVN_DEBUG -DAP_DEBUG   -rpath /usr/local/lib  -o cache-test  cache-test.lo ../../../subversion/tests/libsvn_test-1.la ../../../subversion/libsvn_subr/libsvn_subr-1.la -L<http://hudson.zones.apache.org/hudson/job/subversion-trunk-ubuntu/ws/subversion-trunk/apr> -lapr-1 
cd subversion/tests/libsvn_subr && <http://hudson.zones.apache.org/hudson/job/subversion-trunk-ubuntu/ws/subversion-trunk/apr/libtool> --tag=CC --silent --mode=link gcc -static  -Wold-style-definition -Wdeclaration-after-statement -Wpointer-arith -Wwrite-strings -Wshadow -ansi -Wall -Wformat=2 -Wunused -Waggregate-return -Wstrict-prototypes -Wmissing-prototypes -Wmissing-declarations -Wno-multichar -Wredundant-decls -Wnested-externs -Wunreachable-code -Winline -Wno-long-long -g -g -Wall -Wmissing-prototypes -Wstrict-prototypes -Wmissing-declarations -pthread -Werror=implicit-function-declaration  -DSVN_DEBUG -DAP_DEBUG   -rpath /usr/local/lib  -o checksum-test  checksum-test.lo ../../../subversion/tests/libsvn_test-1.la ../../../subversion/libsvn_subr/libsvn_subr-1.la -L<http://hudson.zones.apache.org/hudson/job/subversion-trunk-ubuntu/ws/subversion-trunk/apr> -lapr-1 
cd subversion/tests/libsvn_client && <http://hudson.zones.apache.org/hudson/job/subversion-trunk-ubuntu/ws/subversion-trunk/apr/libtool> --tag=CC --silent --mode=link gcc -static  -Wold-style-definition -Wdeclaration-after-statement -Wpointer-arith -Wwrite-strings -Wshadow -ansi -Wall -Wformat=2 -Wunused -Waggregate-return -Wstrict-prototypes -Wmissing-prototypes -Wmissing-declarations -Wno-multichar -Wredundant-decls -Wnested-externs -Wunreachable-code -Winline -Wno-long-long -g -g -Wall -Wmissing-prototypes -Wstrict-prototypes -Wmissing-declarations -pthread -Werror=implicit-function-declaration  -DSVN_DEBUG -DAP_DEBUG   -rpath /usr/local/lib  -o client-test  client-test.lo ../../../subversion/tests/libsvn_test-1.la ../../../subversion/libsvn_client/libsvn_client-1.la ../../../subversion/libsvn_repos/libsvn_repos-1.la ../../../subversion/libsvn_ra/libsvn_ra-1.la ../../../subversion/libsvn_fs/libsvn_fs-1.la ../../../subversion/libsvn_delta/libsvn_delta-1.la ../../../subversion/libsvn_subr/libsvn_subr-1.la -L<http://hudson.zones.apache.org/hudson/job/subversion-trunk-ubuntu/ws/subversion-trunk/apr-util> -laprutil-1 -L<http://hudson.zones.apache.org/hudson/job/subversion-trunk-ubuntu/ws/subversion-trunk/apr> -lapr-1  
cd subversion/tests/libsvn_subr && <http://hudson.zones.apache.org/hudson/job/subversion-trunk-ubuntu/ws/subversion-trunk/apr/libtool> --tag=CC --silent --mode=link gcc -static  -Wold-style-definition -Wdeclaration-after-statement -Wpointer-arith -Wwrite-strings -Wshadow -ansi -Wall -Wformat=2 -Wunused -Waggregate-return -Wstrict-prototypes -Wmissing-prototypes -Wmissing-declarations -Wno-multichar -Wredundant-decls -Wnested-externs -Wunreachable-code -Winline -Wno-long-long -g -g -Wall -Wmissing-prototypes -Wstrict-prototypes -Wmissing-declarations -pthread -Werror=implicit-function-declaration  -DSVN_DEBUG -DAP_DEBUG   -rpath /usr/local/lib  -o compat-test  compat-test.lo ../../../subversion/tests/libsvn_test-1.la ../../../subversion/libsvn_subr/libsvn_subr-1.la -L<http://hudson.zones.apache.org/hudson/job/subversion-trunk-ubuntu/ws/subversion-trunk/apr> -lapr-1 
cd subversion/tests/libsvn_subr && <http://hudson.zones.apache.org/hudson/job/subversion-trunk-ubuntu/ws/subversion-trunk/apr/libtool> --tag=CC --silent --mode=link gcc -static  -Wold-style-definition -Wdeclaration-after-statement -Wpointer-arith -Wwrite-strings -Wshadow -ansi -Wall -Wformat=2 -Wunused -Waggregate-return -Wstrict-prototypes -Wmissing-prototypes -Wmissing-declarations -Wno-multichar -Wredundant-decls -Wnested-externs -Wunreachable-code -Winline -Wno-long-long -g -g -Wall -Wmissing-prototypes -Wstrict-prototypes -Wmissing-declarations -pthread -Werror=implicit-function-declaration  -DSVN_DEBUG -DAP_DEBUG   -rpath /usr/local/lib  -o config-test  config-test.lo ../../../subversion/tests/libsvn_test-1.la ../../../subversion/libsvn_subr/libsvn_subr-1.la -L<http://hudson.zones.apache.org/hudson/job/subversion-trunk-ubuntu/ws/subversion-trunk/apr-util> -laprutil-1 -L<http://hudson.zones.apache.org/hudson/job/subversion-trunk-ubuntu/ws/subversion-trunk/apr> -lapr-1 
<http://hudson.zones.apache.org/hudson/job/subversion-trunk-ubuntu/ws/subversion-trunk/apr/libtool> --tag=CC --silent --mode=compile gcc -DLINUX=2 -D_REENTRANT -D_GNU_SOURCE  -Wold-style-definition -Wdeclaration-after-statement -Wpointer-arith -Wwrite-strings -Wshadow -ansi -Wall -Wformat=2 -Wunused -Waggregate-return -Wstrict-prototypes -Wmissing-prototypes -Wmissing-declarations -Wno-multichar -Wredundant-decls -Wnested-externs -Wunreachable-code -Winline -Wno-long-long -g -g -Wall -Wmissing-prototypes -Wstrict-prototypes -Wmissing-declarations -pthread -Werror=implicit-function-declaration  -DSVN_DEBUG -DAP_DEBUG  -I./subversion/include -I./subversion -I<http://hudson.zones.apache.org/hudson/job/subversion-trunk-ubuntu/ws/subversion-trunk/apr/include>   -I<http://hudson.zones.apache.org/hudson/job/subversion-trunk-ubuntu/ws/subversion-trunk/apr-util/include> -I<http://hudson.zones.apache.org/hudson/job/subversion-trunk-ubuntu/ws/subversion-trunk/sqlite-amalgamation>  -static  -o subversion/tests/libsvn_wc/db-test.lo -c subversion/tests/libsvn_wc/db-test.c
cd subversion/tests/libsvn_wc && <http://hudson.zones.apache.org/hudson/job/subversion-trunk-ubuntu/ws/subversion-trunk/apr/libtool> --tag=CC --silent --mode=link gcc -static  -Wold-style-definition -Wdeclaration-after-statement -Wpointer-arith -Wwrite-strings -Wshadow -ansi -Wall -Wformat=2 -Wunused -Waggregate-return -Wstrict-prototypes -Wmissing-prototypes -Wmissing-declarations -Wno-multichar -Wredundant-decls -Wnested-externs -Wunreachable-code -Winline -Wno-long-long -g -g -Wall -Wmissing-prototypes -Wstrict-prototypes -Wmissing-declarations -pthread -Werror=implicit-function-declaration  -DSVN_DEBUG -DAP_DEBUG   -rpath /usr/local/lib  -o db-test  db-test.lo ../../../subversion/tests/libsvn_test-1.la ../../../subversion/libsvn_wc/libsvn_wc-1.la ../../../subversion/libsvn_subr/libsvn_subr-1.la -L<http://hudson.zones.apache.org/hudson/job/subversion-trunk-ubuntu/ws/subversion-trunk/apr-util> -laprutil-1 -L<http://hudson.zones.apache.org/hudson/job/subversion-trunk-ubuntu/ws/subversion-trunk/apr> -lapr-1 
cd subversion/tests/libsvn_diff && <http://hudson.zones.apache.org/hudson/job/subversion-trunk-ubuntu/ws/subversion-trunk/apr/libtool> --tag=CC --silent --mode=link gcc -static  -Wold-style-definition -Wdeclaration-after-statement -Wpointer-arith -Wwrite-strings -Wshadow -ansi -Wall -Wformat=2 -Wunused -Waggregate-return -Wstrict-prototypes -Wmissing-prototypes -Wmissing-declarations -Wno-multichar -Wredundant-decls -Wnested-externs -Wunreachable-code -Winline -Wno-long-long -g -g -Wall -Wmissing-prototypes -Wstrict-prototypes -Wmissing-declarations -pthread -Werror=implicit-function-declaration  -DSVN_DEBUG -DAP_DEBUG   -rpath /usr/local/lib  -o diff-diff3-test  diff-diff3-test.lo ../../../subversion/tests/libsvn_test-1.la ../../../subversion/libsvn_diff/libsvn_diff-1.la ../../../subversion/libsvn_subr/libsvn_subr-1.la -L<http://hudson.zones.apache.org/hudson/job/subversion-trunk-ubuntu/ws/subversion-trunk/apr-util> -laprutil-1 -L<http://hudson.zones.apache.org/hudson/job/subversion-trunk-ubuntu/ws/subversion-trunk/apr> -lapr-1 
cd subversion/tests/libsvn_subr && <http://hudson.zones.apache.org/hudson/job/subversion-trunk-ubuntu/ws/subversion-trunk/apr/libtool> --tag=CC --silent --mode=link gcc -static  -Wold-style-definition -Wdeclaration-after-statement -Wpointer-arith -Wwrite-strings -Wshadow -ansi -Wall -Wformat=2 -Wunused -Waggregate-return -Wstrict-prototypes -Wmissing-prototypes -Wmissing-declarations -Wno-multichar -Wredundant-decls -Wnested-externs -Wunreachable-code -Winline -Wno-long-long -g -g -Wall -Wmissing-prototypes -Wstrict-prototypes -Wmissing-declarations -pthread -Werror=implicit-function-declaration  -DSVN_DEBUG -DAP_DEBUG   -rpath /usr/local/lib  -o dirent_uri-test  dirent_uri-test.lo ../../../subversion/tests/libsvn_test-1.la ../../../subversion/libsvn_subr/libsvn_subr-1.la -L<http://hudson.zones.apache.org/hudson/job/subversion-trunk-ubuntu/ws/subversion-trunk/apr-util> -laprutil-1 -L<http://hudson.zones.apache.org/hudson/job/subversion-trunk-ubuntu/ws/subversion-trunk/apr> -lapr-1 
cd subversion/tests/cmdline && <http://hudson.zones.apache.org/hudson/job/subversion-trunk-ubuntu/ws/subversion-trunk/apr/libtool> --tag=CC --silent --mode=link gcc -static  -Wold-style-definition -Wdeclaration-after-statement -Wpointer-arith -Wwrite-strings -Wshadow -ansi -Wall -Wformat=2 -Wunused -Waggregate-return -Wstrict-prototypes -Wmissing-prototypes -Wmissing-declarations -Wno-multichar -Wredundant-decls -Wnested-externs -Wunreachable-code -Winline -Wno-long-long -g -g -Wall -Wmissing-prototypes -Wstrict-prototypes -Wmissing-declarations -pthread -Werror=implicit-function-declaration  -DSVN_DEBUG -DAP_DEBUG   -rpath /usr/local/lib  -o entries-dump  entries-dump.lo ../../../subversion/libsvn_wc/libsvn_wc-1.la ../../../subversion/libsvn_subr/libsvn_subr-1.la -L<http://hudson.zones.apache.org/hudson/job/subversion-trunk-ubuntu/ws/subversion-trunk/apr-util> -laprutil-1 -L<http://hudson.zones.apache.org/hudson/job/subversion-trunk-ubuntu/ws/subversion-trunk/apr> -lapr-1 
cd subversion/tests/libsvn_subr && <http://hudson.zones.apache.org/hudson/job/subversion-trunk-ubuntu/ws/subversion-trunk/apr/libtool> --tag=CC --silent --mode=link gcc -static  -Wold-style-definition -Wdeclaration-after-statement -Wpointer-arith -Wwrite-strings -Wshadow -ansi -Wall -Wformat=2 -Wunused -Waggregate-return -Wstrict-prototypes -Wmissing-prototypes -Wmissing-declarations -Wno-multichar -Wredundant-decls -Wnested-externs -Wunreachable-code -Winline -Wno-long-long -g -g -Wall -Wmissing-prototypes -Wstrict-prototypes -Wmissing-declarations -pthread -Werror=implicit-function-declaration  -DSVN_DEBUG -DAP_DEBUG   -rpath /usr/local/lib  -o eol-test  eol-test.lo ../../../subversion/tests/libsvn_test-1.la ../../../subversion/libsvn_subr/libsvn_subr-1.la -L<http://hudson.zones.apache.org/hudson/job/subversion-trunk-ubuntu/ws/subversion-trunk/apr-util> -laprutil-1 -L<http://hudson.zones.apache.org/hudson/job/subversion-trunk-ubuntu/ws/subversion-trunk/apr> -lapr-1 
cd subversion/tests/libsvn_subr && <http://hudson.zones.apache.org/hudson/job/subversion-trunk-ubuntu/ws/subversion-trunk/apr/libtool> --tag=CC --silent --mode=link gcc -static  -Wold-style-definition -Wdeclaration-after-statement -Wpointer-arith -Wwrite-strings -Wshadow -ansi -Wall -Wformat=2 -Wunused -Waggregate-return -Wstrict-prototypes -Wmissing-prototypes -Wmissing-declarations -Wno-multichar -Wredundant-decls -Wnested-externs -Wunreachable-code -Winline -Wno-long-long -g -g -Wall -Wmissing-prototypes -Wstrict-prototypes -Wmissing-declarations -pthread -Werror=implicit-function-declaration  -DSVN_DEBUG -DAP_DEBUG   -rpath /usr/local/lib  -o error-test  error-test.lo ../../../subversion/tests/libsvn_test-1.la ../../../subversion/libsvn_subr/libsvn_subr-1.la -L<http://hudson.zones.apache.org/hudson/job/subversion-trunk-ubuntu/ws/subversion-trunk/apr-util> -laprutil-1 -L<http://hudson.zones.apache.org/hudson/job/subversion-trunk-ubuntu/ws/subversion-trunk/apr> -lapr-1 
cd subversion/tests/libsvn_fs_fs && <http://hudson.zones.apache.org/hudson/job/subversion-trunk-ubuntu/ws/subversion-trunk/apr/libtool> --tag=CC --silent --mode=link gcc -static  -Wold-style-definition -Wdeclaration-after-statement -Wpointer-arith -Wwrite-strings -Wshadow -ansi -Wall -Wformat=2 -Wunused -Waggregate-return -Wstrict-prototypes -Wmissing-prototypes -Wmissing-declarations -Wno-multichar -Wredundant-decls -Wnested-externs -Wunreachable-code -Winline -Wno-long-long -g -g -Wall -Wmissing-prototypes -Wstrict-prototypes -Wmissing-declarations -pthread -Werror=implicit-function-declaration  -DSVN_DEBUG -DAP_DEBUG   -rpath /usr/local/lib  -o fs-pack-test  fs-pack-test.lo ../../../subversion/tests/libsvn_test-1.la ../../../subversion/libsvn_fs/libsvn_fs-1.la ../../../subversion/libsvn_fs_fs/libsvn_fs_fs-1.la ../../../subversion/libsvn_delta/libsvn_delta-1.la ../../../subversion/libsvn_subr/libsvn_subr-1.la -L<http://hudson.zones.apache.org/hudson/job/subversion-trunk-ubuntu/ws/subversion-trunk/apr-util> -laprutil-1 -L<http://hudson.zones.apache.org/hudson/job/subversion-trunk-ubuntu/ws/subversion-trunk/apr> -lapr-1 
cd subversion/tests/libsvn_fs && <http://hudson.zones.apache.org/hudson/job/subversion-trunk-ubuntu/ws/subversion-trunk/apr/libtool> --tag=CC --silent --mode=link gcc -static  -Wold-style-definition -Wdeclaration-after-statement -Wpointer-arith -Wwrite-strings -Wshadow -ansi -Wall -Wformat=2 -Wunused -Waggregate-return -Wstrict-prototypes -Wmissing-prototypes -Wmissing-declarations -Wno-multichar -Wredundant-decls -Wnested-externs -Wunreachable-code -Winline -Wno-long-long -g -g -Wall -Wmissing-prototypes -Wstrict-prototypes -Wmissing-declarations -pthread -Werror=implicit-function-declaration  -DSVN_DEBUG -DAP_DEBUG   -rpath /usr/local/lib  -o fs-test  fs-test.lo ../../../subversion/tests/libsvn_test-1.la ../../../subversion/libsvn_fs/libsvn_fs-1.la ../../../subversion/libsvn_delta/libsvn_delta-1.la ../../../subversion/libsvn_subr/libsvn_subr-1.la -L<http://hudson.zones.apache.org/hudson/job/subversion-trunk-ubuntu/ws/subversion-trunk/apr-util> -laprutil-1 -L<http://hudson.zones.apache.org/hudson/job/subversion-trunk-ubuntu/ws/subversion-trunk/apr> -lapr-1 
cd subversion/tests/libsvn_subr && <http://hudson.zones.apache.org/hudson/job/subversion-trunk-ubuntu/ws/subversion-trunk/apr/libtool> --tag=CC --silent --mode=link gcc -static  -Wold-style-definition -Wdeclaration-after-statement -Wpointer-arith -Wwrite-strings -Wshadow -ansi -Wall -Wformat=2 -Wunused -Waggregate-return -Wstrict-prototypes -Wmissing-prototypes -Wmissing-declarations -Wno-multichar -Wredundant-decls -Wnested-externs -Wunreachable-code -Winline -Wno-long-long -g -g -Wall -Wmissing-prototypes -Wstrict-prototypes -Wmissing-declarations -pthread -Werror=implicit-function-declaration  -DSVN_DEBUG -DAP_DEBUG   -rpath /usr/local/lib  -o hashdump-test  hashdump-test.lo ../../../subversion/tests/libsvn_test-1.la ../../../subversion/libsvn_subr/libsvn_subr-1.la -L<http://hudson.zones.apache.org/hudson/job/subversion-trunk-ubuntu/ws/subversion-trunk/apr-util> -laprutil-1 -L<http://hudson.zones.apache.org/hudson/job/subversion-trunk-ubuntu/ws/subversion-trunk/apr> -lapr-1 
cd subversion/tests/libsvn_fs && <http://hudson.zones.apache.org/hudson/job/subversion-trunk-ubuntu/ws/subversion-trunk/apr/libtool> --tag=CC --silent --mode=link gcc -static  -Wold-style-definition -Wdeclaration-after-statement -Wpointer-arith -Wwrite-strings -Wshadow -ansi -Wall -Wformat=2 -Wunused -Waggregate-return -Wstrict-prototypes -Wmissing-prototypes -Wmissing-declarations -Wno-multichar -Wredundant-decls -Wnested-externs -Wunreachable-code -Winline -Wno-long-long -g -g -Wall -Wmissing-prototypes -Wstrict-prototypes -Wmissing-declarations -pthread -Werror=implicit-function-declaration  -DSVN_DEBUG -DAP_DEBUG   -rpath /usr/local/lib  -o locks-test  locks-test.lo ../../../subversion/tests/libsvn_test-1.la ../../../subversion/libsvn_fs/libsvn_fs-1.la ../../../subversion/libsvn_delta/libsvn_delta-1.la ../../../subversion/libsvn_subr/libsvn_subr-1.la -L<http://hudson.zones.apache.org/hudson/job/subversion-trunk-ubuntu/ws/subversion-trunk/apr-util> -laprutil-1 -L<http://hudson.zones.apache.org/hudson/job/subversion-trunk-ubuntu/ws/subversion-trunk/apr> -lapr-1 
cd subversion/tests/libsvn_subr && <http://hudson.zones.apache.org/hudson/job/subversion-trunk-ubuntu/ws/subversion-trunk/apr/libtool> --tag=CC --silent --mode=link gcc -static  -Wold-style-definition -Wdeclaration-after-statement -Wpointer-arith -Wwrite-strings -Wshadow -ansi -Wall -Wformat=2 -Wunused -Waggregate-return -Wstrict-prototypes -Wmissing-prototypes -Wmissing-declarations -Wno-multichar -Wredundant-decls -Wnested-externs -Wunreachable-code -Winline -Wno-long-long -g -g -Wall -Wmissing-prototypes -Wstrict-prototypes -Wmissing-declarations -pthread -Werror=implicit-function-declaration  -DSVN_DEBUG -DAP_DEBUG   -rpath /usr/local/lib  -o mergeinfo-test  mergeinfo-test.lo ../../../subversion/tests/libsvn_test-1.la ../../../subversion/libsvn_subr/libsvn_subr-1.la -L<http://hudson.zones.apache.org/hudson/job/subversion-trunk-ubuntu/ws/subversion-trunk/apr> -lapr-1 
cd subversion/tests/libsvn_subr && <http://hudson.zones.apache.org/hudson/job/subversion-trunk-ubuntu/ws/subversion-trunk/apr/libtool> --tag=CC --silent --mode=link gcc -static  -Wold-style-definition -Wdeclaration-after-statement -Wpointer-arith -Wwrite-strings -Wshadow -ansi -Wall -Wformat=2 -Wunused -Waggregate-return -Wstrict-prototypes -Wmissing-prototypes -Wmissing-declarations -Wno-multichar -Wredundant-decls -Wnested-externs -Wunreachable-code -Winline -Wno-long-long -g -g -Wall -Wmissing-prototypes -Wstrict-prototypes -Wmissing-declarations -pthread -Werror=implicit-function-declaration  -DSVN_DEBUG -DAP_DEBUG   -rpath /usr/local/lib  -o opt-test  opt-test.lo ../../../subversion/tests/libsvn_test-1.la ../../../subversion/libsvn_subr/libsvn_subr-1.la -L<http://hudson.zones.apache.org/hudson/job/subversion-trunk-ubuntu/ws/subversion-trunk/apr> -lapr-1 
cd subversion/tests/libsvn_diff && <http://hudson.zones.apache.org/hudson/job/subversion-trunk-ubuntu/ws/subversion-trunk/apr/libtool> --tag=CC --silent --mode=link gcc -static  -Wold-style-definition -Wdeclaration-after-statement -Wpointer-arith -Wwrite-strings -Wshadow -ansi -Wall -Wformat=2 -Wunused -Waggregate-return -Wstrict-prototypes -Wmissing-prototypes -Wmissing-declarations -Wno-multichar -Wredundant-decls -Wnested-externs -Wunreachable-code -Winline -Wno-long-long -g -g -Wall -Wmissing-prototypes -Wstrict-prototypes -Wmissing-declarations -pthread -Werror=implicit-function-declaration  -DSVN_DEBUG -DAP_DEBUG   -rpath /usr/local/lib  -o parse-diff-test  parse-diff-test.lo ../../../subversion/tests/libsvn_test-1.la ../../../subversion/libsvn_diff/libsvn_diff-1.la ../../../subversion/libsvn_subr/libsvn_subr-1.la -L<http://hudson.zones.apache.org/hudson/job/subversion-trunk-ubuntu/ws/subversion-trunk/apr-util> -laprutil-1 -L<http://hudson.zones.apache.org/hudson/job/subversion-trunk-ubuntu/ws/subversion-trunk/apr> -lapr-1 
cd subversion/tests/libsvn_subr && <http://hudson.zones.apache.org/hudson/job/subversion-trunk-ubuntu/ws/subversion-trunk/apr/libtool> --tag=CC --silent --mode=link gcc -static  -Wold-style-definition -Wdeclaration-after-statement -Wpointer-arith -Wwrite-strings -Wshadow -ansi -Wall -Wformat=2 -Wunused -Waggregate-return -Wstrict-prototypes -Wmissing-prototypes -Wmissing-declarations -Wno-multichar -Wredundant-decls -Wnested-externs -Wunreachable-code -Winline -Wno-long-long -g -g -Wall -Wmissing-prototypes -Wstrict-prototypes -Wmissing-declarations -pthread -Werror=implicit-function-declaration  -DSVN_DEBUG -DAP_DEBUG   -rpath /usr/local/lib  -o path-test  path-test.lo ../../../subversion/tests/libsvn_test-1.la ../../../subversion/libsvn_subr/libsvn_subr-1.la -L<http://hudson.zones.apache.org/hudson/job/subversion-trunk-ubuntu/ws/subversion-trunk/apr-util> -laprutil-1 -L<http://hudson.zones.apache.org/hudson/job/subversion-trunk-ubuntu/ws/subversion-trunk/apr> -lapr-1 
cd subversion/tests/libsvn_ra_local && <http://hudson.zones.apache.org/hudson/job/subversion-trunk-ubuntu/ws/subversion-trunk/apr/libtool> --tag=CC --silent --mode=link gcc -static  -Wold-style-definition -Wdeclaration-after-statement -Wpointer-arith -Wwrite-strings -Wshadow -ansi -Wall -Wformat=2 -Wunused -Waggregate-return -Wstrict-prototypes -Wmissing-prototypes -Wmissing-declarations -Wno-multichar -Wredundant-decls -Wnested-externs -Wunreachable-code -Winline -Wno-long-long -g -g -Wall -Wmissing-prototypes -Wstrict-prototypes -Wmissing-declarations -pthread -Werror=implicit-function-declaration  -DSVN_DEBUG -DAP_DEBUG   -rpath /usr/local/lib  -o ra-local-test  ra-local-test.lo ../../../subversion/tests/libsvn_test-1.la ../../../subversion/libsvn_ra_local/libsvn_ra_local-1.la ../../../subversion/libsvn_ra/libsvn_ra-1.la ../../../subversion/libsvn_fs/libsvn_fs-1.la ../../../subversion/libsvn_delta/libsvn_delta-1.la ../../../subversion/libsvn_subr/libsvn_subr-1.la -L<http://hudson.zones.apache.org/hudson/job/subversion-trunk-ubuntu/ws/subversion-trunk/apr-util> -laprutil-1 -L<http://hudson.zones.apache.org/hudson/job/subversion-trunk-ubuntu/ws/subversion-trunk/apr> -lapr-1  
cd subversion/tests/libsvn_delta && <http://hudson.zones.apache.org/hudson/job/subversion-trunk-ubuntu/ws/subversion-trunk/apr/libtool> --tag=CC --silent --mode=link gcc -static  -Wold-style-definition -Wdeclaration-after-statement -Wpointer-arith -Wwrite-strings -Wshadow -ansi -Wall -Wformat=2 -Wunused -Waggregate-return -Wstrict-prototypes -Wmissing-prototypes -Wmissing-declarations -Wno-multichar -Wredundant-decls -Wnested-externs -Wunreachable-code -Winline -Wno-long-long -g -g -Wall -Wmissing-prototypes -Wstrict-prototypes -Wmissing-declarations -pthread -Werror=implicit-function-declaration  -DSVN_DEBUG -DAP_DEBUG   -rpath /usr/local/lib  -o random-test  random-test.lo ../../../subversion/tests/libsvn_test-1.la ../../../subversion/libsvn_delta/libsvn_delta-1.la ../../../subversion/libsvn_subr/libsvn_subr-1.la -L<http://hudson.zones.apache.org/hudson/job/subversion-trunk-ubuntu/ws/subversion-trunk/apr-util> -laprutil-1 -L<http://hudson.zones.apache.org/hudson/job/subversion-trunk-ubuntu/ws/subversion-trunk/apr> -lapr-1 
cd subversion/tests/libsvn_repos && <http://hudson.zones.apache.org/hudson/job/subversion-trunk-ubuntu/ws/subversion-trunk/apr/libtool> --tag=CC --silent --mode=link gcc -static  -Wold-style-definition -Wdeclaration-after-statement -Wpointer-arith -Wwrite-strings -Wshadow -ansi -Wall -Wformat=2 -Wunused -Waggregate-return -Wstrict-prototypes -Wmissing-prototypes -Wmissing-declarations -Wno-multichar -Wredundant-decls -Wnested-externs -Wunreachable-code -Winline -Wno-long-long -g -g -Wall -Wmissing-prototypes -Wstrict-prototypes -Wmissing-declarations -pthread -Werror=implicit-function-declaration  -DSVN_DEBUG -DAP_DEBUG   -rpath /usr/local/lib  -o repos-test  dir-delta-editor.lo repos-test.lo ../../../subversion/tests/libsvn_test-1.la ../../../subversion/libsvn_repos/libsvn_repos-1.la ../../../subversion/libsvn_fs/libsvn_fs-1.la ../../../subversion/libsvn_delta/libsvn_delta-1.la ../../../subversion/libsvn_subr/libsvn_subr-1.la -L<http://hudson.zones.apache.org/hudson/job/subversion-trunk-ubuntu/ws/subversion-trunk/apr-util> -laprutil-1 -L<http://hudson.zones.apache.org/hudson/job/subversion-trunk-ubuntu/ws/subversion-trunk/apr> -lapr-1 
cd subversion/tests/libsvn_subr && <http://hudson.zones.apache.org/hudson/job/subversion-trunk-ubuntu/ws/subversion-trunk/apr/libtool> --tag=CC --silent --mode=link gcc -static  -Wold-style-definition -Wdeclaration-after-statement -Wpointer-arith -Wwrite-strings -Wshadow -ansi -Wall -Wformat=2 -Wunused -Waggregate-return -Wstrict-prototypes -Wmissing-prototypes -Wmissing-declarations -Wno-multichar -Wredundant-decls -Wnested-externs -Wunreachable-code -Winline -Wno-long-long -g -g -Wall -Wmissing-prototypes -Wstrict-prototypes -Wmissing-declarations -pthread -Werror=implicit-function-declaration  -DSVN_DEBUG -DAP_DEBUG   -rpath /usr/local/lib  -o revision-test  revision-test.lo ../../../subversion/tests/libsvn_test-1.la ../../../subversion/libsvn_subr/libsvn_subr-1.la -L<http://hudson.zones.apache.org/hudson/job/subversion-trunk-ubuntu/ws/subversion-trunk/apr> -lapr-1 
cd subversion/tests/libsvn_subr && <http://hudson.zones.apache.org/hudson/job/subversion-trunk-ubuntu/ws/subversion-trunk/apr/libtool> --tag=CC --silent --mode=link gcc -static  -Wold-style-definition -Wdeclaration-after-statement -Wpointer-arith -Wwrite-strings -Wshadow -ansi -Wall -Wformat=2 -Wunused -Waggregate-return -Wstrict-prototypes -Wmissing-prototypes -Wmissing-declarations -Wno-multichar -Wredundant-decls -Wnested-externs -Wunreachable-code -Winline -Wno-long-long -g -g -Wall -Wmissing-prototypes -Wstrict-prototypes -Wmissing-declarations -pthread -Werror=implicit-function-declaration  -DSVN_DEBUG -DAP_DEBUG   -rpath /usr/local/lib  -o skel-test  skel-test.lo ../../../subversion/tests/libsvn_test-1.la ../../../subversion/libsvn_subr/libsvn_subr-1.la -L<http://hudson.zones.apache.org/hudson/job/subversion-trunk-ubuntu/ws/subversion-trunk/apr-util> -laprutil-1 -L<http://hudson.zones.apache.org/hudson/job/subversion-trunk-ubuntu/ws/subversion-trunk/apr> -lapr-1 
cd subversion/tests/libsvn_subr && <http://hudson.zones.apache.org/hudson/job/subversion-trunk-ubuntu/ws/subversion-trunk/apr/libtool> --tag=CC --silent --mode=link gcc -static  -Wold-style-definition -Wdeclaration-after-statement -Wpointer-arith -Wwrite-strings -Wshadow -ansi -Wall -Wformat=2 -Wunused -Waggregate-return -Wstrict-prototypes -Wmissing-prototypes -Wmissing-declarations -Wno-multichar -Wredundant-decls -Wnested-externs -Wunreachable-code -Winline -Wno-long-long -g -g -Wall -Wmissing-prototypes -Wstrict-prototypes -Wmissing-declarations -pthread -Werror=implicit-function-declaration  -DSVN_DEBUG -DAP_DEBUG   -rpath /usr/local/lib  -o stream-test  stream-test.lo ../../../subversion/tests/libsvn_test-1.la ../../../subversion/libsvn_subr/libsvn_subr-1.la -L<http://hudson.zones.apache.org/hudson/job/subversion-trunk-ubuntu/ws/subversion-trunk/apr-util> -laprutil-1 -L<http://hudson.zones.apache.org/hudson/job/subversion-trunk-ubuntu/ws/subversion-trunk/apr> -lapr-1 
cd subversion/tests/libsvn_subr && <http://hudson.zones.apache.org/hudson/job/subversion-trunk-ubuntu/ws/subversion-trunk/apr/libtool> --tag=CC --silent --mode=link gcc -static  -Wold-style-definition -Wdeclaration-after-statement -Wpointer-arith -Wwrite-strings -Wshadow -ansi -Wall -Wformat=2 -Wunused -Waggregate-return -Wstrict-prototypes -Wmissing-prototypes -Wmissing-declarations -Wno-multichar -Wredundant-decls -Wnested-externs -Wunreachable-code -Winline -Wno-long-long -g -g -Wall -Wmissing-prototypes -Wstrict-prototypes -Wmissing-declarations -pthread -Werror=implicit-function-declaration  -DSVN_DEBUG -DAP_DEBUG   -rpath /usr/local/lib  -o string-test  string-test.lo ../../../subversion/tests/libsvn_test-1.la ../../../subversion/libsvn_subr/libsvn_subr-1.la -L<http://hudson.zones.apache.org/hudson/job/subversion-trunk-ubuntu/ws/subversion-trunk/apr-util> -laprutil-1 -L<http://hudson.zones.apache.org/hudson/job/subversion-trunk-ubuntu/ws/subversion-trunk/apr> -lapr-1 
cd subversion/tests/libsvn_delta && <http://hudson.zones.apache.org/hudson/job/subversion-trunk-ubuntu/ws/subversion-trunk/apr/libtool> --tag=CC --silent --mode=link gcc -static  -Wold-style-definition -Wdeclaration-after-statement -Wpointer-arith -Wwrite-strings -Wshadow -ansi -Wall -Wformat=2 -Wunused -Waggregate-return -Wstrict-prototypes -Wmissing-prototypes -Wmissing-declarations -Wno-multichar -Wredundant-decls -Wnested-externs -Wunreachable-code -Winline -Wno-long-long -g -g -Wall -Wmissing-prototypes -Wstrict-prototypes -Wmissing-declarations -pthread -Werror=implicit-function-declaration  -DSVN_DEBUG -DAP_DEBUG   -rpath /usr/local/lib  -o svndiff-test  svndiff-test.lo ../../../subversion/libsvn_delta/libsvn_delta-1.la ../../../subversion/libsvn_subr/libsvn_subr-1.la -L<http://hudson.zones.apache.org/hudson/job/subversion-trunk-ubuntu/ws/subversion-trunk/apr-util> -laprutil-1 -L<http://hudson.zones.apache.org/hudson/job/subversion-trunk-ubuntu/ws/subversion-trunk/apr> -lapr-1 
cd subversion/tests/libsvn_subr && <http://hudson.zones.apache.org/hudson/job/subversion-trunk-ubuntu/ws/subversion-trunk/apr/libtool> --tag=CC --silent --mode=link gcc -static  -Wold-style-definition -Wdeclaration-after-statement -Wpointer-arith -Wwrite-strings -Wshadow -ansi -Wall -Wformat=2 -Wunused -Waggregate-return -Wstrict-prototypes -Wmissing-prototypes -Wmissing-declarations -Wno-multichar -Wredundant-decls -Wnested-externs -Wunreachable-code -Winline -Wno-long-long -g -g -Wall -Wmissing-prototypes -Wstrict-prototypes -Wmissing-declarations -pthread -Werror=implicit-function-declaration  -DSVN_DEBUG -DAP_DEBUG   -rpath /usr/local/lib  -o target-test  target-test.lo ../../../subversion/tests/libsvn_test-1.la ../../../subversion/libsvn_subr/libsvn_subr-1.la -L<http://hudson.zones.apache.org/hudson/job/subversion-trunk-ubuntu/ws/subversion-trunk/apr-util> -laprutil-1 -L<http://hudson.zones.apache.org/hudson/job/subversion-trunk-ubuntu/ws/subversion-trunk/apr> -lapr-1 
cd subversion/tests/libsvn_subr && <http://hudson.zones.apache.org/hudson/job/subversion-trunk-ubuntu/ws/subversion-trunk/apr/libtool> --tag=CC --silent --mode=link gcc -static  -Wold-style-definition -Wdeclaration-after-statement -Wpointer-arith -Wwrite-strings -Wshadow -ansi -Wall -Wformat=2 -Wunused -Waggregate-return -Wstrict-prototypes -Wmissing-prototypes -Wmissing-declarations -Wno-multichar -Wredundant-decls -Wnested-externs -Wunreachable-code -Winline -Wno-long-long -g -g -Wall -Wmissing-prototypes -Wstrict-prototypes -Wmissing-declarations -pthread -Werror=implicit-function-declaration  -DSVN_DEBUG -DAP_DEBUG   -rpath /usr/local/lib  -o time-test  time-test.lo ../../../subversion/tests/libsvn_test-1.la ../../../subversion/libsvn_subr/libsvn_subr-1.la -L<http://hudson.zones.apache.org/hudson/job/subversion-trunk-ubuntu/ws/subversion-trunk/apr-util> -laprutil-1 -L<http://hudson.zones.apache.org/hudson/job/subversion-trunk-ubuntu/ws/subversion-trunk/apr> -lapr-1 
cd subversion/tests/libsvn_subr && <http://hudson.zones.apache.org/hudson/job/subversion-trunk-ubuntu/ws/subversion-trunk/apr/libtool> --tag=CC --silent --mode=link gcc -static  -Wold-style-definition -Wdeclaration-after-statement -Wpointer-arith -Wwrite-strings -Wshadow -ansi -Wall -Wformat=2 -Wunused -Waggregate-return -Wstrict-prototypes -Wmissing-prototypes -Wmissing-declarations -Wno-multichar -Wredundant-decls -Wnested-externs -Wunreachable-code -Winline -Wno-long-long -g -g -Wall -Wmissing-prototypes -Wstrict-prototypes -Wmissing-declarations -pthread -Werror=implicit-function-declaration  -DSVN_DEBUG -DAP_DEBUG   -rpath /usr/local/lib  -o translate-test  translate-test.lo ../../../subversion/tests/libsvn_test-1.la ../../../subversion/libsvn_subr/libsvn_subr-1.la -L<http://hudson.zones.apache.org/hudson/job/subversion-trunk-ubuntu/ws/subversion-trunk/apr-util> -laprutil-1 -L<http://hudson.zones.apache.org/hudson/job/subversion-trunk-ubuntu/ws/subversion-trunk/apr> -lapr-1 
cd subversion/tests/libsvn_wc && <http://hudson.zones.apache.org/hudson/job/subversion-trunk-ubuntu/ws/subversion-trunk/apr/libtool> --tag=CC --silent --mode=link gcc -static  -Wold-style-definition -Wdeclaration-after-statement -Wpointer-arith -Wwrite-strings -Wshadow -ansi -Wall -Wformat=2 -Wunused -Waggregate-return -Wstrict-prototypes -Wmissing-prototypes -Wmissing-declarations -Wno-multichar -Wredundant-decls -Wnested-externs -Wunreachable-code -Winline -Wno-long-long -g -g -Wall -Wmissing-prototypes -Wstrict-prototypes -Wmissing-declarations -pthread -Werror=implicit-function-declaration  -DSVN_DEBUG -DAP_DEBUG   -rpath /usr/local/lib  -o tree-conflict-data-test  tree-conflict-data-test.lo ../../../subversion/tests/libsvn_test-1.la ../../../subversion/libsvn_wc/libsvn_wc-1.la ../../../subversion/libsvn_subr/libsvn_subr-1.la -L<http://hudson.zones.apache.org/hudson/job/subversion-trunk-ubuntu/ws/subversion-trunk/apr-util> -laprutil-1 -L<http://hudson.zones.apache.org/hudson/job/subversion-trunk-ubuntu/ws/subversion-trunk/apr> -lapr-1 
cd subversion/tests/libsvn_subr && <http://hudson.zones.apache.org/hudson/job/subversion-trunk-ubuntu/ws/subversion-trunk/apr/libtool> --tag=CC --silent --mode=link gcc -static  -Wold-style-definition -Wdeclaration-after-statement -Wpointer-arith -Wwrite-strings -Wshadow -ansi -Wall -Wformat=2 -Wunused -Waggregate-return -Wstrict-prototypes -Wmissing-prototypes -Wmissing-declarations -Wno-multichar -Wredundant-decls -Wnested-externs -Wunreachable-code -Winline -Wno-long-long -g -g -Wall -Wmissing-prototypes -Wstrict-prototypes -Wmissing-declarations -pthread -Werror=implicit-function-declaration  -DSVN_DEBUG -DAP_DEBUG   -rpath /usr/local/lib  -o utf-test  utf-test.lo ../../../subversion/tests/libsvn_test-1.la ../../../subversion/libsvn_subr/libsvn_subr-1.la -L<http://hudson.zones.apache.org/hudson/job/subversion-trunk-ubuntu/ws/subversion-trunk/apr-util> -laprutil-1 -L<http://hudson.zones.apache.org/hudson/job/subversion-trunk-ubuntu/ws/subversion-trunk/apr> -lapr-1 
cd subversion/tests/libsvn_delta && <http://hudson.zones.apache.org/hudson/job/subversion-trunk-ubuntu/ws/subversion-trunk/apr/libtool> --tag=CC --silent --mode=link gcc -static  -Wold-style-definition -Wdeclaration-after-statement -Wpointer-arith -Wwrite-strings -Wshadow -ansi -Wall -Wformat=2 -Wunused -Waggregate-return -Wstrict-prototypes -Wmissing-prototypes -Wmissing-declarations -Wno-multichar -Wredundant-decls -Wnested-externs -Wunreachable-code -Winline -Wno-long-long -g -g -Wall -Wmissing-prototypes -Wstrict-prototypes -Wmissing-declarations -pthread -Werror=implicit-function-declaration  -DSVN_DEBUG -DAP_DEBUG   -rpath /usr/local/lib  -o vdelta-test  vdelta-test.lo ../../../subversion/libsvn_delta/libsvn_delta-1.la ../../../subversion/libsvn_subr/libsvn_subr-1.la -L<http://hudson.zones.apache.org/hudson/job/subversion-trunk-ubuntu/ws/subversion-trunk/apr-util> -laprutil-1 -L<http://hudson.zones.apache.org/hudson/job/subversion-trunk-ubuntu/ws/subversion-trunk/apr> -lapr-1 
cd subversion/tests/libsvn_delta && <http://hudson.zones.apache.org/hudson/job/subversion-trunk-ubuntu/ws/subversion-trunk/apr/libtool> --tag=CC --silent --mode=link gcc -static  -Wold-style-definition -Wdeclaration-after-statement -Wpointer-arith -Wwrite-strings -Wshadow -ansi -Wall -Wformat=2 -Wunused -Waggregate-return -Wstrict-prototypes -Wmissing-prototypes -Wmissing-declarations -Wno-multichar -Wredundant-decls -Wnested-externs -Wunreachable-code -Winline -Wno-long-long -g -g -Wall -Wmissing-prototypes -Wstrict-prototypes -Wmissing-declarations -pthread -Werror=implicit-function-declaration  -DSVN_DEBUG -DAP_DEBUG   -rpath /usr/local/lib  -o window-test  window-test.lo ../../../subversion/tests/libsvn_test-1.la ../../../subversion/libsvn_delta/libsvn_delta-1.la ../../../subversion/libsvn_subr/libsvn_subr-1.la -L<http://hudson.zones.apache.org/hudson/job/subversion-trunk-ubuntu/ws/subversion-trunk/apr-util> -laprutil-1 -L<http://hudson.zones.apache.org/hudson/job/subversion-trunk-ubuntu/ws/subversion-trunk/apr> -lapr-1 
[subversion-trunk-ubuntu] $ /bin/bash /tmp/hudson7971728102878016800.sh
Running tests in auth-test [1/75]...................success
Running tests in cache-test [2/75]..................success
Running tests in checksum-test [3/75]...............success
Running tests in client-test [4/75].................success
Running tests in compat-test [5/75].................success
Running tests in config-test [6/75].................success
Running tests in db-test [7/75].....................success
Running tests in diff-diff3-test [8/75].............success
Running tests in dirent_uri-test [9/75].............success
Running tests in eol-test [10/75]...................success
Running tests in error-test [11/75].................success
Running tests in fs-pack-test [12/75]...............success
Running tests in fs-test [13/75]....................success
Running tests in hashdump-test [14/75]..............success
Running tests in locks-test [15/75].................success
Running tests in mergeinfo-test [16/75].............success
Running tests in opt-test [17/75]...................success
Running tests in parse-diff-test [18/75]............success
Running tests in path-test [19/75]..................success
Running tests in ra-local-test [20/75]..............success
Running tests in random-test [21/75]................success
Running tests in repos-test [22/75].................success
Running tests in revision-test [23/75]..............success
Running tests in skel-test [24/75]..................success
Running tests in stream-test [25/75]................success
Running tests in string-test [26/75]................success
Running tests in target-test [27/75]................success
Running tests in time-test [28/75]..................success
Running tests in translate-test [29/75].............success
Running tests in tree-conflict-data-test [30/75]....success
Running tests in utf-test [31/75]...................success
Running tests in window-test [32/75]................success
Running tests in authz_tests.py [33/75].............success
Running tests in autoprop_tests.py [34/75]..........success
Running tests in basic_tests.py [35/75].............success
Running tests in blame_tests.py [36/75].............FAILURE
Running tests in cat_tests.py [37/75]...............success
Running tests in changelist_tests.py [38/75]........success
Running tests in checkout_tests.py [39/75]..........success
Running tests in commit_tests.py [40/75]............success
Running tests in copy_tests.py [41/75]..............FAILURE
Running tests in depth_tests.py [42/75].............success
Running tests in diff_tests.py [43/75]..............success
Running tests in entries_tests.py [44/75]...........success
Running tests in export_tests.py [45/75]............success
Running tests in externals_tests.py [46/75].........success
Running tests in getopt_tests.py [47/75]............success
Running tests in history_tests.py [48/75]...........FAILURE
Running tests in import_tests.py [49/75]............success
Running tests in info_tests.py [50/75]..............success
Running tests in lock_tests.py [51/75]..............success
Running tests in log_tests.py [52/75]...............FAILURE
Running tests in merge_authz_tests.py [53/75].......success
Running tests in merge_tests.py [54/75].............FAILURE
Running tests in mergeinfo_tests.py [55/75].........FAILURE
Running tests in obliterate_tests.py [56/75]........success
Running tests in patch_tests.py [57/75].............success
Running tests in prop_tests.py [58/75]..............success
Running tests in resolve_tests.py [59/75]...........success
Running tests in resolved_tests.py [60/75]..........success
Running tests in revert_tests.py [61/75]............FAILURE
Running tests in schedule_tests.py [62/75]..........success
Running tests in special_tests.py [63/75]...........success
Running tests in stat_tests.py [64/75]..............FAILURE
Running tests in svnadmin_tests.py [65/75]..........success
Running tests in svndumpfilter_tests.py [66/75].....success
Running tests in svnlook_tests.py [67/75]...........success
Running tests in svnsync_tests.py [68/75]...........success
Running tests in svnversion_tests.py [69/75]........success
Running tests in switch_tests.py [70/75]............success
Running tests in trans_tests.py [71/75].............success
Running tests in tree_conflict_tests.py [72/75].....FAILURE
Running tests in update_tests.py [73/75]............success
Running tests in upgrade_tests.py [74/75]...........success
Running tests in utf8_tests.py [75/75]..............success
At least one test was SKIPPED, checking <http://hudson.zones.apache.org/hudson/job/subversion-trunk-ubuntu/ws/subversion-trunk/tests.log>
SKIP:  cache-test 2: basic memcache svn_cache test
SKIP:  cache-test 3: memcache svn_cache with very long keys
SKIP:  authz_tests.py 1: authz issue #2486 - open root
SKIP:  authz_tests.py 2: authz issue #2486 - open directory
SKIP:  authz_tests.py 3: broken authz files cause errors
SKIP:  authz_tests.py 4: test authz for read operations
SKIP:  authz_tests.py 5: test authz for write operations
SKIP:  authz_tests.py 6: test authz for checkout
SKIP:  authz_tests.py 7: test authz for log and tracing path changes
SKIP:  authz_tests.py 8: test authz for checkout and update
SKIP:  authz_tests.py 9: test authz for export with unreadable subfolder
SKIP:  authz_tests.py 10: test authz for aliases
SKIP:  authz_tests.py 11: test the authz validation rules
SKIP:  authz_tests.py 12: test authz for locking
SKIP:  authz_tests.py 13: authz issue #2712
SKIP:  authz_tests.py 14: switched to directory, no read access on parents
SKIP:  authz_tests.py 15: authz issue #3242 - access required at repo root
SKIP:  authz_tests.py 16: multiple lines matching a user
SKIP:  checkout_tests.py 14: checkout from the root of a Windows drive
SKIP:  copy_tests.py 24: wc to wc copy with deleted=true items
SKIP:  merge_authz_tests.py 1: skipped paths get overriding mergeinfo
SKIP:  obliterate_tests.py 1: test svn obliterate
SKIP:  obliterate_tests.py 2: test the pre-obliterate hook
SKIP:  svnlook_tests.py 2: delete file in moved dir
SKIP:  svnsync_tests.py 14: verify that unreadable content is not synced
SKIP:  svnsync_tests.py 15: verify that copies from unreadable dirs work
SKIP:  svnsync_tests.py 16: verify copies with mods from unreadable dirs
SKIP:  svnsync_tests.py 17: verify copies with mods from unreadable dirs +copy
SKIP:  update_tests.py 32: update wc on the root of a Windows (virtual) drive
SKIP:  utf8_tests.py 1: conversion of paths and logs to/from utf8
At least one test XFAILED, checking <http://hudson.zones.apache.org/hudson/job/subversion-trunk-ubuntu/ws/subversion-trunk/tests.log>
XFAIL: fs-test 18: merging commit
       [[needs to be written to match new merge() algorithm expectations]]
XFAIL: fs-test 36: obliterate 1
       [[obliterate is in development]]
XFAIL: locks-test 9: able to reserve a name (lock non-existent path)
XFAIL: locks-test 10: directory locks (kinda)
XFAIL: tree-conflict-data-test 3: detect broken tree conflict data
XFAIL: basic_tests.py 39: remotely remove directories from two repositories
XFAIL: changelist_tests.py 12: 'svn mv' of existing keeps the changelist
XFAIL: changelist_tests.py 13: 'svn mv' of added keeps the changelist
XFAIL: commit_tests.py 25: commit from two nested working copies
XFAIL: commit_tests.py 26: commit from two working copies
XFAIL: copy_tests.py 79: move a dir below a moved dir
XFAIL: copy_tests.py 81: commit only top of copy; check child behavior
XFAIL: depth_tests.py 32: make sure update handle svn_depth_exclude properly
XFAIL: depth_tests.py 36: 'info' should treat excluded item as versioned
XFAIL: diff_tests.py 28: diff a renamed directory
XFAIL: diff_tests.py 49: diff URL against working copy with local mods
XFAIL: diff_tests.py 50: diff -r1 of removed file to its local addition
XFAIL: externals_tests.py 19: delete a file external
XFAIL: log_tests.py 21: test log -c on range of changes
XFAIL: merge_tests.py 33: merge a replacement of a directory
XFAIL: merge_tests.py 55: avoid repeated merges for cyclic merging
XFAIL: merge_tests.py 71: merge target with non inheritable mergeinfo
XFAIL: merge_tests.py 90: merge added subtree
XFAIL: merge_tests.py 114: tree conflicts 5.1: leaf edit, tree del
XFAIL: merge_tests.py 115: tree conflicts 5.2: leaf del, tree del
XFAIL: merge_tests.py 119: tree conflicts 5.1: leaf edit (no ci), tree del
XFAIL: merge_tests.py 120: tree conflicts 5.2: leaf del (no ci), tree del
XFAIL: merge_tests.py 124: merge prior to rename src existence still dels src
XFAIL: merge_tests.py 135: replace vs. delete tree-conflicts
XFAIL: merge_tests.py 137: automatic conflict resolutions work with merge
XFAIL: mergeinfo_tests.py 4: 'mergeinfo' with uninteresting source selection
XFAIL: revert_tests.py 4: revert a moved file
XFAIL: revert_tests.py 17: status after replace+, revert, and local rm
       [[revert behavior needs better definition]]
XFAIL: revert_tests.py 20: reverting an add over not present directory
XFAIL: switch_tests.py 10: switch a file to a dir and back to the file
XFAIL: switch_tests.py 38: copy directory with switched subdir
XFAIL: tree_conflict_tests.py 14: merge dir: del/rpl/mv onto not-same
XFAIL: tree_conflict_tests.py 18: --force del on dir with TCs inside
XFAIL: tree_conflict_tests.py 19: --keep-local del on tree-conflicted targets
XFAIL: tree_conflict_tests.py 20: --force del on tree-conflicted targets
XFAIL: tree_conflict_tests.py 21: query an unversioned tree-conflicted dir
XFAIL: tree_conflict_tests.py 22: issue #3608: reverting an add onto add conflict
XFAIL: update_tests.py 50: tree conflicts 2.3: skip on 2nd update
XFAIL: update_tests.py 57: verify update of deleted locked files
XFAIL: update_tests.py 58: svn up --depth empty hides entries for next update
At least one test FAILED, checking <http://hudson.zones.apache.org/hudson/job/subversion-trunk-ubuntu/ws/subversion-trunk/tests.log>
FAIL:  blame_tests.py 10: test 'svn blame -g'
FAIL:  blame_tests.py 11: don't look for merged files out of range
FAIL:  copy_tests.py 7: copy files with properties
FAIL:  copy_tests.py 12: repository to working-copy copy
FAIL:  copy_tests.py 16: resurrect a deleted file
FAIL:  copy_tests.py 17: copy file from repos to working copy and run diff
FAIL:  copy_tests.py 18: repos->WC copy with keyword or eol property set
FAIL:  copy_tests.py 19: revision-kind keywords with non-URL source
FAIL:  copy_tests.py 32: svn cp URL PATH replace file
FAIL:  copy_tests.py 33: svn cp URL PATH replace file with props
FAIL:  copy_tests.py 58: copy multiple files from a repo to a wc
FAIL:  copy_tests.py 60: copy local files using peg rev syntax
FAIL:  copy_tests.py 70: update receives copy, but local source is replaced
FAIL:  history_tests.py 2: verify that 'svn cat' avoids false identities
FAIL:  log_tests.py 16: test 'svn log -g' on a single revision
FAIL:  log_tests.py 17: test 'svn log -g' on a branching revision
FAIL:  log_tests.py 18: test 'svn log -g' on a non-branching revision
FAIL:  log_tests.py 19: test 'svn log -g' a path added before merge
FAIL:  merge_tests.py 2: merge and add new files/dirs with history
FAIL:  merge_tests.py 10: merging similar trees ancestrally unrelated
FAIL:  merge_tests.py 18: diff after merge that creates a new file
FAIL:  merge_tests.py 19: merge should skip over unversioned obstructions
FAIL:  merge_tests.py 21: merge --dry-run adding a new file with props
FAIL:  merge_tests.py 23: merge with funny characters (issue #1905)
FAIL:  merge_tests.py 24: merge changes to keyword expansion property
FAIL:  merge_tests.py 32: merge a replacement of a file
FAIL:  merge_tests.py 35: merge a replacement of a file to mixed rev wc
FAIL:  merge_tests.py 58: replace-style merge capability for a single file
FAIL:  merge_tests.py 61: subtrees can lose non-inheritable ranges
FAIL:  merge_tests.py 74: merge from renamed branch
FAIL:  merge_tests.py 76: subtrees added after start of merge range are ok
FAIL:  merge_tests.py 78: merge --reintegrate with renamed file on branch
FAIL:  merge_tests.py 79: merge --reintegrate on a never-updated branch
FAIL:  merge_tests.py 86: merge range predates history (issue #3094)
FAIL:  merge_tests.py 93: dont merge revs into a subtree that predate it
FAIL:  merge_tests.py 95: don't explicitly record implicit mergeinfo
FAIL:  merge_tests.py 102: merge tries to delete identical sched-add file
FAIL:  merge_tests.py 105: target and subtrees need nonintersecting revs
FAIL:  merge_tests.py 125: merge --reintegrate with subtree mergeinfo
FAIL:  merge_tests.py 136: record only merge applies mergeinfo diffs
FAIL:  merge_tests.py 139: committed case only move causes revert to fail
FAIL:  mergeinfo_tests.py 7: test svn mergeinfo -R
FAIL:  revert_tests.py 6: revert a merge replacement of file with history
FAIL:  revert_tests.py 7: revert svn cp URL PATH replace file with props
FAIL:  revert_tests.py 15: revert a committed replace-with-history == no-op
FAIL:  stat_tests.py 22: status on conflicted added file
FAIL:  tree_conflict_tests.py 10: merge file: del/rpl/mv onto not-same
FAIL:  tree_conflict_tests.py 11: merge file: del/rpl/mv onto not-file
Summary of test results:
  1143 tests PASSED
  30 tests SKIPPED
  45 tests XFAILED (3 WORK-IN-PROGRESS)
  48 tests FAILED
make: *** [check] Error 1
Generating junit files ...
Recording test results


Mime
View raw message