synapse-dev mailing list archives

Site index · List index
Message view « Date » · « Thread »
Top « Date » · « Thread »
From Sagara Gunathunga <sagara.gunathu...@gmail.com>
Subject Re: Build failed in Jenkins: Synapse - Trunk #4272
Date Wed, 30 May 2012 06:45:04 GMT
It looks like Synapse still use some deprecated classes from Axis2 1.3
release. Some one need to follow up with AXIS2-5315 changes [1]

[1] - https://issues.apache.org/jira/browse/AXIS2-5315

Thanks !

On Wed, May 30, 2012 at 12:02 PM, Apache Jenkins Server
<jenkins@builds.apache.org> wrote:
> See <https://builds.apache.org/job/Synapse%20-%20Trunk/4272/>
>
> ------------------------------------------
> [...truncated 1251 lines...]
> Downloading: https://server.oosnmp.net/dist/release/org/apache/bsf/bsf-all/3.0/bsf-all-3.0.pom
> Downloading: http://repo1.maven.org/maven2/org/apache/bsf/bsf-all/3.0/bsf-all-3.0.pom
> Downloading: http://dist.wso2.org/maven2/quickfixj/quickfixj-all/1.4.0/quickfixj-all-1.4.0.pom
> Downloading: https://server.oosnmp.net/dist/release/quickfixj/quickfixj-all/1.4.0/quickfixj-all-1.4.0.pom
> Downloading: http://repo1.maven.org/maven2/quickfixj/quickfixj-all/1.4.0/quickfixj-all-1.4.0.pom
> [INFO] Generating "Dependencies" report    --- maven-project-info-reports-plugin:2.2
> [INFO] Generating "Project License" report    --- maven-project-info-reports-plugin:2.2
> [INFO] Generating "Project Team" report    --- maven-project-info-reports-plugin:2.2
> [INFO] Generating "Continuous Integration" report    --- maven-project-info-reports-plugin:2.2
> mojoSucceeded org.apache.maven.plugins:maven-site-plugin:3.0(default-site)
> [FINDBUGS] No report found for mojo site
> [JENKINS] Archiving site from <https://builds.apache.org/job/Synapse%20-%20Trunk/ws/java/modules/tasks/target/site>
to /home/hudson/hudson/jobs/Synapse - Trunk/site/synapse-tasks
> projectSucceeded org.apache.synapse:synapse-tasks:2.2.0-SNAPSHOT
> projectStarted org.apache.synapse:synapse-core:2.2.0-SNAPSHOT
> [INFO]
> [INFO] ------------------------------------------------------------------------
> [INFO] Building Apache Synapse - Core 2.2.0-SNAPSHOT
> [INFO] ------------------------------------------------------------------------
> Downloading: http://snapshots.maven.codehaus.org/maven2/org/apache/axis2/axis2-saaj/1.7.0-SNAPSHOT/maven-metadata.xml
> Downloading: http://dist.wso2.org/maven2/org/apache/axis2/axis2-saaj/1.7.0-SNAPSHOT/maven-metadata.xml
> [WARNING] Could not transfer metadata org.apache.axis2:axis2-saaj:1.7.0-SNAPSHOT/maven-metadata.xml
from/to wso2-maven2-repository-snapshot (http://dist.wso2.org/snapshots/maven2): No connector
available to access repository wso2-maven2-repository-snapshot (http://dist.wso2.org/snapshots/maven2)
of type legacy using the available factories WagonRepositoryConnectorFactory
> [WARNING] Could not transfer metadata org.apache.axis2:axis2-saaj:1.7.0-SNAPSHOT/maven-metadata.xml
from/to apache-zones (http://ws.zones.apache.org/repository): No connector available to access
repository apache-zones (http://ws.zones.apache.org/repository) of type legacy using the available
factories WagonRepositoryConnectorFactory
> Downloading: http://snapshots.maven.codehaus.org/maven2/org/apache/axis2/axis2-clustering/1.7.0-SNAPSHOT/maven-metadata.xml
> Downloading: http://dist.wso2.org/maven2/org/apache/axis2/axis2-clustering/1.7.0-SNAPSHOT/maven-metadata.xml
> [WARNING] Could not transfer metadata org.apache.axis2:axis2-clustering:1.7.0-SNAPSHOT/maven-metadata.xml
from/to wso2-maven2-repository-snapshot (http://dist.wso2.org/snapshots/maven2): No connector
available to access repository wso2-maven2-repository-snapshot (http://dist.wso2.org/snapshots/maven2)
of type legacy using the available factories WagonRepositoryConnectorFactory
> [WARNING] Could not transfer metadata org.apache.axis2:axis2-clustering:1.7.0-SNAPSHOT/maven-metadata.xml
from/to apache-zones (http://ws.zones.apache.org/repository): No connector available to access
repository apache-zones (http://ws.zones.apache.org/repository) of type legacy using the available
factories WagonRepositoryConnectorFactory
> Downloading: http://dist.wso2.org/maven2/net/sf/saxon/saxon/8.9/saxon-8.9.pom
> Downloading: https://server.oosnmp.net/dist/release/net/sf/saxon/saxon/8.9/saxon-8.9.pom
> Downloading: http://repo1.maven.org/maven2/net/sf/saxon/saxon/8.9/saxon-8.9.pom
> [WARNING] The POM for net.sf.saxon:saxon:jar:8.9 is missing, no dependency information
available
> Downloading: http://snapshots.maven.codehaus.org/maven2/org/apache/ws/commons/axiom/axiom-dom/1.2.14-SNAPSHOT/maven-metadata.xml
> Downloading: http://dist.wso2.org/maven2/org/apache/ws/commons/axiom/axiom-dom/1.2.14-SNAPSHOT/maven-metadata.xml
> [WARNING] Could not transfer metadata org.apache.ws.commons.axiom:axiom-dom:1.2.14-SNAPSHOT/maven-metadata.xml
from/to wso2-maven2-repository-snapshot (http://dist.wso2.org/snapshots/maven2): No connector
available to access repository wso2-maven2-repository-snapshot (http://dist.wso2.org/snapshots/maven2)
of type legacy using the available factories WagonRepositoryConnectorFactory
> [WARNING] Could not transfer metadata org.apache.ws.commons.axiom:axiom-dom:1.2.14-SNAPSHOT/maven-metadata.xml
from/to apache-zones (http://ws.zones.apache.org/repository): No connector available to access
repository apache-zones (http://ws.zones.apache.org/repository) of type legacy using the available
factories WagonRepositoryConnectorFactory
> Downloading: http://repository.apache.org/snapshots/org/apache/sandesha2/sandesha2-core/1.7.0-SNAPSHOT/sandesha2-core-1.7.0-20120530.060938-149.jar
> Downloading: http://repository.apache.org/snapshots/org/apache/axis2/axis2-codegen/1.7.0-SNAPSHOT/axis2-codegen-1.7.0-20120529.140840-802.jar
> Downloading: http://repository.apache.org/snapshots/org/apache/axis2/axis2-adb/1.7.0-SNAPSHOT/axis2-adb-1.7.0-20120529.140840-810.jar
> Downloading: http://repository.apache.org/snapshots/org/apache/axis2/axis2-mtompolicy/1.7.0-SNAPSHOT/axis2-mtompolicy-1.7.0-20120529.140840-746.jar
> Downloading: http://repository.apache.org/snapshots/org/apache/axis2/axis2-saaj/1.7.0-SNAPSHOT/axis2-saaj-1.7.0-20120529.140840-778.jar
> Downloaded: http://repository.apache.org/snapshots/org/apache/axis2/axis2-codegen/1.7.0-SNAPSHOT/axis2-codegen-1.7.0-20120529.140840-802.jar
(254 KB at 716.5 KB/sec)
> Downloading: http://repository.apache.org/snapshots/org/apache/ws/commons/axiom/axiom-dom/1.2.14-SNAPSHOT/axiom-dom-1.2.14-20120528.213739-154.jar
> Downloaded: http://repository.apache.org/snapshots/org/apache/axis2/axis2-saaj/1.7.0-SNAPSHOT/axis2-saaj-1.7.0-20120529.140840-778.jar
(90 KB at 241.6 KB/sec)
> Downloading: http://repository.apache.org/snapshots/org/apache/axis2/axis2-clustering/1.7.0-SNAPSHOT/axis2-clustering-1.7.0-20120529.140840-789.jar
> Downloaded: http://repository.apache.org/snapshots/org/apache/axis2/axis2-mtompolicy/1.7.0-SNAPSHOT/axis2-mtompolicy-1.7.0-20120529.140840-746.jar
(14 KB at 32.6 KB/sec)
> Downloading: http://repository.apache.org/snapshots/org/apache/axis2/axis2-transport-jms/1.7.0-SNAPSHOT/axis2-transport-jms-1.7.0-20120529.010952-407.jar
> Downloaded: http://repository.apache.org/snapshots/org/apache/axis2/axis2-clustering/1.7.0-SNAPSHOT/axis2-clustering-1.7.0-20120529.140840-789.jar
(105 KB at 665.8 KB/sec)
> Downloading: http://repository.apache.org/snapshots/org/apache/axis2/axis2-transport-mail/1.7.0-SNAPSHOT/axis2-transport-mail-1.7.0-20120529.010952-407.jar
> Downloaded: http://repository.apache.org/snapshots/org/apache/axis2/axis2-adb/1.7.0-SNAPSHOT/axis2-adb-1.7.0-20120529.140840-810.jar
(662 KB at 1046.2 KB/sec)
> Downloading: http://repository.apache.org/snapshots/org/apache/axis2/axis2-transport-local/1.7.0-SNAPSHOT/axis2-transport-local-1.7.0-20120529.140840-806.jar
> Downloaded: http://repository.apache.org/snapshots/org/apache/axis2/axis2-transport-jms/1.7.0-SNAPSHOT/axis2-transport-jms-1.7.0-20120529.010952-407.jar
(79 KB at 354.7 KB/sec)
> Downloaded: http://repository.apache.org/snapshots/org/apache/sandesha2/sandesha2-core/1.7.0-SNAPSHOT/sandesha2-core-1.7.0-20120530.060938-149.jar
(398 KB at 609.4 KB/sec)
> Downloaded: http://repository.apache.org/snapshots/org/apache/ws/commons/axiom/axiom-dom/1.2.14-SNAPSHOT/axiom-dom-1.2.14-20120528.213739-154.jar
(201 KB at 658.7 KB/sec)
> Downloaded: http://repository.apache.org/snapshots/org/apache/axis2/axis2-transport-mail/1.7.0-SNAPSHOT/axis2-transport-mail-1.7.0-20120529.010952-407.jar
(41 KB at 270.4 KB/sec)
> Downloaded: http://repository.apache.org/snapshots/org/apache/axis2/axis2-transport-local/1.7.0-SNAPSHOT/axis2-transport-local-1.7.0-20120529.140840-806.jar
(20 KB at 116.8 KB/sec)
> [INFO] Deleting <https://builds.apache.org/job/Synapse%20-%20Trunk/ws/java/modules/core/target>
> mojoStarted org.apache.maven.plugins:maven-clean-plugin:2.4.1(default-clean)
> [INFO]
> [INFO] --- maven-clean-plugin:2.4.1:clean (default-clean) @ synapse-core ---
> mojoSucceeded org.apache.maven.plugins:maven-clean-plugin:2.4.1(default-clean)
> mojoStarted org.apache.maven.plugins:maven-remote-resources-plugin:1.1(default)Downloading:
http://snapshots.maven.codehaus.org/maven2/org/apache/axis2/axis2-kernel/1.7.0-SNAPSHOT/maven-metadata.xml
> Downloading: http://dist.wso2.org/maven2/org/apache/axis2/axis2-kernel/1.7.0-SNAPSHOT/maven-metadata.xml
>
> [INFO]
> [INFO] --- maven-remote-resources-plugin:1.1:process (default) @ synapse-core ---
> [WARNING] Could not transfer metadata org.apache.axis2:axis2-kernel:1.7.0-SNAPSHOT/maven-metadata.xml
from/to wso2-maven2-repository-snapshot (http://dist.wso2.org/snapshots/maven2): No connector
available to access repository wso2-maven2-repository-snapshot (http://dist.wso2.org/snapshots/maven2)
of type legacy using the available factories WagonRepositoryConnectorFactory
> [WARNING] Could not transfer metadata org.apache.axis2:axis2-kernel:1.7.0-SNAPSHOT/maven-metadata.xml
from/to apache-zones (http://ws.zones.apache.org/repository): No connector available to access
repository apache-zones (http://ws.zones.apache.org/repository) of type legacy using the available
factories WagonRepositoryConnectorFactory
> Downloading: http://snapshots.maven.codehaus.org/maven2/org/apache/axis2/axis2-parent/1.7.0-SNAPSHOT/maven-metadata.xml
> Downloading: http://dist.wso2.org/maven2/org/apache/axis2/axis2-parent/1.7.0-SNAPSHOT/maven-metadata.xml
> [WARNING] Could not transfer metadata org.apache.axis2:axis2-parent:1.7.0-SNAPSHOT/maven-metadata.xml
from/to wso2-maven2-repository-snapshot (http://dist.wso2.org/snapshots/maven2): No connector
available to access repository wso2-maven2-repository-snapshot (http://dist.wso2.org/snapshots/maven2)
of type legacy using the available factories WagonRepositoryConnectorFactory
> [WARNING] Could not transfer metadata org.apache.axis2:axis2-parent:1.7.0-SNAPSHOT/maven-metadata.xml
from/to apache-zones (http://ws.zones.apache.org/repository): No connector available to access
repository apache-zones (http://ws.zones.apache.org/repository) of type legacy using the available
factories WagonRepositoryConnectorFactory
> [WARNING] Could not transfer metadata org.apache.axis2:axis2-saaj:1.7.0-SNAPSHOT/maven-metadata.xml
from/to wso2-maven2-repository-snapshot (http://dist.wso2.org/snapshots/maven2): No connector
available to access repository wso2-maven2-repository-snapshot (http://dist.wso2.org/snapshots/maven2)
of type legacy using the available factories WagonRepositoryConnectorFactory
> [WARNING] Could not transfer metadata org.apache.axis2:axis2-saaj:1.7.0-SNAPSHOT/maven-metadata.xml
from/to apache-zones (http://ws.zones.apache.org/repository): No connector available to access
repository apache-zones (http://ws.zones.apache.org/repository) of type legacy using the available
factories WagonRepositoryConnectorFactory
> [WARNING] Could not transfer metadata org.apache.ws.commons.axiom:axiom-dom:1.2.14-SNAPSHOT/maven-metadata.xml
from/to wso2-maven2-repository-snapshot (http://dist.wso2.org/snapshots/maven2): No connector
available to access repository wso2-maven2-repository-snapshot (http://dist.wso2.org/snapshots/maven2)
of type legacy using the available factories WagonRepositoryConnectorFactory
> [WARNING] Could not transfer metadata org.apache.ws.commons.axiom:axiom-dom:1.2.14-SNAPSHOT/maven-metadata.xml
from/to apache-zones (http://ws.zones.apache.org/repository): No connector available to access
repository apache-zones (http://ws.zones.apache.org/repository) of type legacy using the available
factories WagonRepositoryConnectorFactory
> Downloading: http://snapshots.maven.codehaus.org/maven2/org/apache/ws/commons/axiom/axiom-parent/1.2.14-SNAPSHOT/maven-metadata.xml
> Downloading: http://dist.wso2.org/maven2/org/apache/ws/commons/axiom/axiom-parent/1.2.14-SNAPSHOT/maven-metadata.xml
> [WARNING] Could not transfer metadata org.apache.ws.commons.axiom:axiom-parent:1.2.14-SNAPSHOT/maven-metadata.xml
from/to wso2-maven2-repository-snapshot (http://dist.wso2.org/snapshots/maven2): No connector
available to access repository wso2-maven2-repository-snapshot (http://dist.wso2.org/snapshots/maven2)
of type legacy using the available factories WagonRepositoryConnectorFactory
> [WARNING] Could not transfer metadata org.apache.ws.commons.axiom:axiom-parent:1.2.14-SNAPSHOT/maven-metadata.xml
from/to apache-zones (http://ws.zones.apache.org/repository): No connector available to access
repository apache-zones (http://ws.zones.apache.org/repository) of type legacy using the available
factories WagonRepositoryConnectorFactory
> Downloading: http://snapshots.maven.codehaus.org/maven2/org/apache/ws/commons/axiom/axiom-api/1.2.14-SNAPSHOT/maven-metadata.xml
> Downloading: http://dist.wso2.org/maven2/org/apache/ws/commons/axiom/axiom-api/1.2.14-SNAPSHOT/maven-metadata.xml
> [WARNING] Could not transfer metadata org.apache.ws.commons.axiom:axiom-api:1.2.14-SNAPSHOT/maven-metadata.xml
from/to wso2-maven2-repository-snapshot (http://dist.wso2.org/snapshots/maven2): No connector
available to access repository wso2-maven2-repository-snapshot (http://dist.wso2.org/snapshots/maven2)
of type legacy using the available factories WagonRepositoryConnectorFactory
> [WARNING] Could not transfer metadata org.apache.ws.commons.axiom:axiom-api:1.2.14-SNAPSHOT/maven-metadata.xml
from/to apache-zones (http://ws.zones.apache.org/repository): No connector available to access
repository apache-zones (http://ws.zones.apache.org/repository) of type legacy using the available
factories WagonRepositoryConnectorFactory
> [WARNING] Could not transfer metadata org.apache.axis2:axis2-clustering:1.7.0-SNAPSHOT/maven-metadata.xml
from/to wso2-maven2-repository-snapshot (http://dist.wso2.org/snapshots/maven2): No connector
available to access repository wso2-maven2-repository-snapshot (http://dist.wso2.org/snapshots/maven2)
of type legacy using the available factories WagonRepositoryConnectorFactory
> [WARNING] Could not transfer metadata org.apache.axis2:axis2-clustering:1.7.0-SNAPSHOT/maven-metadata.xml
from/to apache-zones (http://ws.zones.apache.org/repository): No connector available to access
repository apache-zones (http://ws.zones.apache.org/repository) of type legacy using the available
factories WagonRepositoryConnectorFactory
> Downloading: http://snapshots.maven.codehaus.org/maven2/org/apache/ws/commons/axiom/axiom-impl/1.2.14-SNAPSHOT/maven-metadata.xml
> Downloading: http://dist.wso2.org/maven2/org/apache/ws/commons/axiom/axiom-impl/1.2.14-SNAPSHOT/maven-metadata.xml
> [WARNING] Could not transfer metadata org.apache.ws.commons.axiom:axiom-impl:1.2.14-SNAPSHOT/maven-metadata.xml
from/to wso2-maven2-repository-snapshot (http://dist.wso2.org/snapshots/maven2): No connector
available to access repository wso2-maven2-repository-snapshot (http://dist.wso2.org/snapshots/maven2)
of type legacy using the available factories WagonRepositoryConnectorFactory
> [WARNING] Could not transfer metadata org.apache.ws.commons.axiom:axiom-impl:1.2.14-SNAPSHOT/maven-metadata.xml
from/to apache-zones (http://ws.zones.apache.org/repository): No connector available to access
repository apache-zones (http://ws.zones.apache.org/repository) of type legacy using the available
factories WagonRepositoryConnectorFactory
> Downloading: http://dist.wso2.org/maven2/net/sf/saxon/saxon/8.9/saxon-8.9.pom
> Downloading: https://server.oosnmp.net/dist/release/net/sf/saxon/saxon/8.9/saxon-8.9.pom
> Downloading: http://repo1.maven.org/maven2/net/sf/saxon/saxon/8.9/saxon-8.9.pom
> [WARNING] Missing POM for net.sf.saxon:saxon:jar:8.9
> Downloading: http://people.apache.org/repo/m2-incubating-repository/org/apache/axis2/axis2-transport-base/1.7.0-SNAPSHOT/maven-metadata.xml
> Downloading: http://people.apache.org/repo/m2-incubating-repository/org/apache/axis2/axis2-kernel/1.7.0-SNAPSHOT/maven-metadata.xml
> Downloading: http://people.apache.org/repo/m2-incubating-repository/org/apache/axis2/axis2-parent/1.7.0-SNAPSHOT/maven-metadata.xml
> mojoSucceeded org.apache.maven.plugins:maven-remote-resources-plugin:1.1(default)
> [debug] execute contextualize
> mojoStarted org.apache.maven.plugins:maven-resources-plugin:2.5(default-resources)[INFO]
Using 'UTF-8' encoding to copy filtered resources.
> [INFO] Copying 1 resource
> [INFO] Copying 3 resources
>
> [INFO]
> [INFO] --- maven-resources-plugin:2.5:resources (default-resources) @ synapse-core ---
> mojoSucceeded org.apache.maven.plugins:maven-resources-plugin:2.5(default-resources)
> mojoStarted org.apache.maven.plugins:maven-compiler-plugin:2.3.2(default-compile)
> [INFO]
> [INFO] --- maven-compiler-plugin:2.3.2:compile (default-compile) @ synapse-core ---
> [INFO] Compiling 488 source files to <https://builds.apache.org/job/Synapse%20-%20Trunk/ws/java/modules/core/target/classes>
> [INFO] -------------------------------------------------------------
> [WARNING] COMPILATION WARNING :
> [INFO] -------------------------------------------------------------
> [WARNING] <https://builds.apache.org/job/Synapse%20-%20Trunk/ws/java/modules/core/src/main/java/org/apache/synapse/config/xml/MediatorFactoryFinder.java>:[31,15]
sun.misc.Service is Sun proprietary API and may be removed in a future release
> [WARNING] <https://builds.apache.org/job/Synapse%20-%20Trunk/ws/java/modules/core/src/main/java/org/apache/synapse/config/xml/StartupFinder.java>:[37,15]
sun.misc.Service is Sun proprietary API and may be removed in a future release
> [WARNING] <https://builds.apache.org/job/Synapse%20-%20Trunk/ws/java/modules/core/src/main/java/org/apache/synapse/config/xml/ConfigurationFactoryAndSerializerFinder.java>:[29,15]
sun.misc.Service is Sun proprietary API and may be removed in a future release
> [WARNING] <https://builds.apache.org/job/Synapse%20-%20Trunk/ws/java/modules/core/src/main/java/org/apache/synapse/config/xml/MediatorSerializerFinder.java>:[27,15]
sun.misc.Service is Sun proprietary API and may be removed in a future release
> [WARNING] <https://builds.apache.org/job/Synapse%20-%20Trunk/ws/java/modules/core/src/main/java/org/apache/synapse/config/xml/MediatorFactoryFinder.java>:[139,22]
sun.misc.Service is Sun proprietary API and may be removed in a future release
> [WARNING] <https://builds.apache.org/job/Synapse%20-%20Trunk/ws/java/modules/core/src/main/java/org/apache/synapse/config/xml/StartupFinder.java>:[115,25]
sun.misc.Service is Sun proprietary API and may be removed in a future release
> [WARNING] <https://builds.apache.org/job/Synapse%20-%20Trunk/ws/java/modules/core/src/main/java/org/apache/synapse/config/xml/ConfigurationFactoryAndSerializerFinder.java>:[117,22]
sun.misc.Service is Sun proprietary API and may be removed in a future release
> [WARNING] <https://builds.apache.org/job/Synapse%20-%20Trunk/ws/java/modules/core/src/main/java/org/apache/synapse/config/xml/MediatorSerializerFinder.java>:[115,22]
sun.misc.Service is Sun proprietary API and may be removed in a future release
> [INFO] 8 warnings
> [INFO] -------------------------------------------------------------
> [INFO] -------------------------------------------------------------
> [ERROR] COMPILATION ERROR :
> [INFO] -------------------------------------------------------------
> [ERROR] <https://builds.apache.org/job/Synapse%20-%20Trunk/ws/java/modules/core/src/main/java/org/apache/synapse/core/axis2/DynamicAxisOperation.java>:[29,36]
cannot find symbol
> symbol  : class Callback
> location: package org.apache.axis2.client.async
> [ERROR] <https://builds.apache.org/job/Synapse%20-%20Trunk/ws/java/modules/core/src/main/java/org/apache/synapse/core/axis2/DynamicAxisOperation.java>:[90,32]
cannot find symbol
> symbol  : class Callback
> location: class org.apache.synapse.core.axis2.DynamicAxisOperation.DynamicOperationClient
> [ERROR] <https://builds.apache.org/job/Synapse%20-%20Trunk/ws/java/modules/core/src/main/java/org/apache/synapse/core/axis2/DynamicAxisOperation.java>:[90,20]
setCallback(Callback) in org.apache.synapse.core.axis2.DynamicAxisOperation.DynamicOperationClient
cannot override setCallback(org.apache.axis2.client.async.AxisCallback) in org.apache.axis2.client.OperationClient;
overridden method is final
> [ERROR] <https://builds.apache.org/job/Synapse%20-%20Trunk/ws/java/modules/core/src/main/java/org/apache/synapse/core/axis2/DynamicAxisOperation.java>:[91,7]
cannot find symbol
> symbol  : variable callback
> location: class org.apache.synapse.core.axis2.DynamicAxisOperation.DynamicOperationClient
> [INFO] 4 errors
> [INFO] -------------------------------------------------------------
> mojoFailed org.apache.maven.plugins:maven-compiler-plugin:2.3.2(default-compile)
> projectFailed org.apache.synapse:synapse-core:2.2.0-SNAPSHOT
> sessionEnded
> [INFO] ------------------------------------------------------------------------
> [INFO] Reactor Summary:
> [INFO]
> [INFO] Apache Synapse .................................... SUCCESS [58.437s]
> [INFO] Apache Synapse - Secure Vault ..................... SUCCESS [16.973s]
> [INFO] Apache Synapse - Commons .......................... SUCCESS [28.243s]
> [INFO] Apache Synapse - Transports ....................... SUCCESS [8.256s]
> [INFO] Apache Synapse - Non-blocking HTTP/s Transport .... SUCCESS [23.662s]
> [INFO] Apache Synapse - PIPE Transport ................... SUCCESS [9.587s]
> [INFO] Apache Synapse - VFS Transport .................... SUCCESS [19.964s]
> [INFO] Apache Synapse - FIX Transport .................... SUCCESS [16.094s]
> [INFO] Apache Synapse - Tasks ............................ SUCCESS [10.065s]
> [INFO] Apache Synapse - Core ............................. FAILURE [14.429s]
> [INFO] Apache Synapse - Extensions ....................... SKIPPED
> [INFO] Apache Synapse - Samples .......................... SKIPPED
> [INFO] Apache Synapse - Patches .......................... SKIPPED
> [INFO] Apache Synapse - Experimental code ................ SKIPPED
> [INFO] Apache Synapse - Documentation .................... SKIPPED
> [INFO] Apache Synapse - Web Application .................. SKIPPED
> [INFO] Apache Synapse - Handler Module ................... SKIPPED
> [INFO] Apache Synapse - XAR Maven Plugin ................. SKIPPED
> [INFO] Apache Synapse - Configuration Migrator ........... SKIPPED
> [INFO] Apache Synapse - Distribution ..................... SKIPPED
> [INFO] Apache Synapse - Package skeleton ZIP ............. SKIPPED
> [INFO] Apache Synapse - Package archetype ................ SKIPPED
> [INFO] Apache Synapse - Integration ...................... SKIPPED
> [INFO] ------------------------------------------------------------------------
> [INFO] BUILD FAILURE
> [INFO] ------------------------------------------------------------------------
> [INFO] Total time: 3:31.319s
> [INFO] Finished at: Wed May 30 06:31:54 UTC 2012
> [INFO] Final Memory: 92M/381M
> [INFO] ------------------------------------------------------------------------
> Projects to build: [MavenProject: org.apache.synapse:Apache-Synapse:2.2.0-SNAPSHOT @
<https://builds.apache.org/job/Synapse%20-%20Trunk/ws/java/pom.xml,> MavenProject: org.apache.synapse:synapse-securevault:2.2.0-SNAPSHOT
@ <https://builds.apache.org/job/Synapse%20-%20Trunk/ws/java/modules/securevault/pom.xml,>
MavenProject: org.apache.synapse:synapse-commons:2.2.0-SNAPSHOT @ <https://builds.apache.org/job/Synapse%20-%20Trunk/ws/java/modules/commons/pom.xml,>
MavenProject: org.apache.synapse:synapse-transports:2.2.0-SNAPSHOT @ <https://builds.apache.org/job/Synapse%20-%20Trunk/ws/java/modules/transports/pom.xml,>
MavenProject: org.apache.synapse:synapse-nhttp-transport:2.2.0-SNAPSHOT @ <https://builds.apache.org/job/Synapse%20-%20Trunk/ws/java/modules/transports/core/nhttp/pom.xml,>
MavenProject: org.apache.synapse:synapse-pipe-transport:2.2.0-SNAPSHOT @ <https://builds.apache.org/job/Synapse%20-%20Trunk/ws/java/modules/transports/core/pipe/pom.xml,>
MavenProject: org.apache.synapse:synapse-vfs-transport:2.2.0-SNAPSHOT @ <https://builds.apache.org/job/Synapse%20-%20Trunk/ws/java/modules/transports/core/vfs/pom.xml,>
MavenProject: org.apache.synapse:synapse-fix-transport:2.2.0-SNAPSHOT @ <https://builds.apache.org/job/Synapse%20-%20Trunk/ws/java/modules/transports/optional/fix/pom.xml,>
MavenProject: org.apache.synapse:synapse-tasks:2.2.0-SNAPSHOT @ <https://builds.apache.org/job/Synapse%20-%20Trunk/ws/java/modules/tasks/pom.xml,>
MavenProject: org.apache.synapse:synapse-core:2.2.0-SNAPSHOT @ <https://builds.apache.org/job/Synapse%20-%20Trunk/ws/java/modules/core/pom.xml,>
MavenProject: org.apache.synapse:synapse-extensions:2.2.0-SNAPSHOT @ <https://builds.apache.org/job/Synapse%20-%20Trunk/ws/java/modules/extensions/pom.xml,>
MavenProject: org.apache.synapse:synapse-samples:2.2.0-SNAPSHOT @ <https://builds.apache.org/job/Synapse%20-%20Trunk/ws/java/modules/samples/pom.xml,>
MavenProject: org.apache.synapse:synapse-patches:2.2.0-SNAPSHOT @ <https://builds.apache.org/job/Synapse%20-%20Trunk/ws/java/modules/patches/pom.xml,>
MavenProject: org.apache.synapse:synapse-experimental:2.2.0-SNAPSHOT @ <https://builds.apache.org/job/Synapse%20-%20Trunk/ws/java/modules/experimental/pom.xml,>
MavenProject: org.apache.synapse:synapse-documentation:2.2.0-SNAPSHOT @ <https://builds.apache.org/job/Synapse%20-%20Trunk/ws/java/modules/documentation/pom.xml,>
MavenProject: org.apache.synapse:synapse-war:2.2.0-SNAPSHOT @ <https://builds.apache.org/job/Synapse%20-%20Trunk/ws/java/modules/war/pom.xml,>
MavenProject: org.apache.synapse:synapse-handler:2.2.0-SNAPSHOT @ <https://builds.apache.org/job/Synapse%20-%20Trunk/ws/java/modules/handler/pom.xml,>
MavenProject: org.apache.synapse:synapse-xar-maven-plugin:2.2.0-SNAPSHOT @ <https://builds.apache.org/job/Synapse%20-%20Trunk/ws/java/modules/xar-maven-plugin/pom.xml,>
MavenProject: org.apache.synapse:synapse-config-migrator:2.2.0-SNAPSHOT @ <https://builds.apache.org/job/Synapse%20-%20Trunk/ws/java/modules/migrator/pom.xml,>
MavenProject: org.apache.synapse:synapse-distribution:2.2.0-SNAPSHOT @ <https://builds.apache.org/job/Synapse%20-%20Trunk/ws/java/modules/distribution/pom.xml,>
MavenProject: org.apache.synapse:synapse-package-skeleton:2.2.0-SNAPSHOT @ <https://builds.apache.org/job/Synapse%20-%20Trunk/ws/java/modules/packaging/package-skeleton/pom.xml,>
MavenProject: org.apache.synapse:synapse-package-archetype:2.2.0-SNAPSHOT @ <https://builds.apache.org/job/Synapse%20-%20Trunk/ws/java/modules/packaging/package-archetype/pom.xml,>
MavenProject: org.apache.synapse:synapse-integration:2.2.0-SNAPSHOT @ <https://builds.apache.org/job/Synapse%20-%20Trunk/ws/java/modules/integration/pom.xml]>
> [JENKINS] Archiving <https://builds.apache.org/job/Synapse%20-%20Trunk/ws/java/modules/migrator/pom.xml>
to /home/hudson/hudson/jobs/Synapse - Trunk/modules/org.apache.synapse$synapse-config-migrator/builds/2012-05-30_06-28-06/archive/org.apache.synapse/synapse-config-migrator/2.2.0-SNAPSHOT/synapse-config-migrator-2.2.0-SNAPSHOT.pom
> [JENKINS] Archiving <https://builds.apache.org/job/Synapse%20-%20Trunk/ws/java/modules/core/pom.xml>
to /home/hudson/hudson/jobs/Synapse - Trunk/modules/org.apache.synapse$synapse-core/builds/2012-05-30_06-28-06/archive/org.apache.synapse/synapse-core/2.2.0-SNAPSHOT/synapse-core-2.2.0-SNAPSHOT.pom
> [JENKINS] Archiving <https://builds.apache.org/job/Synapse%20-%20Trunk/ws/java/modules/integration/pom.xml>
to /home/hudson/hudson/jobs/Synapse - Trunk/modules/org.apache.synapse$synapse-integration/builds/2012-05-30_06-28-07/archive/org.apache.synapse/synapse-integration/2.2.0-SNAPSHOT/synapse-integration-2.2.0-SNAPSHOT.pom
> [JENKINS] Archiving <https://builds.apache.org/job/Synapse%20-%20Trunk/ws/java/modules/packaging/package-skeleton/pom.xml>
to /home/hudson/hudson/jobs/Synapse - Trunk/modules/org.apache.synapse$synapse-package-skeleton/builds/2012-05-30_06-28-07/archive/org.apache.synapse/synapse-package-skeleton/2.2.0-SNAPSHOT/synapse-package-skeleton-2.2.0-SNAPSHOT.pom
> [JENKINS] Archiving <https://builds.apache.org/job/Synapse%20-%20Trunk/ws/java/modules/securevault/pom.xml>
to /home/hudson/hudson/jobs/Synapse - Trunk/modules/org.apache.synapse$synapse-securevault/builds/2012-05-30_06-28-05/archive/org.apache.synapse/synapse-securevault/2.2.0-SNAPSHOT/synapse-securevault-2.2.0-SNAPSHOT.pom
> [JENKINS] Archiving <https://builds.apache.org/job/Synapse%20-%20Trunk/ws/java/modules/securevault/target/synapse-securevault-2.2.0-SNAPSHOT.jar>
to /home/hudson/hudson/jobs/Synapse - Trunk/modules/org.apache.synapse$synapse-securevault/builds/2012-05-30_06-28-05/archive/org.apache.synapse/synapse-securevault/2.2.0-SNAPSHOT/synapse-securevault-2.2.0-SNAPSHOT.jar
> [JENKINS] Archiving <https://builds.apache.org/job/Synapse%20-%20Trunk/ws/java/modules/packaging/package-archetype/pom.xml>
to /home/hudson/hudson/jobs/Synapse - Trunk/modules/org.apache.synapse$synapse-package-archetype/builds/2012-05-30_06-28-07/archive/org.apache.synapse/synapse-package-archetype/2.2.0-SNAPSHOT/synapse-package-archetype-2.2.0-SNAPSHOT.pom
> [JENKINS] Archiving <https://builds.apache.org/job/Synapse%20-%20Trunk/ws/java/modules/commons/pom.xml>
to /home/hudson/hudson/jobs/Synapse - Trunk/modules/org.apache.synapse$synapse-commons/builds/2012-05-30_06-28-05/archive/org.apache.synapse/synapse-commons/2.2.0-SNAPSHOT/synapse-commons-2.2.0-SNAPSHOT.pom
> [JENKINS] Archiving <https://builds.apache.org/job/Synapse%20-%20Trunk/ws/java/modules/commons/target/synapse-commons-2.2.0-SNAPSHOT.jar>
to /home/hudson/hudson/jobs/Synapse - Trunk/modules/org.apache.synapse$synapse-commons/builds/2012-05-30_06-28-05/archive/org.apache.synapse/synapse-commons/2.2.0-SNAPSHOT/synapse-commons-2.2.0-SNAPSHOT.jar
> [JENKINS] Archiving <https://builds.apache.org/job/Synapse%20-%20Trunk/ws/java/modules/extensions/pom.xml>
to /home/hudson/hudson/jobs/Synapse - Trunk/modules/org.apache.synapse$synapse-extensions/builds/2012-05-30_06-28-06/archive/org.apache.synapse/synapse-extensions/2.2.0-SNAPSHOT/synapse-extensions-2.2.0-SNAPSHOT.pom
> [JENKINS] Archiving <https://builds.apache.org/job/Synapse%20-%20Trunk/ws/java/modules/samples/pom.xml>
to /home/hudson/hudson/jobs/Synapse - Trunk/modules/org.apache.synapse$synapse-samples/builds/2012-05-30_06-28-06/archive/org.apache.synapse/synapse-samples/2.2.0-SNAPSHOT/synapse-samples-2.2.0-SNAPSHOT.pom
> [JENKINS] Archiving <https://builds.apache.org/job/Synapse%20-%20Trunk/ws/java/modules/xar-maven-plugin/pom.xml>
to /home/hudson/hudson/jobs/Synapse - Trunk/modules/org.apache.synapse$synapse-xar-maven-plugin/builds/2012-05-30_06-28-06/archive/org.apache.synapse/synapse-xar-maven-plugin/2.2.0-SNAPSHOT/synapse-xar-maven-plugin-2.2.0-SNAPSHOT.pom
> [JENKINS] Archiving <https://builds.apache.org/job/Synapse%20-%20Trunk/ws/java/modules/documentation/pom.xml>
to /home/hudson/hudson/jobs/Synapse - Trunk/modules/org.apache.synapse$synapse-documentation/builds/2012-05-30_06-28-07/archive/org.apache.synapse/synapse-documentation/2.2.0-SNAPSHOT/synapse-documentation-2.2.0-SNAPSHOT.pom
> [JENKINS] Archiving <https://builds.apache.org/job/Synapse%20-%20Trunk/ws/java/modules/transports/core/nhttp/pom.xml>
to /home/hudson/hudson/jobs/Synapse - Trunk/modules/org.apache.synapse$synapse-nhttp-transport/builds/2012-05-30_06-28-06/archive/org.apache.synapse/synapse-nhttp-transport/2.2.0-SNAPSHOT/synapse-nhttp-transport-2.2.0-SNAPSHOT.pom
> [JENKINS] Archiving <https://builds.apache.org/job/Synapse%20-%20Trunk/ws/java/modules/transports/core/nhttp/target/synapse-nhttp-transport-2.2.0-SNAPSHOT.jar>
to /home/hudson/hudson/jobs/Synapse - Trunk/modules/org.apache.synapse$synapse-nhttp-transport/builds/2012-05-30_06-28-06/archive/org.apache.synapse/synapse-nhttp-transport/2.2.0-SNAPSHOT/synapse-nhttp-transport-2.2.0-SNAPSHOT.jar
> [JENKINS] Archiving <https://builds.apache.org/job/Synapse%20-%20Trunk/ws/java/modules/transports/core/nhttp/target/synapse-nhttp-transport-2.2.0-SNAPSHOT-testkit-logs.zip>
to /home/hudson/hudson/jobs/Synapse - Trunk/modules/org.apache.synapse$synapse-nhttp-transport/builds/2012-05-30_06-28-06/archive/org.apache.synapse/synapse-nhttp-transport/2.2.0-SNAPSHOT/synapse-nhttp-transport-2.2.0-SNAPSHOT-testkit-logs.zip
> [JENKINS] Archiving <https://builds.apache.org/job/Synapse%20-%20Trunk/ws/java/modules/transports/core/pipe/pom.xml>
to /home/hudson/hudson/jobs/Synapse - Trunk/modules/org.apache.synapse$synapse-pipe-transport/builds/2012-05-30_06-28-06/archive/org.apache.synapse/synapse-pipe-transport/2.2.0-SNAPSHOT/synapse-pipe-transport-2.2.0-SNAPSHOT.pom
> [JENKINS] Archiving <https://builds.apache.org/job/Synapse%20-%20Trunk/ws/java/modules/transports/core/pipe/target/synapse-pipe-transport-2.2.0-SNAPSHOT.jar>
to /home/hudson/hudson/jobs/Synapse - Trunk/modules/org.apache.synapse$synapse-pipe-transport/builds/2012-05-30_06-28-06/archive/org.apache.synapse/synapse-pipe-transport/2.2.0-SNAPSHOT/synapse-pipe-transport-2.2.0-SNAPSHOT.jar
> [JENKINS] Archiving <https://builds.apache.org/job/Synapse%20-%20Trunk/ws/java/modules/transports/optional/fix/pom.xml>
to /home/hudson/hudson/jobs/Synapse - Trunk/modules/org.apache.synapse$synapse-fix-transport/builds/2012-05-30_06-28-06/archive/org.apache.synapse/synapse-fix-transport/2.2.0-SNAPSHOT/synapse-fix-transport-2.2.0-SNAPSHOT.pom
> [JENKINS] Archiving <https://builds.apache.org/job/Synapse%20-%20Trunk/ws/java/modules/transports/optional/fix/target/synapse-fix-transport-2.2.0-SNAPSHOT.jar>
to /home/hudson/hudson/jobs/Synapse - Trunk/modules/org.apache.synapse$synapse-fix-transport/builds/2012-05-30_06-28-06/archive/org.apache.synapse/synapse-fix-transport/2.2.0-SNAPSHOT/synapse-fix-transport-2.2.0-SNAPSHOT.jar
> [JENKINS] Archiving <https://builds.apache.org/job/Synapse%20-%20Trunk/ws/java/modules/transports/pom.xml>
to /home/hudson/hudson/jobs/Synapse - Trunk/modules/org.apache.synapse$synapse-transports/builds/2012-05-30_06-28-06/archive/org.apache.synapse/synapse-transports/2.2.0-SNAPSHOT/synapse-transports-2.2.0-SNAPSHOT.pom
> [JENKINS] Archiving <https://builds.apache.org/job/Synapse%20-%20Trunk/ws/java/modules/war/pom.xml>
to /home/hudson/hudson/jobs/Synapse - Trunk/modules/org.apache.synapse$synapse-war/builds/2012-05-30_06-28-06/archive/org.apache.synapse/synapse-war/2.2.0-SNAPSHOT/synapse-war-2.2.0-SNAPSHOT.pom
> [JENKINS] Archiving <https://builds.apache.org/job/Synapse%20-%20Trunk/ws/java/pom.xml>
to /home/hudson/hudson/jobs/Synapse - Trunk/modules/org.apache.synapse$Apache-Synapse/builds/2012-05-30_06-28-05/archive/org.apache.synapse/Apache-Synapse/2.2.0-SNAPSHOT/Apache-Synapse-2.2.0-SNAPSHOT.pom
> [JENKINS] Archiving <https://builds.apache.org/job/Synapse%20-%20Trunk/ws/java/modules/transports/core/vfs/pom.xml>
to /home/hudson/hudson/jobs/Synapse - Trunk/modules/org.apache.synapse$synapse-vfs-transport/builds/2012-05-30_06-28-06/archive/org.apache.synapse/synapse-vfs-transport/2.2.0-SNAPSHOT/synapse-vfs-transport-2.2.0-SNAPSHOT.pom
> [JENKINS] Archiving <https://builds.apache.org/job/Synapse%20-%20Trunk/ws/java/modules/transports/core/vfs/target/synapse-vfs-transport-2.2.0-SNAPSHOT.jar>
to /home/hudson/hudson/jobs/Synapse - Trunk/modules/org.apache.synapse$synapse-vfs-transport/builds/2012-05-30_06-28-06/archive/org.apache.synapse/synapse-vfs-transport/2.2.0-SNAPSHOT/synapse-vfs-transport-2.2.0-SNAPSHOT.jar
> [JENKINS] Archiving <https://builds.apache.org/job/Synapse%20-%20Trunk/ws/java/modules/transports/core/vfs/target/synapse-vfs-transport-2.2.0-SNAPSHOT-testkit-logs.zip>
to /home/hudson/hudson/jobs/Synapse - Trunk/modules/org.apache.synapse$synapse-vfs-transport/builds/2012-05-30_06-28-06/archive/org.apache.synapse/synapse-vfs-transport/2.2.0-SNAPSHOT/synapse-vfs-transport-2.2.0-SNAPSHOT-testkit-logs.zip
> [JENKINS] Archiving <https://builds.apache.org/job/Synapse%20-%20Trunk/ws/java/modules/patches/pom.xml>
to /home/hudson/hudson/jobs/Synapse - Trunk/modules/org.apache.synapse$synapse-patches/builds/2012-05-30_06-28-06/archive/org.apache.synapse/synapse-patches/2.2.0-SNAPSHOT/synapse-patches-2.2.0-SNAPSHOT.pom
> [JENKINS] Archiving <https://builds.apache.org/job/Synapse%20-%20Trunk/ws/java/modules/experimental/pom.xml>
to /home/hudson/hudson/jobs/Synapse - Trunk/modules/org.apache.synapse$synapse-experimental/builds/2012-05-30_06-28-06/archive/org.apache.synapse/synapse-experimental/2.2.0-SNAPSHOT/synapse-experimental-2.2.0-SNAPSHOT.pom
> [JENKINS] Archiving <https://builds.apache.org/job/Synapse%20-%20Trunk/ws/java/modules/tasks/pom.xml>
to /home/hudson/hudson/jobs/Synapse - Trunk/modules/org.apache.synapse$synapse-tasks/builds/2012-05-30_06-28-06/archive/org.apache.synapse/synapse-tasks/2.2.0-SNAPSHOT/synapse-tasks-2.2.0-SNAPSHOT.pom
> [JENKINS] Archiving <https://builds.apache.org/job/Synapse%20-%20Trunk/ws/java/modules/tasks/target/synapse-tasks-2.2.0-SNAPSHOT.jar>
to /home/hudson/hudson/jobs/Synapse - Trunk/modules/org.apache.synapse$synapse-tasks/builds/2012-05-30_06-28-06/archive/org.apache.synapse/synapse-tasks/2.2.0-SNAPSHOT/synapse-tasks-2.2.0-SNAPSHOT.jar
> [JENKINS] Archiving <https://builds.apache.org/job/Synapse%20-%20Trunk/ws/java/modules/handler/pom.xml>
to /home/hudson/hudson/jobs/Synapse - Trunk/modules/org.apache.synapse$synapse-handler/builds/2012-05-30_06-28-06/archive/org.apache.synapse/synapse-handler/2.2.0-SNAPSHOT/synapse-handler-2.2.0-SNAPSHOT.pom
> [JENKINS] Archiving <https://builds.apache.org/job/Synapse%20-%20Trunk/ws/java/modules/distribution/pom.xml>
to /home/hudson/hudson/jobs/Synapse - Trunk/modules/org.apache.synapse$synapse-distribution/builds/2012-05-30_06-28-06/archive/org.apache.synapse/synapse-distribution/2.2.0-SNAPSHOT/synapse-distribution-2.2.0-SNAPSHOT.pom
> Waiting for Jenkins to finish collecting data
> mavenExecutionResult exceptions not empty
> message : Failed to execute goal org.apache.maven.plugins:maven-compiler-plugin:2.3.2:compile
(default-compile) on project synapse-core: Compilation failure
> cause : Compilation failure
> Stack trace :
> org.apache.maven.lifecycle.LifecycleExecutionException: Failed to execute goal org.apache.maven.plugins:maven-compiler-plugin:2.3.2:compile
(default-compile) on project synapse-core: Compilation failure
>        at org.apache.maven.lifecycle.internal.MojoExecutor.execute(MojoExecutor.java:213)
>        at org.apache.maven.lifecycle.internal.MojoExecutor.execute(MojoExecutor.java:153)
>        at org.apache.maven.lifecycle.internal.MojoExecutor.execute(MojoExecutor.java:145)
>        at org.apache.maven.lifecycle.internal.LifecycleModuleBuilder.buildProject(LifecycleModuleBuilder.java:84)
>        at org.apache.maven.lifecycle.internal.LifecycleModuleBuilder.buildProject(LifecycleModuleBuilder.java:59)
>        at org.apache.maven.lifecycle.internal.LifecycleStarter.singleThreadedBuild(LifecycleStarter.java:183)
>        at org.apache.maven.lifecycle.internal.LifecycleStarter.execute(LifecycleStarter.java:161)
>        at org.apache.maven.DefaultMaven.doExecute(DefaultMaven.java:319)
>        at org.apache.maven.DefaultMaven.execute(DefaultMaven.java:156)
>        at org.jvnet.hudson.maven3.launcher.Maven3Launcher.main(Maven3Launcher.java:79)
>        at sun.reflect.NativeMethodAccessorImpl.invoke0(Native Method)
>        at sun.reflect.NativeMethodAccessorImpl.invoke(NativeMethodAccessorImpl.java:39)
>        at sun.reflect.DelegatingMethodAccessorImpl.invoke(DelegatingMethodAccessorImpl.java:25)
>        at java.lang.reflect.Method.invoke(Method.java:597)
>        at org.codehaus.plexus.classworlds.launcher.Launcher.launchStandard(Launcher.java:329)
>        at org.codehaus.plexus.classworlds.launcher.Launcher.launch(Launcher.java:239)
>        at org.jvnet.hudson.maven3.agent.Maven3Main.launch(Maven3Main.java:158)
>        at hudson.maven.Maven3Builder.call(Maven3Builder.java:98)
>        at hudson.maven.Maven3Builder.call(Maven3Builder.java:64)
>        at hudson.remoting.UserRequest.perform(UserRequest.java:118)
>        at hudson.remoting.UserRequest.perform(UserRequest.java:48)
>        at hudson.remoting.Request$2.run(Request.java:287)
>        at hudson.remoting.InterceptingExecutorService$1.call(InterceptingExecutorService.java:72)
>        at java.util.concurrent.FutureTask$Sync.innerRun(FutureTask.java:303)
>        at java.util.concurrent.FutureTask.run(FutureTask.java:138)
>        at java.util.concurrent.ThreadPoolExecutor$Worker.runTask(ThreadPoolExecutor.java:886)
>        at java.util.concurrent.ThreadPoolExecutor$Worker.run(ThreadPoolExecutor.java:908)
>        at java.lang.Thread.run(Thread.java:619)
> Caused by: org.apache.maven.plugin.CompilationFailureException: Compilation failure
>        at org.apache.maven.plugin.AbstractCompilerMojo.execute(AbstractCompilerMojo.java:656)
>        at org.apache.maven.plugin.CompilerMojo.execute(CompilerMojo.java:128)
>        at org.apache.maven.plugin.DefaultBuildPluginManager.executeMojo(DefaultBuildPluginManager.java:101)
>        at org.apache.maven.lifecycle.internal.MojoExecutor.execute(MojoExecutor.java:209)
>        ... 27 more
> Sending e-mails to: dev@synapse.apache.org
> channel stopped
> [locks-and-latches] Releasing all the locks
> [locks-and-latches] All the locks released
>
> ---------------------------------------------------------------------
> To unsubscribe, e-mail: dev-unsubscribe@synapse.apache.org
> For additional commands, e-mail: dev-help@synapse.apache.org
>



-- 
Sagara Gunathunga

Blog      - http://ssagara.blogspot.com
Web      - http://people.apache.org/~sagara/
LinkedIn - http://www.linkedin.com/in/ssagara

---------------------------------------------------------------------
To unsubscribe, e-mail: dev-unsubscribe@synapse.apache.org
For additional commands, e-mail: dev-help@synapse.apache.org


Mime
View raw message