synapse-dev mailing list archives

Site index · List index
Message view « Date » · « Thread »
Top « Date » · « Thread »
From Apache Jenkins Server <jenk...@builds.apache.org>
Subject Build failed in Jenkins: Synapse - Trunk #5352
Date Thu, 27 Apr 2017 21:13:38 GMT
See <https://builds.apache.org/job/Synapse%20-%20Trunk/5352/display/redirect>

------------------------------------------
[...truncated 2.12 MB...]
[JENKINS] Archiving <https://builds.apache.org/job/Synapse%20-%20Trunk/ws/java/modules/transports/pom.xml>
to org.apache.synapse/synapse-transports/3.0.1-SNAPSHOT/synapse-transports-3.0.1-SNAPSHOT.pom
[JENKINS] Archiving <https://builds.apache.org/job/Synapse%20-%20Trunk/ws/java/modules/documentation/pom.xml>
to org.apache.synapse/synapse-documentation/3.0.1-SNAPSHOT/synapse-documentation-3.0.1-SNAPSHOT.pom
[JENKINS] Archiving <https://builds.apache.org/job/Synapse%20-%20Trunk/ws/java/modules/documentation/target/synapse-documentation-3.0.1-SNAPSHOT-site.xml>
to org.apache.synapse/synapse-documentation/3.0.1-SNAPSHOT/synapse-documentation-3.0.1-SNAPSHOT-site.xml
[JENKINS] Archiving <https://builds.apache.org/job/Synapse%20-%20Trunk/ws/java/modules/documentation/target/synapse-documentation-3.0.1-SNAPSHOT-docs.zip>
to org.apache.synapse/synapse-documentation/3.0.1-SNAPSHOT/synapse-documentation-3.0.1-SNAPSHOT-docs.zip
[JENKINS] Archiving <https://builds.apache.org/job/Synapse%20-%20Trunk/ws/java/modules/migrator/pom.xml>
to org.apache.synapse/synapse-config-migrator/3.0.1-SNAPSHOT/synapse-config-migrator-3.0.1-SNAPSHOT.pom
[JENKINS] Archiving <https://builds.apache.org/job/Synapse%20-%20Trunk/ws/java/modules/migrator/target/synapse-config-migrator-3.0.1-SNAPSHOT.jar>
to org.apache.synapse/synapse-config-migrator/3.0.1-SNAPSHOT/synapse-config-migrator-3.0.1-SNAPSHOT.jar
[JENKINS] Archiving <https://builds.apache.org/job/Synapse%20-%20Trunk/ws/java/modules/commons/pom.xml>
to org.apache.synapse/synapse-commons/3.0.1-SNAPSHOT/synapse-commons-3.0.1-SNAPSHOT.pom
[JENKINS] Archiving <https://builds.apache.org/job/Synapse%20-%20Trunk/ws/java/modules/commons/target/synapse-commons-3.0.1-SNAPSHOT.jar>
to org.apache.synapse/synapse-commons/3.0.1-SNAPSHOT/synapse-commons-3.0.1-SNAPSHOT.jar
[JENKINS] Archiving <https://builds.apache.org/job/Synapse%20-%20Trunk/ws/java/modules/samples/pom.xml>
to org.apache.synapse/synapse-samples/3.0.1-SNAPSHOT/synapse-samples-3.0.1-SNAPSHOT.pom
[JENKINS] Archiving <https://builds.apache.org/job/Synapse%20-%20Trunk/ws/java/modules/samples/target/synapse-samples-3.0.1-SNAPSHOT.jar>
to org.apache.synapse/synapse-samples/3.0.1-SNAPSHOT/synapse-samples-3.0.1-SNAPSHOT.jar
[JENKINS] Archiving <https://builds.apache.org/job/Synapse%20-%20Trunk/ws/java/modules/war/pom.xml>
to org.apache.synapse/synapse-war/3.0.1-SNAPSHOT/synapse-war-3.0.1-SNAPSHOT.pom
[JENKINS] Archiving <https://builds.apache.org/job/Synapse%20-%20Trunk/ws/java/target/synapse.war>
to org.apache.synapse/synapse-war/3.0.1-SNAPSHOT/synapse-war-3.0.1-SNAPSHOT.war
<https://builds.apache.org/job/Synapse%20-%20Trunk/ws/java/target/synapse.war> is not
inside <https://builds.apache.org/job/Synapse%20-%20Trunk/ws/java/modules/war/;> will
archive in a separate pass
Compressed 35.06 MB of artifacts by 76.4% relative to #5351
[JENKINS] Archiving <https://builds.apache.org/job/Synapse%20-%20Trunk/ws/java/pom.xml>
to org.apache.synapse/Apache-Synapse/3.0.1-SNAPSHOT/Apache-Synapse-3.0.1-SNAPSHOT.pom
Compressed 55.89 KB of artifacts by 57.3% relative to #5351
[JENKINS] Archiving <https://builds.apache.org/job/Synapse%20-%20Trunk/ws/java/modules/extensions/pom.xml>
to org.apache.synapse/synapse-extensions/3.0.1-SNAPSHOT/synapse-extensions-3.0.1-SNAPSHOT.pom
[JENKINS] Archiving <https://builds.apache.org/job/Synapse%20-%20Trunk/ws/java/modules/extensions/target/synapse-extensions-3.0.1-SNAPSHOT.jar>
to org.apache.synapse/synapse-extensions/3.0.1-SNAPSHOT/synapse-extensions-3.0.1-SNAPSHOT.jar
[JENKINS] Archiving <https://builds.apache.org/job/Synapse%20-%20Trunk/ws/java/modules/handler/pom.xml>
to org.apache.synapse/synapse-handler/3.0.1-SNAPSHOT/synapse-handler-3.0.1-SNAPSHOT.pom
[JENKINS] Archiving <https://builds.apache.org/job/Synapse%20-%20Trunk/ws/java/modules/handler/target/synapse-handler-3.0.1-SNAPSHOT.jar>
to org.apache.synapse/synapse-handler/3.0.1-SNAPSHOT/synapse-handler-3.0.1-SNAPSHOT.jar
[JENKINS] Archiving <https://builds.apache.org/job/Synapse%20-%20Trunk/ws/java/modules/handler/target/synapse-handler-3.0.1-SNAPSHOT.mar>
to org.apache.synapse/synapse-handler/3.0.1-SNAPSHOT/synapse-handler-3.0.1-SNAPSHOT.mar
[JENKINS] Archiving <https://builds.apache.org/job/Synapse%20-%20Trunk/ws/java/modules/xar-maven-plugin/pom.xml>
to org.apache.synapse/synapse-xar-maven-plugin/3.0.1-SNAPSHOT/synapse-xar-maven-plugin-3.0.1-SNAPSHOT.pom
[JENKINS] Archiving <https://builds.apache.org/job/Synapse%20-%20Trunk/ws/java/modules/xar-maven-plugin/target/synapse-xar-maven-plugin-3.0.1-SNAPSHOT.jar>
to org.apache.synapse/synapse-xar-maven-plugin/3.0.1-SNAPSHOT/synapse-xar-maven-plugin-3.0.1-SNAPSHOT.jar
[JENKINS] Archiving <https://builds.apache.org/job/Synapse%20-%20Trunk/ws/java/modules/tasks/pom.xml>
to org.apache.synapse/synapse-tasks/3.0.1-SNAPSHOT/synapse-tasks-3.0.1-SNAPSHOT.pom
[JENKINS] Archiving <https://builds.apache.org/job/Synapse%20-%20Trunk/ws/java/modules/tasks/target/synapse-tasks-3.0.1-SNAPSHOT.jar>
to org.apache.synapse/synapse-tasks/3.0.1-SNAPSHOT/synapse-tasks-3.0.1-SNAPSHOT.jar
[JENKINS] Archiving <https://builds.apache.org/job/Synapse%20-%20Trunk/ws/java/modules/packaging/package-archetype/pom.xml>
to org.apache.synapse/synapse-package-archetype/3.0.1-SNAPSHOT/synapse-package-archetype-3.0.1-SNAPSHOT.pom
[JENKINS] Archiving <https://builds.apache.org/job/Synapse%20-%20Trunk/ws/java/modules/packaging/package-archetype/target/synapse-package-archetype-3.0.1-SNAPSHOT.jar>
to org.apache.synapse/synapse-package-archetype/3.0.1-SNAPSHOT/synapse-package-archetype-3.0.1-SNAPSHOT.jar
[JENKINS] Archiving <https://builds.apache.org/job/Synapse%20-%20Trunk/ws/java/modules/transports/core/nhttp/pom.xml>
to org.apache.synapse/synapse-nhttp-transport/3.0.1-SNAPSHOT/synapse-nhttp-transport-3.0.1-SNAPSHOT.pom
[JENKINS] Archiving <https://builds.apache.org/job/Synapse%20-%20Trunk/ws/java/modules/transports/core/nhttp/target/synapse-nhttp-transport-3.0.1-SNAPSHOT.jar>
to org.apache.synapse/synapse-nhttp-transport/3.0.1-SNAPSHOT/synapse-nhttp-transport-3.0.1-SNAPSHOT.jar
[JENKINS] Archiving <https://builds.apache.org/job/Synapse%20-%20Trunk/ws/java/modules/transports/core/nhttp/target/synapse-nhttp-transport-3.0.1-SNAPSHOT-testkit-logs.zip>
to org.apache.synapse/synapse-nhttp-transport/3.0.1-SNAPSHOT/synapse-nhttp-transport-3.0.1-SNAPSHOT-testkit-logs.zip
[JENKINS] Archiving <https://builds.apache.org/job/Synapse%20-%20Trunk/ws/java/modules/transports/core/vfs/pom.xml>
to org.apache.synapse/synapse-vfs-transport/3.0.1-SNAPSHOT/synapse-vfs-transport-3.0.1-SNAPSHOT.pom
[JENKINS] Archiving <https://builds.apache.org/job/Synapse%20-%20Trunk/ws/java/modules/transports/core/vfs/target/synapse-vfs-transport-3.0.1-SNAPSHOT.jar>
to org.apache.synapse/synapse-vfs-transport/3.0.1-SNAPSHOT/synapse-vfs-transport-3.0.1-SNAPSHOT.jar
[JENKINS] Archiving <https://builds.apache.org/job/Synapse%20-%20Trunk/ws/java/modules/transports/core/vfs/target/synapse-vfs-transport-3.0.1-SNAPSHOT-testkit-logs.zip>
to org.apache.synapse/synapse-vfs-transport/3.0.1-SNAPSHOT/synapse-vfs-transport-3.0.1-SNAPSHOT-testkit-logs.zip
[JENKINS] Archiving <https://builds.apache.org/job/Synapse%20-%20Trunk/ws/java/modules/packaging/package-skeleton/pom.xml>
to org.apache.synapse/synapse-package-skeleton/3.0.1-SNAPSHOT/synapse-package-skeleton-3.0.1-SNAPSHOT.pom
[JENKINS] Archiving <https://builds.apache.org/job/Synapse%20-%20Trunk/ws/java/modules/packaging/package-skeleton/target/synapse-package-skeleton-3.0.1-SNAPSHOT-skeleton.zip>
to org.apache.synapse/synapse-package-skeleton/3.0.1-SNAPSHOT/synapse-package-skeleton-3.0.1-SNAPSHOT-skeleton.zip
Compressed 449.08 KB of artifacts by 28.5% relative to #5351
[JENKINS] Archiving <https://builds.apache.org/job/Synapse%20-%20Trunk/ws/java/modules/integration/pom.xml>
to org.apache.synapse/synapse-integration/3.0.1-SNAPSHOT/synapse-integration-3.0.1-SNAPSHOT.pom
[JENKINS] Archiving <https://builds.apache.org/job/Synapse%20-%20Trunk/ws/java/modules/integration/target/synapse-integration-3.0.1-SNAPSHOT.jar>
to org.apache.synapse/synapse-integration/3.0.1-SNAPSHOT/synapse-integration-3.0.1-SNAPSHOT.jar
[JENKINS] Archiving <https://builds.apache.org/job/Synapse%20-%20Trunk/ws/java/modules/transports/core/pipe/pom.xml>
to org.apache.synapse/synapse-pipe-transport/3.0.1-SNAPSHOT/synapse-pipe-transport-3.0.1-SNAPSHOT.pom
[JENKINS] Archiving <https://builds.apache.org/job/Synapse%20-%20Trunk/ws/java/modules/transports/core/pipe/target/synapse-pipe-transport-3.0.1-SNAPSHOT.jar>
to org.apache.synapse/synapse-pipe-transport/3.0.1-SNAPSHOT/synapse-pipe-transport-3.0.1-SNAPSHOT.jar
[JENKINS] Archiving <https://builds.apache.org/job/Synapse%20-%20Trunk/ws/java/modules/core/pom.xml>
to org.apache.synapse/synapse-core/3.0.1-SNAPSHOT/synapse-core-3.0.1-SNAPSHOT.pom
[JENKINS] Archiving <https://builds.apache.org/job/Synapse%20-%20Trunk/ws/java/modules/core/target/synapse-core-3.0.1-SNAPSHOT.jar>
to org.apache.synapse/synapse-core/3.0.1-SNAPSHOT/synapse-core-3.0.1-SNAPSHOT.jar
[JENKINS] Archiving <https://builds.apache.org/job/Synapse%20-%20Trunk/ws/java/modules/core/target/synapse-test-lib.zip>
to org.apache.synapse/synapse-core/3.0.1-SNAPSHOT/synapse-core-3.0.1-SNAPSHOT-test-lib.zip
[JENKINS] Archiving <https://builds.apache.org/job/Synapse%20-%20Trunk/ws/java/modules/core/target/synapse-eiptest-lib.zip>
to org.apache.synapse/synapse-core/3.0.1-SNAPSHOT/synapse-core-3.0.1-SNAPSHOT-eiptest-lib.zip
[JENKINS] Archiving <https://builds.apache.org/job/Synapse%20-%20Trunk/ws/java/modules/core/target/synapse-eipcore-lib.zip>
to org.apache.synapse/synapse-core/3.0.1-SNAPSHOT/synapse-core-3.0.1-SNAPSHOT-eipcore-lib.zip
[JENKINS] Archiving <https://builds.apache.org/job/Synapse%20-%20Trunk/ws/java/modules/core/target/synapse-core-3.0.1-SNAPSHOT-tests.jar>
to org.apache.synapse/synapse-core/3.0.1-SNAPSHOT/synapse-core-3.0.1-SNAPSHOT-tests.jar
[JENKINS] Archiving <https://builds.apache.org/job/Synapse%20-%20Trunk/ws/java/modules/transports/optional/amqp/pom.xml>
to org.apache.synapse/synapse-amqp-transport/3.0.1-SNAPSHOT/synapse-amqp-transport-3.0.1-SNAPSHOT.pom
[JENKINS] Archiving <https://builds.apache.org/job/Synapse%20-%20Trunk/ws/java/modules/transports/optional/amqp/target/synapse-amqp-transport-3.0.1-SNAPSHOT.jar>
to org.apache.synapse/synapse-amqp-transport/3.0.1-SNAPSHOT/synapse-amqp-transport-3.0.1-SNAPSHOT.jar
[JENKINS] Archiving <https://builds.apache.org/job/Synapse%20-%20Trunk/ws/java/modules/patches/pom.xml>
to org.apache.synapse/synapse-patches/3.0.1-SNAPSHOT/synapse-patches-3.0.1-SNAPSHOT.pom
[JENKINS] Archiving <https://builds.apache.org/job/Synapse%20-%20Trunk/ws/java/modules/patches/target/synapse-patches-3.0.1-SNAPSHOT.jar>
to org.apache.synapse/synapse-patches/3.0.1-SNAPSHOT/synapse-patches-3.0.1-SNAPSHOT.jar
[JENKINS] Archiving <https://builds.apache.org/job/Synapse%20-%20Trunk/ws/java/modules/patches/target/synapse-patches-3.0.1-SNAPSHOT-jars.zip>
to org.apache.synapse/synapse-patches/3.0.1-SNAPSHOT/synapse-patches-3.0.1-SNAPSHOT-jars.zip
[JENKINS] Archiving <https://builds.apache.org/job/Synapse%20-%20Trunk/ws/java/modules/distribution/pom.xml>
to org.apache.synapse/synapse-distribution/3.0.1-SNAPSHOT/synapse-distribution-3.0.1-SNAPSHOT.pom
[JENKINS] Archiving <https://builds.apache.org/job/Synapse%20-%20Trunk/ws/java/modules/distribution/target/synapse-3.0.1-SNAPSHOT-bin.tar.gz>
to org.apache.synapse/synapse-distribution/3.0.1-SNAPSHOT/synapse-distribution-3.0.1-SNAPSHOT-bin.tar.gz
[JENKINS] Archiving <https://builds.apache.org/job/Synapse%20-%20Trunk/ws/java/modules/distribution/target/synapse-3.0.1-SNAPSHOT-bin.zip>
to org.apache.synapse/synapse-distribution/3.0.1-SNAPSHOT/synapse-distribution-3.0.1-SNAPSHOT-bin.zip
[JENKINS] Archiving <https://builds.apache.org/job/Synapse%20-%20Trunk/ws/java/modules/distribution/target/synapse-3.0.1-SNAPSHOT-src.tar.gz>
to org.apache.synapse/synapse-distribution/3.0.1-SNAPSHOT/synapse-distribution-3.0.1-SNAPSHOT-src.tar.gz
[JENKINS] Archiving <https://builds.apache.org/job/Synapse%20-%20Trunk/ws/java/modules/distribution/target/synapse-3.0.1-SNAPSHOT-src.zip>
to org.apache.synapse/synapse-distribution/3.0.1-SNAPSHOT/synapse-distribution-3.0.1-SNAPSHOT-src.zip
Compressed 90.00 MB of artifacts by 35.7% relative to #5351
[JENKINS] Archiving <https://builds.apache.org/job/Synapse%20-%20Trunk/ws/java/modules/experimental/pom.xml>
to org.apache.synapse/synapse-experimental/3.0.1-SNAPSHOT/synapse-experimental-3.0.1-SNAPSHOT.pom
[JENKINS] Archiving <https://builds.apache.org/job/Synapse%20-%20Trunk/ws/java/modules/experimental/target/synapse-experimental-3.0.1-SNAPSHOT.jar>
to org.apache.synapse/synapse-experimental/3.0.1-SNAPSHOT/synapse-experimental-3.0.1-SNAPSHOT.jar
[locks-and-latches] Releasing all the locks
[locks-and-latches] All the locks released
channel stopped
Maven RedeployPublisher use remote ubuntu-4 maven settings from : /home/jenkins/.m2/settings.xml
[ERROR] uniqueVersion == false is not anymore supported in maven 3
[INFO] Deployment in https://repository.apache.org/content/repositories/snapshots (id=apache.snapshots.https,uniqueVersion=false)
Deploying the main artifact Apache-Synapse-3.0.1-SNAPSHOT.pom
Downloading: https://repository.apache.org/content/repositories/snapshots/org/apache/synapse/Apache-Synapse/3.0.1-SNAPSHOT/maven-metadata.xml
Downloaded: https://repository.apache.org/content/repositories/snapshots/org/apache/synapse/Apache-Synapse/3.0.1-SNAPSHOT/maven-metadata.xml
(611 B at 0.3 KB/sec)
Uploading: https://repository.apache.org/content/repositories/snapshots/org/apache/synapse/Apache-Synapse/3.0.1-SNAPSHOT/Apache-Synapse-3.0.1-20170427.210827-23.pom
Uploaded: https://repository.apache.org/content/repositories/snapshots/org/apache/synapse/Apache-Synapse/3.0.1-SNAPSHOT/Apache-Synapse-3.0.1-20170427.210827-23.pom
(56 KB at 43.9 KB/sec)
Downloading: https://repository.apache.org/content/repositories/snapshots/org/apache/synapse/Apache-Synapse/maven-metadata.xml
Downloaded: https://repository.apache.org/content/repositories/snapshots/org/apache/synapse/Apache-Synapse/maven-metadata.xml
(392 B at 0.1 KB/sec)
Uploading: https://repository.apache.org/content/repositories/snapshots/org/apache/synapse/Apache-Synapse/3.0.1-SNAPSHOT/maven-metadata.xml
Uploaded: https://repository.apache.org/content/repositories/snapshots/org/apache/synapse/Apache-Synapse/3.0.1-SNAPSHOT/maven-metadata.xml
(611 B at 0.5 KB/sec)
Uploading: https://repository.apache.org/content/repositories/snapshots/org/apache/synapse/Apache-Synapse/maven-metadata.xml
Uploaded: https://repository.apache.org/content/repositories/snapshots/org/apache/synapse/Apache-Synapse/maven-metadata.xml
(392 B at 0.3 KB/sec)
[ERROR] uniqueVersion == false is not anymore supported in maven 3
[INFO] Deployment in https://repository.apache.org/content/repositories/snapshots (id=apache.snapshots.https,uniqueVersion=false)
Deploying the main artifact synapse-amqp-transport-3.0.1-SNAPSHOT.jar
Downloading: https://repository.apache.org/content/repositories/snapshots/org/apache/synapse/synapse-amqp-transport/3.0.1-SNAPSHOT/maven-metadata.xml
Downloaded: https://repository.apache.org/content/repositories/snapshots/org/apache/synapse/synapse-amqp-transport/3.0.1-SNAPSHOT/maven-metadata.xml
(793 B at 0.2 KB/sec)
Uploading: https://repository.apache.org/content/repositories/snapshots/org/apache/synapse/synapse-amqp-transport/3.0.1-SNAPSHOT/synapse-amqp-transport-3.0.1-20170427.210839-23.jar
Uploaded: https://repository.apache.org/content/repositories/snapshots/org/apache/synapse/synapse-amqp-transport/3.0.1-SNAPSHOT/synapse-amqp-transport-3.0.1-20170427.210839-23.jar
(69 KB at 55.5 KB/sec)
Uploading: https://repository.apache.org/content/repositories/snapshots/org/apache/synapse/synapse-amqp-transport/3.0.1-SNAPSHOT/synapse-amqp-transport-3.0.1-20170427.210839-23.pom
Uploaded: https://repository.apache.org/content/repositories/snapshots/org/apache/synapse/synapse-amqp-transport/3.0.1-SNAPSHOT/synapse-amqp-transport-3.0.1-20170427.210839-23.pom
(4 KB at 1.9 KB/sec)
Downloading: https://repository.apache.org/content/repositories/snapshots/org/apache/synapse/synapse-amqp-transport/maven-metadata.xml
Downloaded: https://repository.apache.org/content/repositories/snapshots/org/apache/synapse/synapse-amqp-transport/maven-metadata.xml
(400 B at 0.1 KB/sec)
Uploading: https://repository.apache.org/content/repositories/snapshots/org/apache/synapse/synapse-amqp-transport/3.0.1-SNAPSHOT/maven-metadata.xml
Uploaded: https://repository.apache.org/content/repositories/snapshots/org/apache/synapse/synapse-amqp-transport/3.0.1-SNAPSHOT/maven-metadata.xml
(793 B at 0.7 KB/sec)
Uploading: https://repository.apache.org/content/repositories/snapshots/org/apache/synapse/synapse-amqp-transport/maven-metadata.xml
Uploaded: https://repository.apache.org/content/repositories/snapshots/org/apache/synapse/synapse-amqp-transport/maven-metadata.xml
(400 B at 0.2 KB/sec)
[ERROR] uniqueVersion == false is not anymore supported in maven 3
[INFO] Deployment in https://repository.apache.org/content/repositories/snapshots (id=apache.snapshots.https,uniqueVersion=false)
Deploying the main artifact synapse-commons-3.0.1-SNAPSHOT.jar
Downloading: https://repository.apache.org/content/repositories/snapshots/org/apache/synapse/synapse-commons/3.0.1-SNAPSHOT/maven-metadata.xml
Downloaded: https://repository.apache.org/content/repositories/snapshots/org/apache/synapse/synapse-commons/3.0.1-SNAPSHOT/maven-metadata.xml
(786 B at 0.2 KB/sec)
Uploading: https://repository.apache.org/content/repositories/snapshots/org/apache/synapse/synapse-commons/3.0.1-SNAPSHOT/synapse-commons-3.0.1-20170427.210857-23.jar
Uploaded: https://repository.apache.org/content/repositories/snapshots/org/apache/synapse/synapse-commons/3.0.1-SNAPSHOT/synapse-commons-3.0.1-20170427.210857-23.jar
(173 KB at 126.1 KB/sec)
Uploading: https://repository.apache.org/content/repositories/snapshots/org/apache/synapse/synapse-commons/3.0.1-SNAPSHOT/synapse-commons-3.0.1-20170427.210857-23.pom
Uploaded: https://repository.apache.org/content/repositories/snapshots/org/apache/synapse/synapse-commons/3.0.1-SNAPSHOT/synapse-commons-3.0.1-20170427.210857-23.pom
(5 KB at 3.8 KB/sec)
Downloading: https://repository.apache.org/content/repositories/snapshots/org/apache/synapse/synapse-commons/maven-metadata.xml
Downloaded: https://repository.apache.org/content/repositories/snapshots/org/apache/synapse/synapse-commons/maven-metadata.xml
(393 B at 0.2 KB/sec)
Uploading: https://repository.apache.org/content/repositories/snapshots/org/apache/synapse/synapse-commons/3.0.1-SNAPSHOT/maven-metadata.xml
Uploaded: https://repository.apache.org/content/repositories/snapshots/org/apache/synapse/synapse-commons/3.0.1-SNAPSHOT/maven-metadata.xml
(786 B at 0.6 KB/sec)
Uploading: https://repository.apache.org/content/repositories/snapshots/org/apache/synapse/synapse-commons/maven-metadata.xml
Uploaded: https://repository.apache.org/content/repositories/snapshots/org/apache/synapse/synapse-commons/maven-metadata.xml
(393 B at 0.3 KB/sec)
[ERROR] uniqueVersion == false is not anymore supported in maven 3
[INFO] Deployment in https://repository.apache.org/content/repositories/snapshots (id=apache.snapshots.https,uniqueVersion=false)
Deploying the main artifact synapse-config-migrator-3.0.1-SNAPSHOT.jar
Downloading: https://repository.apache.org/content/repositories/snapshots/org/apache/synapse/synapse-config-migrator/3.0.1-SNAPSHOT/maven-metadata.xml
Downloaded: https://repository.apache.org/content/repositories/snapshots/org/apache/synapse/synapse-config-migrator/3.0.1-SNAPSHOT/maven-metadata.xml
(794 B at 0.6 KB/sec)
Uploading: https://repository.apache.org/content/repositories/snapshots/org/apache/synapse/synapse-config-migrator/3.0.1-SNAPSHOT/synapse-config-migrator-3.0.1-20170427.210908-23.jar
Uploaded: https://repository.apache.org/content/repositories/snapshots/org/apache/synapse/synapse-config-migrator/3.0.1-SNAPSHOT/synapse-config-migrator-3.0.1-20170427.210908-23.jar
(15 KB at 6.4 KB/sec)
Uploading: https://repository.apache.org/content/repositories/snapshots/org/apache/synapse/synapse-config-migrator/3.0.1-SNAPSHOT/synapse-config-migrator-3.0.1-20170427.210908-23.pom
Uploaded: https://repository.apache.org/content/repositories/snapshots/org/apache/synapse/synapse-config-migrator/3.0.1-SNAPSHOT/synapse-config-migrator-3.0.1-20170427.210908-23.pom
(4 KB at 2.8 KB/sec)
Downloading: https://repository.apache.org/content/repositories/snapshots/org/apache/synapse/synapse-config-migrator/maven-metadata.xml
Downloaded: https://repository.apache.org/content/repositories/snapshots/org/apache/synapse/synapse-config-migrator/maven-metadata.xml
(401 B at 0.1 KB/sec)
Uploading: https://repository.apache.org/content/repositories/snapshots/org/apache/synapse/synapse-config-migrator/3.0.1-SNAPSHOT/maven-metadata.xml
Uploaded: https://repository.apache.org/content/repositories/snapshots/org/apache/synapse/synapse-config-migrator/3.0.1-SNAPSHOT/maven-metadata.xml
(794 B at 0.6 KB/sec)
Uploading: https://repository.apache.org/content/repositories/snapshots/org/apache/synapse/synapse-config-migrator/maven-metadata.xml
Uploaded: https://repository.apache.org/content/repositories/snapshots/org/apache/synapse/synapse-config-migrator/maven-metadata.xml
(401 B at 0.4 KB/sec)
[ERROR] uniqueVersion == false is not anymore supported in maven 3
[INFO] Deployment in https://repository.apache.org/content/repositories/snapshots (id=apache.snapshots.https,uniqueVersion=false)
Deploying the main artifact synapse-core-3.0.1-SNAPSHOT.jar
Downloading: https://repository.apache.org/content/repositories/snapshots/org/apache/synapse/synapse-core/3.0.1-SNAPSHOT/maven-metadata.xml
Downloaded: https://repository.apache.org/content/repositories/snapshots/org/apache/synapse/synapse-core/3.0.1-SNAPSHOT/maven-metadata.xml
(2 KB at 0.5 KB/sec)
Uploading: https://repository.apache.org/content/repositories/snapshots/org/apache/synapse/synapse-core/3.0.1-SNAPSHOT/synapse-core-3.0.1-20170427.210924-23.jar
Uploaded: https://repository.apache.org/content/repositories/snapshots/org/apache/synapse/synapse-core/3.0.1-SNAPSHOT/synapse-core-3.0.1-20170427.210924-23.jar
(1143 KB at 647.3 KB/sec)
Uploading: https://repository.apache.org/content/repositories/snapshots/org/apache/synapse/synapse-core/3.0.1-SNAPSHOT/synapse-core-3.0.1-20170427.210924-23.pom
Uploaded: https://repository.apache.org/content/repositories/snapshots/org/apache/synapse/synapse-core/3.0.1-SNAPSHOT/synapse-core-3.0.1-20170427.210924-23.pom
(14 KB at 11.0 KB/sec)
Downloading: https://repository.apache.org/content/repositories/snapshots/org/apache/synapse/synapse-core/maven-metadata.xml
Downloaded: https://repository.apache.org/content/repositories/snapshots/org/apache/synapse/synapse-core/maven-metadata.xml
(390 B at 0.1 KB/sec)
Uploading: https://repository.apache.org/content/repositories/snapshots/org/apache/synapse/synapse-core/3.0.1-SNAPSHOT/maven-metadata.xml
Uploaded: https://repository.apache.org/content/repositories/snapshots/org/apache/synapse/synapse-core/3.0.1-SNAPSHOT/maven-metadata.xml
(2 KB at 1.5 KB/sec)
Uploading: https://repository.apache.org/content/repositories/snapshots/org/apache/synapse/synapse-core/maven-metadata.xml
Uploaded: https://repository.apache.org/content/repositories/snapshots/org/apache/synapse/synapse-core/maven-metadata.xml
(390 B at 0.3 KB/sec)
Deploying the main artifact synapse-core-3.0.1-SNAPSHOT-test-lib.zip
Uploading: https://repository.apache.org/content/repositories/snapshots/org/apache/synapse/synapse-core/3.0.1-SNAPSHOT/synapse-core-3.0.1-20170427.210924-23-test-lib.zip
Uploaded: https://repository.apache.org/content/repositories/snapshots/org/apache/synapse/synapse-core/3.0.1-SNAPSHOT/synapse-core-3.0.1-20170427.210924-23-test-lib.zip
(1130 KB at 656.0 KB/sec)
Uploading: https://repository.apache.org/content/repositories/snapshots/org/apache/synapse/synapse-core/3.0.1-SNAPSHOT/maven-metadata.xml
Uploaded: https://repository.apache.org/content/repositories/snapshots/org/apache/synapse/synapse-core/3.0.1-SNAPSHOT/maven-metadata.xml
(2 KB at 1.5 KB/sec)
Deploying the main artifact synapse-core-3.0.1-SNAPSHOT-eiptest-lib.zip
Uploading: https://repository.apache.org/content/repositories/snapshots/org/apache/synapse/synapse-core/3.0.1-SNAPSHOT/synapse-core-3.0.1-20170427.210924-23-eiptest-lib.zip
Uploaded: https://repository.apache.org/content/repositories/snapshots/org/apache/synapse/synapse-core/3.0.1-SNAPSHOT/synapse-core-3.0.1-20170427.210924-23-eiptest-lib.zip
(1127 KB at 617.0 KB/sec)
Uploading: https://repository.apache.org/content/repositories/snapshots/org/apache/synapse/synapse-core/3.0.1-SNAPSHOT/maven-metadata.xml
Uploaded: https://repository.apache.org/content/repositories/snapshots/org/apache/synapse/synapse-core/3.0.1-SNAPSHOT/maven-metadata.xml
(2 KB at 1.5 KB/sec)
Deploying the main artifact synapse-core-3.0.1-SNAPSHOT-eipcore-lib.zip
Uploading: https://repository.apache.org/content/repositories/snapshots/org/apache/synapse/synapse-core/3.0.1-SNAPSHOT/synapse-core-3.0.1-20170427.210924-23-eipcore-lib.zip
Uploaded: https://repository.apache.org/content/repositories/snapshots/org/apache/synapse/synapse-core/3.0.1-SNAPSHOT/synapse-core-3.0.1-20170427.210924-23-eipcore-lib.zip
(25 KB at 12.6 KB/sec)
Uploading: https://repository.apache.org/content/repositories/snapshots/org/apache/synapse/synapse-core/3.0.1-SNAPSHOT/maven-metadata.xml
Uploaded: https://repository.apache.org/content/repositories/snapshots/org/apache/synapse/synapse-core/3.0.1-SNAPSHOT/maven-metadata.xml
(2 KB at 1.4 KB/sec)
Deploying the main artifact synapse-core-3.0.1-SNAPSHOT-tests.jar
Uploading: https://repository.apache.org/content/repositories/snapshots/org/apache/synapse/synapse-core/3.0.1-SNAPSHOT/synapse-core-3.0.1-20170427.210924-23-tests.jar
Uploaded: https://repository.apache.org/content/repositories/snapshots/org/apache/synapse/synapse-core/3.0.1-SNAPSHOT/synapse-core-3.0.1-20170427.210924-23-tests.jar
(286 KB at 194.9 KB/sec)
Uploading: https://repository.apache.org/content/repositories/snapshots/org/apache/synapse/synapse-core/3.0.1-SNAPSHOT/maven-metadata.xml
Uploaded: https://repository.apache.org/content/repositories/snapshots/org/apache/synapse/synapse-core/3.0.1-SNAPSHOT/maven-metadata.xml
(2 KB at 0.7 KB/sec)
[ERROR] uniqueVersion == false is not anymore supported in maven 3
[INFO] Deployment in https://repository.apache.org/content/repositories/snapshots (id=apache.snapshots.https,uniqueVersion=false)
Deploying the main artifact synapse-distribution-3.0.1-SNAPSHOT.pom
Downloading: https://repository.apache.org/content/repositories/snapshots/org/apache/synapse/synapse-distribution/3.0.1-SNAPSHOT/maven-metadata.xml
Downloaded: https://repository.apache.org/content/repositories/snapshots/org/apache/synapse/synapse-distribution/3.0.1-SNAPSHOT/maven-metadata.xml
(2 KB at 0.3 KB/sec)
Uploading: https://repository.apache.org/content/repositories/snapshots/org/apache/synapse/synapse-distribution/3.0.1-SNAPSHOT/synapse-distribution-3.0.1-20170427.210959-23.pom
Uploaded: https://repository.apache.org/content/repositories/snapshots/org/apache/synapse/synapse-distribution/3.0.1-SNAPSHOT/synapse-distribution-3.0.1-20170427.210959-23.pom
(8 KB at 6.2 KB/sec)
Downloading: https://repository.apache.org/content/repositories/snapshots/org/apache/synapse/synapse-distribution/maven-metadata.xml
Downloaded: https://repository.apache.org/content/repositories/snapshots/org/apache/synapse/synapse-distribution/maven-metadata.xml
(398 B at 0.1 KB/sec)
Uploading: https://repository.apache.org/content/repositories/snapshots/org/apache/synapse/synapse-distribution/3.0.1-SNAPSHOT/maven-metadata.xml
Uploaded: https://repository.apache.org/content/repositories/snapshots/org/apache/synapse/synapse-distribution/3.0.1-SNAPSHOT/maven-metadata.xml
(2 KB at 1.3 KB/sec)
Uploading: https://repository.apache.org/content/repositories/snapshots/org/apache/synapse/synapse-distribution/maven-metadata.xml
Uploaded: https://repository.apache.org/content/repositories/snapshots/org/apache/synapse/synapse-distribution/maven-metadata.xml
(398 B at 0.3 KB/sec)
Deploying the main artifact synapse-distribution-3.0.1-SNAPSHOT-bin.tar.gz
Uploading: https://repository.apache.org/content/repositories/snapshots/org/apache/synapse/synapse-distribution/3.0.1-SNAPSHOT/synapse-distribution-3.0.1-20170427.210959-23-bin.tar.gz
Uploaded: https://repository.apache.org/content/repositories/snapshots/org/apache/synapse/synapse-distribution/3.0.1-SNAPSHOT/synapse-distribution-3.0.1-20170427.210959-23-bin.tar.gz
(40087 KB at 4352.0 KB/sec)
Uploading: https://repository.apache.org/content/repositories/snapshots/org/apache/synapse/synapse-distribution/3.0.1-SNAPSHOT/maven-metadata.xml
Uploaded: https://repository.apache.org/content/repositories/snapshots/org/apache/synapse/synapse-distribution/3.0.1-SNAPSHOT/maven-metadata.xml
(2 KB at 1.3 KB/sec)
Deploying the main artifact synapse-distribution-3.0.1-SNAPSHOT-bin.zip
Uploading: https://repository.apache.org/content/repositories/snapshots/org/apache/synapse/synapse-distribution/3.0.1-SNAPSHOT/synapse-distribution-3.0.1-20170427.210959-23-bin.zip
Uploaded: https://repository.apache.org/content/repositories/snapshots/org/apache/synapse/synapse-distribution/3.0.1-SNAPSHOT/synapse-distribution-3.0.1-20170427.210959-23-bin.zip
(40764 KB at 6677.0 KB/sec)
Uploading: https://repository.apache.org/content/repositories/snapshots/org/apache/synapse/synapse-distribution/3.0.1-SNAPSHOT/maven-metadata.xml
Uploaded: https://repository.apache.org/content/repositories/snapshots/org/apache/synapse/synapse-distribution/3.0.1-SNAPSHOT/maven-metadata.xml
(2 KB at 1.3 KB/sec)
Deploying the main artifact synapse-distribution-3.0.1-SNAPSHOT-src.tar.gz
Uploading: https://repository.apache.org/content/repositories/snapshots/org/apache/synapse/synapse-distribution/3.0.1-SNAPSHOT/synapse-distribution-3.0.1-20170427.210959-23-src.tar.gz
Uploaded: https://repository.apache.org/content/repositories/snapshots/org/apache/synapse/synapse-distribution/3.0.1-SNAPSHOT/synapse-distribution-3.0.1-20170427.210959-23-src.tar.gz
(4649 KB at 2340.4 KB/sec)
Uploading: https://repository.apache.org/content/repositories/snapshots/org/apache/synapse/synapse-distribution/3.0.1-SNAPSHOT/maven-metadata.xml
Uploaded: https://repository.apache.org/content/repositories/snapshots/org/apache/synapse/synapse-distribution/3.0.1-SNAPSHOT/maven-metadata.xml
(2 KB at 1.0 KB/sec)
Deploying the main artifact synapse-distribution-3.0.1-SNAPSHOT-src.zip
Uploading: https://repository.apache.org/content/repositories/snapshots/org/apache/synapse/synapse-distribution/3.0.1-SNAPSHOT/synapse-distribution-3.0.1-20170427.210959-23-src.zip
ERROR: Failed to deploy artifacts: Could not transfer artifact org.apache.synapse:synapse-distribution:zip:src:3.0.1-20170427.210959-23
from/to apache.snapshots.https (https://repository.apache.org/content/repositories/snapshots):
Connect to repository.apache.org:443 [repository.apache.org/207.244.88.143] failed: Connection
refused (Connection refused)
org.apache.maven.artifact.deployer.ArtifactDeploymentException: Failed to deploy artifacts:
Could not transfer artifact org.apache.synapse:synapse-distribution:zip:src:3.0.1-20170427.210959-23
from/to apache.snapshots.https (https://repository.apache.org/content/repositories/snapshots):
Connect to repository.apache.org:443 [repository.apache.org/207.244.88.143] failed: Connection
refused (Connection refused)
	at org.apache.maven.artifact.deployer.DefaultArtifactDeployer.deploy(DefaultArtifactDeployer.java:143)
	at hudson.maven.reporters.MavenArtifactRecord.deploy(MavenArtifactRecord.java:208)
	at hudson.maven.RedeployPublisher.perform(RedeployPublisher.java:176)
	at hudson.tasks.BuildStepMonitor$1.perform(BuildStepMonitor.java:20)
	at hudson.model.AbstractBuild$AbstractBuildExecution.perform(AbstractBuild.java:779)
	at hudson.model.AbstractBuild$AbstractBuildExecution.performAllBuildSteps(AbstractBuild.java:720)
	at hudson.maven.MavenModuleSetBuild$MavenModuleSetBuildExecution.post2(MavenModuleSetBuild.java:1067)
	at hudson.model.AbstractBuild$AbstractBuildExecution.post(AbstractBuild.java:665)
	at hudson.model.Run.execute(Run.java:1753)
	at hudson.maven.MavenModuleSetBuild.run(MavenModuleSetBuild.java:544)
	at hudson.model.ResourceController.execute(ResourceController.java:98)
	at hudson.model.Executor.run(Executor.java:404)
Caused by: org.eclipse.aether.deployment.DeploymentException: Failed to deploy artifacts:
Could not transfer artifact org.apache.synapse:synapse-distribution:zip:src:3.0.1-20170427.210959-23
from/to apache.snapshots.https (https://repository.apache.org/content/repositories/snapshots):
Connect to repository.apache.org:443 [repository.apache.org/207.244.88.143] failed: Connection
refused (Connection refused)
	at org.eclipse.aether.internal.impl.DefaultDeployer.deploy(DefaultDeployer.java:317)
	at org.eclipse.aether.internal.impl.DefaultDeployer.deploy(DefaultDeployer.java:245)
	at org.eclipse.aether.internal.impl.DefaultRepositorySystem.deploy(DefaultRepositorySystem.java:420)
	at org.apache.maven.artifact.deployer.DefaultArtifactDeployer.deploy(DefaultArtifactDeployer.java:139)
	... 11 more
Caused by: org.eclipse.aether.transfer.ArtifactTransferException: Could not transfer artifact
org.apache.synapse:synapse-distribution:zip:src:3.0.1-20170427.210959-23 from/to apache.snapshots.https
(https://repository.apache.org/content/repositories/snapshots): Connect to repository.apache.org:443
[repository.apache.org/207.244.88.143] failed: Connection refused (Connection refused)
	at org.eclipse.aether.connector.basic.ArtifactTransportListener.transferFailed(ArtifactTransportListener.java:43)
	at org.eclipse.aether.connector.basic.BasicRepositoryConnector$TaskRunner.run(BasicRepositoryConnector.java:355)
	at org.eclipse.aether.connector.basic.BasicRepositoryConnector.put(BasicRepositoryConnector.java:274)
	at org.eclipse.aether.internal.impl.DefaultDeployer.deploy(DefaultDeployer.java:311)
	... 14 more
Caused by: org.apache.maven.wagon.TransferFailedException: Connect to repository.apache.org:443
[repository.apache.org/207.244.88.143] failed: Connection refused (Connection refused)
	at org.apache.maven.wagon.providers.http.AbstractHttpClientWagon.put(AbstractHttpClientWagon.java:650)
	at org.apache.maven.wagon.providers.http.AbstractHttpClientWagon.put(AbstractHttpClientWagon.java:553)
	at org.apache.maven.wagon.providers.http.AbstractHttpClientWagon.put(AbstractHttpClientWagon.java:535)
	at org.apache.maven.wagon.providers.http.AbstractHttpClientWagon.put(AbstractHttpClientWagon.java:529)
	at org.apache.maven.wagon.providers.http.AbstractHttpClientWagon.put(AbstractHttpClientWagon.java:509)
	at org.eclipse.aether.transport.wagon.WagonTransporter$PutTaskRunner.run(WagonTransporter.java:644)
	at org.eclipse.aether.transport.wagon.WagonTransporter.execute(WagonTransporter.java:427)
	at org.eclipse.aether.transport.wagon.WagonTransporter.put(WagonTransporter.java:410)
	at org.eclipse.aether.connector.basic.BasicRepositoryConnector$PutTaskRunner.runTask(BasicRepositoryConnector.java:510)
	at org.eclipse.aether.connector.basic.BasicRepositoryConnector$TaskRunner.run(BasicRepositoryConnector.java:350)
	... 16 more
Caused by: org.apache.http.conn.HttpHostConnectException: Connect to repository.apache.org:443
[repository.apache.org/207.244.88.143] failed: Connection refused (Connection refused)
	at org.apache.http.impl.conn.DefaultHttpClientConnectionOperator.connect(DefaultHttpClientConnectionOperator.java:151)
	at org.apache.http.impl.conn.PoolingHttpClientConnectionManager.connect(PoolingHttpClientConnectionManager.java:353)
	at org.apache.http.impl.execchain.MainClientExec.establishRoute(MainClientExec.java:380)
	at org.apache.http.impl.execchain.MainClientExec.execute(MainClientExec.java:236)
	at org.apache.http.impl.execchain.ProtocolExec.execute(ProtocolExec.java:184)
	at org.apache.http.impl.execchain.RetryExec.execute(RetryExec.java:88)
	at org.apache.http.impl.execchain.RedirectExec.execute(RedirectExec.java:110)
	at org.apache.http.impl.client.InternalHttpClient.doExecute(InternalHttpClient.java:184)
	at org.apache.http.impl.client.CloseableHttpClient.execute(CloseableHttpClient.java:82)
	at org.apache.maven.wagon.providers.http.AbstractHttpClientWagon.execute(AbstractHttpClientWagon.java:834)
	at org.apache.maven.wagon.providers.http.AbstractHttpClientWagon.put(AbstractHttpClientWagon.java:596)
	... 25 more
Caused by: java.net.ConnectException: Connection refused (Connection refused)
	at java.net.PlainSocketImpl.socketConnect(Native Method)
	at java.net.AbstractPlainSocketImpl.doConnect(AbstractPlainSocketImpl.java:350)
	at java.net.AbstractPlainSocketImpl.connectToAddress(AbstractPlainSocketImpl.java:206)
	at java.net.AbstractPlainSocketImpl.connect(AbstractPlainSocketImpl.java:188)
	at java.net.SocksSocketImpl.connect(SocksSocketImpl.java:392)
	at java.net.Socket.connect(Socket.java:589)
	at org.apache.http.conn.ssl.SSLConnectionSocketFactory.connectSocket(SSLConnectionSocketFactory.java:337)
	at org.apache.http.impl.conn.DefaultHttpClientConnectionOperator.connect(DefaultHttpClientConnectionOperator.java:134)
	... 35 more
[INFO] Deployment failed after 2 min 23 sec
Build step 'Deploy artifacts to Maven repository' changed build result to FAILURE

---------------------------------------------------------------------
To unsubscribe, e-mail: dev-unsubscribe@synapse.apache.org
For additional commands, e-mail: dev-help@synapse.apache.org


Mime
View raw message