tez-dev mailing list archives

Site index · List index
Message view « Date » · « Thread »
Top « Date » · « Thread »
From Apache Jenkins Server <jenk...@builds.apache.org>
Subject Build failed in Jenkins: Tez-Build #61
Date Wed, 26 Jun 2013 07:01:49 GMT
See <https://builds.apache.org/job/Tez-Build/61/changes>

Changes:

[bikas] TEZ-268. Get DAG of Vertices connected by Shuffle edges working (bikas)

------------------------------------------
Started by an SCM change
Building remotely on hadoop2 in workspace <https://builds.apache.org/job/Tez-Build/ws/>
Checkout:Tez-Build / <https://builds.apache.org/job/Tez-Build/ws/> - hudson.remoting.Channel@4930757e:hadoop2
Using strategy: Default
Last Built Revision: Revision c4489b79f4f7d9f2b799c7c12a0b5352f2b34526 (origin/master)
Fetching changes from 1 remote Git repository
Fetching upstream changes from http://git-wip-us.apache.org/repos/asf/incubator-tez.git
Commencing build of Revision a059ad48f4eb8d4fd112b6cfef8e4243e499d695 (origin/master)
Checking out Revision a059ad48f4eb8d4fd112b6cfef8e4243e499d695 (origin/master)
[Tez-Build] $ /bin/bash -x /tmp/hudson8250538196280747909.sh
+ export JAVA_HOME=/home/hudson/tools/java/latest
+ JAVA_HOME=/home/hudson/tools/java/latest
+ export MAVEN_HOME=/home/hudson/tools/maven/latest
+ MAVEN_HOME=/home/hudson/tools/maven/latest
+ export PATH=/home/hudson/tools/java/latest/bin:/home/hudson/tools/maven/latest/bin:/home/hudson/tools/java/latest1.6/bin:/home/hudson/tools/java/latest1.6/bin:/usr/local/sbin:/usr/local/bin:/usr/sbin:/usr/bin:/sbin:/bin:/usr/games
+ PATH=/home/hudson/tools/java/latest/bin:/home/hudson/tools/maven/latest/bin:/home/hudson/tools/java/latest1.6/bin:/home/hudson/tools/java/latest1.6/bin:/usr/local/sbin:/usr/local/bin:/usr/sbin:/usr/bin:/sbin:/bin:/usr/games
+ env
BUILD_URL=https://builds.apache.org/job/Tez-Build/61/
HUDSON_SERVER_COOKIE=f4ebd1e6b0d976e8
SHELL=/bin/bash
SSH_CLIENT=140.211.11.8 40555 22
BUILD_TAG=jenkins-Tez-Build-61
WORKSPACE=<https://builds.apache.org/job/Tez-Build/ws/>
JOB_URL=https://builds.apache.org/job/Tez-Build/
USER=jenkins
LD_LIBRARY_PATH=/home/jenkins/tools/java/jdk1.6.0_26/jre/lib/i386/server:/home/jenkins/tools/java/jdk1.6.0_26/jre/lib/i386:/home/jenkins/tools/java/jdk1.6.0_26/jre/../lib/i386
NLSPATH=/usr/dt/lib/nls/msg/%L/%N.cat
GIT_COMMIT=a059ad48f4eb8d4fd112b6cfef8e4243e499d695
JENKINS_HOME=/home/hudson/hudson
MAVEN_HOME=/home/hudson/tools/maven/latest
PATH=/home/hudson/tools/java/latest/bin:/home/hudson/tools/maven/latest/bin:/home/hudson/tools/java/latest1.6/bin:/home/hudson/tools/java/latest1.6/bin:/usr/local/sbin:/usr/local/bin:/usr/sbin:/usr/bin:/sbin:/bin:/usr/games
MAIL=/var/mail/jenkins
PWD=<https://builds.apache.org/job/Tez-Build/ws/>
JAVA_HOME=/home/hudson/tools/java/latest
HUDSON_URL=https://builds.apache.org/
LANG=en_US
JOB_NAME=Tez-Build
XFILESEARCHPATH=/usr/dt/app-defaults/%L/Dt
JENKINS_URL=https://builds.apache.org/
BUILD_ID=2013-06-26_07-01-27
HOME=/home/jenkins
SHLVL=2
GIT_BRANCH=origin/master
JENKINS_SERVER_COOKIE=f4ebd1e6b0d976e8
EXECUTOR_NUMBER=0
NODE_LABELS=Hadoop Hadoop2 Hdfs Mapreduce Pig hadoop2
LOGNAME=jenkins
HUDSON_HOME=/home/hudson/hudson
SSH_CONNECTION=140.211.11.8 40555 67.195.138.30 22
NODE_NAME=hadoop2
BUILD_NUMBER=61
HUDSON_COOKIE=f05b3114-678f-47ab-bb8d-a5684fa67778
_=/usr/bin/env
+ export MAVEN_OPTS=-Xmx2048m
+ MAVEN_OPTS=-Xmx2048m
+ /home/hudson/tools/maven/latest/bin/mvn clean test deploy package -Dtar
[INFO] Scanning for projects...
[INFO] ------------------------------------------------------------------------
[INFO] Reactor Build Order:
[INFO] 
[INFO] tez
[INFO] tez-dag-api
[INFO] tez-common
[INFO] tez-engine-api
[INFO] tez-engine
[INFO] tez-mapreduce
[INFO] tez-yarn-client
[INFO] tez-dag
[INFO] tez-mapreduce-examples
[INFO] tez-mapreduce-tests
[INFO] tez-dist
[INFO]                                                                         
[INFO] ------------------------------------------------------------------------
[INFO] Building tez 0.2.0-SNAPSHOT
[INFO] ------------------------------------------------------------------------
[INFO] 
[INFO] --- maven-clean-plugin:2.4.1:clean (default-clean) @ tez ---
[INFO] 
[INFO] --- maven-install-plugin:2.3.1:install (default-install) @ tez ---
[INFO] Installing <https://builds.apache.org/job/Tez-Build/ws/pom.xml> to /home/jenkins/.m2/repository/org/apache/tez/tez/0.2.0-SNAPSHOT/tez-0.2.0-SNAPSHOT.pom
[INFO] 
[INFO] --- maven-deploy-plugin:2.5:deploy (default-deploy) @ tez ---
Downloading: https://repository.apache.org/content/repositories/snapshots/org/apache/tez/tez/0.2.0-SNAPSHOT/maven-metadata.xml
596 B   
        
Downloaded: https://repository.apache.org/content/repositories/snapshots/org/apache/tez/tez/0.2.0-SNAPSHOT/maven-metadata.xml
(596 B at 0.5 KB/sec)
Uploading: https://repository.apache.org/content/repositories/snapshots/org/apache/tez/tez/0.2.0-SNAPSHOT/tez-0.2.0-20130626.070132-26.pom
4 KB    
8 KB   
12 KB   
15 KB   
        
Uploaded: https://repository.apache.org/content/repositories/snapshots/org/apache/tez/tez/0.2.0-SNAPSHOT/tez-0.2.0-20130626.070132-26.pom
(15 KB at 26.5 KB/sec)
Downloading: https://repository.apache.org/content/repositories/snapshots/org/apache/tez/tez/maven-metadata.xml
277 B   
        
Downloaded: https://repository.apache.org/content/repositories/snapshots/org/apache/tez/tez/maven-metadata.xml
(277 B at 0.8 KB/sec)
Uploading: https://repository.apache.org/content/repositories/snapshots/org/apache/tez/tez/0.2.0-SNAPSHOT/maven-metadata.xml
596 B   
        
Uploaded: https://repository.apache.org/content/repositories/snapshots/org/apache/tez/tez/0.2.0-SNAPSHOT/maven-metadata.xml
(596 B at 2.0 KB/sec)
Uploading: https://repository.apache.org/content/repositories/snapshots/org/apache/tez/tez/maven-metadata.xml
277 B   
        
Uploaded: https://repository.apache.org/content/repositories/snapshots/org/apache/tez/tez/maven-metadata.xml
(277 B at 0.6 KB/sec)
[INFO]                                                                         
[INFO] ------------------------------------------------------------------------
[INFO] Building tez-dag-api 0.2.0-SNAPSHOT
[INFO] ------------------------------------------------------------------------
[INFO] 
[INFO] --- maven-clean-plugin:2.4.1:clean (default-clean) @ tez-dag-api ---
[INFO] Deleting <https://builds.apache.org/job/Tez-Build/ws/tez-dag-api/target>
[INFO] 
[INFO] --- hadoop-maven-plugins:3.0.0-SNAPSHOT:protoc (compile-protoc) @ tez-dag-api ---
[INFO] 
[INFO] --- maven-resources-plugin:2.4.3:resources (default-resources) @ tez-dag-api ---
[WARNING] Using platform encoding (ISO-8859-1 actually) to copy filtered resources, i.e. build
is platform dependent!
[INFO] skip non existing resourceDirectory <https://builds.apache.org/job/Tez-Build/ws/tez-dag-api/src/main/resources>
[INFO] 
[INFO] --- maven-compiler-plugin:2.3.2:compile (default-compile) @ tez-dag-api ---
[WARNING] File encoding has not been set, using platform encoding ISO-8859-1, i.e. build is
platform dependent!
[INFO] Compiling 22 source files to <https://builds.apache.org/job/Tez-Build/ws/tez-dag-api/target/classes>
[INFO] 
[INFO] --- maven-resources-plugin:2.4.3:testResources (default-testResources) @ tez-dag-api
---
[WARNING] Using platform encoding (ISO-8859-1 actually) to copy filtered resources, i.e. build
is platform dependent!
[INFO] skip non existing resourceDirectory <https://builds.apache.org/job/Tez-Build/ws/tez-dag-api/src/test/resources>
[INFO] 
[INFO] --- maven-compiler-plugin:2.3.2:testCompile (default-testCompile) @ tez-dag-api ---
[WARNING] File encoding has not been set, using platform encoding ISO-8859-1, i.e. build is
platform dependent!
[INFO] Compiling 2 source files to <https://builds.apache.org/job/Tez-Build/ws/tez-dag-api/target/test-classes>
[INFO] 
[INFO] --- maven-surefire-plugin:2.14.1:test (default-test) @ tez-dag-api ---
[INFO] Surefire report directory: <https://builds.apache.org/job/Tez-Build/ws/tez-dag-api/target/surefire-reports>

-------------------------------------------------------
 T E S T S
-------------------------------------------------------

-------------------------------------------------------
 T E S T S
-------------------------------------------------------
Running org.apache.tez.dag.api.TestDAGVerify
Tests run: 8, Failures: 2, Errors: 0, Skipped: 0, Time elapsed: 0.239 sec <<< FAILURE!
BinaryOutput(org.apache.tez.dag.api.TestDAGVerify)  Time elapsed: 0.005 sec  <<<
FAILURE!
java.lang.AssertionError: null
	at org.junit.Assert.fail(Assert.java:86)
	at org.junit.Assert.assertTrue(Assert.java:41)
	at org.junit.Assert.assertNotNull(Assert.java:621)
	at org.junit.Assert.assertNotNull(Assert.java:631)
	at org.apache.tez.dag.api.TestDAGVerify.BinaryOutput(TestDAGVerify.java:267)

BinaryInput(org.apache.tez.dag.api.TestDAGVerify)  Time elapsed: 0 sec  <<< FAILURE!
java.lang.AssertionError: null
	at org.junit.Assert.fail(Assert.java:86)
	at org.junit.Assert.assertTrue(Assert.java:41)
	at org.junit.Assert.assertNotNull(Assert.java:621)
	at org.junit.Assert.assertNotNull(Assert.java:631)
	at org.apache.tez.dag.api.TestDAGVerify.BinaryInput(TestDAGVerify.java:227)

Running org.apache.tez.dag.api.TestDAGPlan
Tests run: 2, Failures: 0, Errors: 0, Skipped: 0, Time elapsed: 0.333 sec

Results :

Failed tests: 
  TestDAGVerify.BinaryOutput:267 null
  TestDAGVerify.BinaryInput:227 null

Tests run: 10, Failures: 2, Errors: 0, Skipped: 0

[INFO] ------------------------------------------------------------------------
[INFO] Reactor Summary:
[INFO] 
[INFO] tez ............................................... SUCCESS [3.137s]
[INFO] tez-dag-api ....................................... FAILURE [6.423s]
[INFO] tez-common ........................................ SKIPPED
[INFO] tez-engine-api .................................... SKIPPED
[INFO] tez-engine ........................................ SKIPPED
[INFO] tez-mapreduce ..................................... SKIPPED
[INFO] tez-yarn-client ................................... SKIPPED
[INFO] tez-dag ........................................... SKIPPED
[INFO] tez-mapreduce-examples ............................ SKIPPED
[INFO] tez-mapreduce-tests ............................... SKIPPED
[INFO] tez-dist .......................................... SKIPPED
[INFO] ------------------------------------------------------------------------
[INFO] BUILD FAILURE
[INFO] ------------------------------------------------------------------------
[INFO] Total time: 9.861s
[INFO] Finished at: Wed Jun 26 07:01:40 UTC 2013
[INFO] Final Memory: 22M/142M
[INFO] ------------------------------------------------------------------------
[ERROR] Failed to execute goal org.apache.maven.plugins:maven-surefire-plugin:2.14.1:test
(default-test) on project tez-dag-api: There are test failures.
[ERROR] 
[ERROR] Please refer to <https://builds.apache.org/job/Tez-Build/ws/tez-dag-api/target/surefire-reports>
for the individual test results.
[ERROR] -> [Help 1]
[ERROR] 
[ERROR] To see the full stack trace of the errors, re-run Maven with the -e switch.
[ERROR] Re-run Maven using the -X switch to enable full debug logging.
[ERROR] 
[ERROR] For more information about the errors and possible solutions, please read the following
articles:
[ERROR] [Help 1] http://cwiki.apache.org/confluence/display/MAVEN/MojoFailureException
[ERROR] 
[ERROR] After correcting the problems, you can resume the build with the command
[ERROR]   mvn <goals> -rf :tez-dag-api
Build step 'Execute shell' marked build as failure
Archiving artifacts
Recording test results

Mime
View raw message