tez-dev mailing list archives

Site index · List index
Message view « Date » · « Thread »
Top « Date » · « Thread »
From Apache Jenkins Server <jenk...@builds.apache.org>
Subject Build failed in Jenkins: Tez-Build #74
Date Fri, 19 Jul 2013 00:06:07 GMT
See <https://builds.apache.org/job/Tez-Build/74/changes>

Changes:

[bikas] TEZ-303. Send userpayload via RPC instead of localizing DAGPlan (bikas)

------------------------------------------
[...truncated 344 lines...]
Downloaded: https://maven.atlassian.com/repository/public/org/apache/maven/maven-artifact/2.0.6/maven-artifact-2.0.6.pom
(2 KB at 9.1 KB/sec)
Downloading: https://maven.atlassian.com/repository/public/org/apache/maven/maven-plugin-registry/2.0.6/maven-plugin-registry-2.0.6.pom
2/2 KB   
         
Downloaded: https://maven.atlassian.com/repository/public/org/apache/maven/maven-plugin-registry/2.0.6/maven-plugin-registry-2.0.6.pom
(2 KB at 6.4 KB/sec)
Downloading: https://maven.atlassian.com/repository/public/org/codehaus/plexus/plexus-digest/1.0/plexus-digest-1.0.pom
2/2 KB   
         
Downloaded: https://maven.atlassian.com/repository/public/org/codehaus/plexus/plexus-digest/1.0/plexus-digest-1.0.pom
(2 KB at 2.0 KB/sec)
Downloading: https://maven.atlassian.com/repository/public/org/codehaus/plexus/plexus-components/1.1.7/plexus-components-1.1.7.pom
4/5 KB   
5/5 KB   
         
Downloaded: https://maven.atlassian.com/repository/public/org/codehaus/plexus/plexus-components/1.1.7/plexus-components-1.1.7.pom
(5 KB at 14.9 KB/sec)
Downloading: https://maven.atlassian.com/repository/public/org/codehaus/plexus/plexus/1.0.8/plexus-1.0.8.pom
4/8 KB   
8/8 KB   
         
Downloaded: https://maven.atlassian.com/repository/public/org/codehaus/plexus/plexus/1.0.8/plexus-1.0.8.pom
(8 KB at 41.3 KB/sec)
Downloading: https://maven.atlassian.com/repository/public/org/codehaus/plexus/plexus-container-default/1.0-alpha-8/plexus-container-default-1.0-alpha-8.pom
4/8 KB   
8/8 KB   
         
Downloaded: https://maven.atlassian.com/repository/public/org/codehaus/plexus/plexus-container-default/1.0-alpha-8/plexus-container-default-1.0-alpha-8.pom
(8 KB at 41.7 KB/sec)
Downloading: https://maven.atlassian.com/repository/public/junit/junit/3.8.1/junit-3.8.1.jar
Downloading: https://maven.atlassian.com/repository/public/org/codehaus/plexus/plexus-digest/1.0/plexus-digest-1.0.jar
4/119 KB   
8/119 KB   
12/119 KB   
14/119 KB   
18/119 KB   
22/119 KB   
23/119 KB   
27/119 KB   
31/119 KB   
33/119 KB   
37/119 KB   
41/119 KB   
43/119 KB   
47/119 KB   
48/119 KB   
51/119 KB   
52/119 KB   
55/119 KB   
56/119 KB   
60/119 KB   
64/119 KB   
67/119 KB   
71/119 KB   
75/119 KB   
76/119 KB   
80/119 KB   
83/119 KB   
84/119 KB   
88/119 KB   
92/119 KB   
96/119 KB   
99/119 KB   
100/119 KB   
104/119 KB   
107/119 KB   
108/119 KB   
111/119 KB   
112/119 KB   
115/119 KB   
116/119 KB   
119/119 KB   
119/119 KB   4/12 KB   
119/119 KB   8/12 KB   
119/119 KB   12/12 KB   
                        
Downloaded: https://maven.atlassian.com/repository/public/org/codehaus/plexus/plexus-digest/1.0/plexus-digest-1.0.jar
(12 KB at 27.2 KB/sec)
                        
Downloaded: https://maven.atlassian.com/repository/public/junit/junit/3.8.1/junit-3.8.1.jar
(119 KB at 274.3 KB/sec)
[INFO] Installing <https://builds.apache.org/job/Tez-Build/ws/pom.xml> to /home/jenkins/.m2/repository/org/apache/tez/tez/0.2.0-SNAPSHOT/tez-0.2.0-SNAPSHOT.pom
[INFO] 
[INFO] --- maven-deploy-plugin:2.7:deploy (default-deploy) @ tez ---
Downloading: https://maven.atlassian.com/repository/public/org/codehaus/plexus/plexus-utils/1.5.6/plexus-utils-1.5.6.pom
4/6 KB                  
6/6 KB   
         
Downloaded: https://maven.atlassian.com/repository/public/org/codehaus/plexus/plexus-utils/1.5.6/plexus-utils-1.5.6.pom
(6 KB at 30.3 KB/sec)
Downloading: https://maven.atlassian.com/repository/public/org/codehaus/plexus/plexus/1.0.12/plexus-1.0.12.pom
4/10 KB   
8/10 KB   
10/10 KB   
           
Downloaded: https://maven.atlassian.com/repository/public/org/codehaus/plexus/plexus/1.0.12/plexus-1.0.12.pom
(10 KB at 56.0 KB/sec)
Downloading: https://maven.atlassian.com/repository/public/org/codehaus/plexus/plexus-utils/1.5.6/plexus-utils-1.5.6.jar
4/245 KB   
8/245 KB   
12/245 KB   
14/245 KB   
18/245 KB   
22/245 KB   
23/245 KB   
27/245 KB   
31/245 KB   
35/245 KB   
39/245 KB   
40/245 KB   
44/245 KB   
47/245 KB   
48/245 KB   
52/245 KB   
56/245 KB   
60/245 KB   
64/245 KB   
68/245 KB   
72/245 KB   
76/245 KB   
80/245 KB   
84/245 KB   
88/245 KB   
92/245 KB   
96/245 KB   
100/245 KB   
104/245 KB   
107/245 KB   
111/245 KB   
112/245 KB   
116/245 KB   
120/245 KB   
124/245 KB   
128/245 KB   
132/245 KB   
136/245 KB   
140/245 KB   
144/245 KB   
148/245 KB   
152/245 KB   
156/245 KB   
160/245 KB   
164/245 KB   
168/245 KB   
171/245 KB   
172/245 KB   
176/245 KB   
179/245 KB   
180/245 KB   
184/245 KB   
188/245 KB   
192/245 KB   
196/245 KB   
199/245 KB   
200/245 KB   
203/245 KB   
204/245 KB   
208/245 KB   
210/245 KB   
212/245 KB   
215/245 KB   
216/245 KB   
219/245 KB   
220/245 KB   
224/245 KB   
228/245 KB   
232/245 KB   
236/245 KB   
239/245 KB   
240/245 KB   
244/245 KB   
245/245 KB   
             
Downloaded: https://maven.atlassian.com/repository/public/org/codehaus/plexus/plexus-utils/1.5.6/plexus-utils-1.5.6.jar
(245 KB at 552.3 KB/sec)
Downloading: https://repository.apache.org/content/repositories/snapshots/org/apache/tez/tez/0.2.0-SNAPSHOT/maven-metadata.xml
596 B        
        
Downloaded: https://repository.apache.org/content/repositories/snapshots/org/apache/tez/tez/0.2.0-SNAPSHOT/maven-metadata.xml
(596 B at 2.5 KB/sec)
Uploading: https://repository.apache.org/content/repositories/snapshots/org/apache/tez/tez/0.2.0-SNAPSHOT/tez-0.2.0-20130719.000553-39.pom
2/15 KB   
4/15 KB   
6/15 KB   
8/15 KB   
10/15 KB   
12/15 KB   
14/15 KB   
15/15 KB   
           
Uploaded: https://repository.apache.org/content/repositories/snapshots/org/apache/tez/tez/0.2.0-SNAPSHOT/tez-0.2.0-20130719.000553-39.pom
(15 KB at 44.7 KB/sec)
Downloading: https://repository.apache.org/content/repositories/snapshots/org/apache/tez/tez/maven-metadata.xml
277 B      
        
Downloaded: https://repository.apache.org/content/repositories/snapshots/org/apache/tez/tez/maven-metadata.xml
(277 B at 1.0 KB/sec)
Uploading: https://repository.apache.org/content/repositories/snapshots/org/apache/tez/tez/0.2.0-SNAPSHOT/maven-metadata.xml
596/596 B   
            
Uploaded: https://repository.apache.org/content/repositories/snapshots/org/apache/tez/tez/0.2.0-SNAPSHOT/maven-metadata.xml
(596 B at 1.9 KB/sec)
Uploading: https://repository.apache.org/content/repositories/snapshots/org/apache/tez/tez/maven-metadata.xml
277/277 B   
            
Uploaded: https://repository.apache.org/content/repositories/snapshots/org/apache/tez/tez/maven-metadata.xml
(277 B at 0.7 KB/sec)
[INFO]                                                                         
[INFO] ------------------------------------------------------------------------
[INFO] Building tez-dag-api 0.2.0-SNAPSHOT
[INFO] ------------------------------------------------------------------------
Downloading: https://maven.atlassian.com/repository/public/org/apache/maven/plugins/maven-jar-plugin/2.3.1/maven-jar-plugin-2.3.1.pom
4/6 KB      
6/6 KB   
         
Downloaded: https://maven.atlassian.com/repository/public/org/apache/maven/plugins/maven-jar-plugin/2.3.1/maven-jar-plugin-2.3.1.pom
(6 KB at 28.1 KB/sec)
Downloading: https://maven.atlassian.com/repository/public/org/apache/maven/plugins/maven-jar-plugin/2.3.1/maven-jar-plugin-2.3.1.jar
4/32 KB   
8/32 KB   
12/32 KB   
14/32 KB   
18/32 KB   
21/32 KB   
25/32 KB   
29/32 KB   
32/32 KB   
           
Downloaded: https://maven.atlassian.com/repository/public/org/apache/maven/plugins/maven-jar-plugin/2.3.1/maven-jar-plugin-2.3.1.jar
(32 KB at 73.0 KB/sec)
Downloading: https://maven.atlassian.com/repository/public/org/apache/hadoop/hadoop-maven-plugins/3.0.0-SNAPSHOT/maven-metadata.xml
           
Downloading: https://maven.atlassian.com/repository/public/org/apache/hadoop/hadoop-maven-plugins/3.0.0-SNAPSHOT/hadoop-maven-plugins-3.0.0-SNAPSHOT.pom
           
[WARNING] The POM for org.apache.hadoop:hadoop-maven-plugins:jar:3.0.0-SNAPSHOT is missing,
no dependency information available
[INFO] ------------------------------------------------------------------------
[INFO] Reactor Summary:
[INFO] 
[INFO] tez ............................................... SUCCESS [13.818s]
[INFO] tez-dag-api ....................................... FAILURE [1.035s]
[INFO] tez-common ........................................ SKIPPED
[INFO] tez-engine-api .................................... SKIPPED
[INFO] tez-engine ........................................ SKIPPED
[INFO] tez-mapreduce ..................................... SKIPPED
[INFO] tez-yarn-client ................................... SKIPPED
[INFO] tez-dag ........................................... SKIPPED
[INFO] tez-mapreduce-examples ............................ SKIPPED
[INFO] tez-mapreduce-tests ............................... SKIPPED
[INFO] tez-dist .......................................... SKIPPED
[INFO] ------------------------------------------------------------------------
[INFO] BUILD FAILURE
[INFO] ------------------------------------------------------------------------
[INFO] Total time: 15.189s
[INFO] Finished at: Fri Jul 19 00:05:55 UTC 2013
[INFO] Final Memory: 6M/109M
[INFO] ------------------------------------------------------------------------
[ERROR] Plugin org.apache.hadoop:hadoop-maven-plugins:3.0.0-SNAPSHOT or one of its dependencies
could not be resolved: Failed to read artifact descriptor for org.apache.hadoop:hadoop-maven-plugins:jar:3.0.0-SNAPSHOT:
Could not find artifact org.apache.hadoop:hadoop-maven-plugins:pom:3.0.0-SNAPSHOT in maven2-repository.atlassian
(https://maven.atlassian.com/repository/public) -> [Help 1]
[ERROR] 
[ERROR] To see the full stack trace of the errors, re-run Maven with the -e switch.
[ERROR] Re-run Maven using the -X switch to enable full debug logging.
[ERROR] 
[ERROR] For more information about the errors and possible solutions, please read the following
articles:
[ERROR] [Help 1] http://cwiki.apache.org/confluence/display/MAVEN/PluginResolutionException
Build step 'Execute shell' marked build as failure
Archiving artifacts
Recording test results

Mime
View raw message