tez-dev mailing list archives

Site index · List index
Message view « Date » · « Thread »
Top « Date » · « Thread »
From Apache Jenkins Server <jenk...@builds.apache.org>
Subject Build failed in Jenkins: Tez-Build #83
Date Wed, 24 Jul 2013 19:55:25 GMT
See <https://builds.apache.org/job/Tez-Build/83/changes>

Changes:

[hitesh] TEZ-319. Fix TEZ due to changes brought in by YARN-926. (hitesh)

------------------------------------------
[...truncated 5105 lines...]
[INFO] 
[INFO] --- maven-compiler-plugin:2.3.2:compile (default-compile) @ tez-mapreduce-examples
---
[INFO] Nothing to compile - all classes are up to date
[INFO] 
[INFO] --- maven-resources-plugin:2.5:testResources (default-testResources) @ tez-mapreduce-examples
---
[debug] execute contextualize
[WARNING] Using platform encoding (ISO-8859-1 actually) to copy filtered resources, i.e. build
is platform dependent!
[INFO] skip non existing resourceDirectory <https://builds.apache.org/job/Tez-Build/ws/tez-mapreduce-examples/src/test/resources>
[INFO] 
[INFO] --- maven-compiler-plugin:2.3.2:testCompile (default-testCompile) @ tez-mapreduce-examples
---
[INFO] Nothing to compile - all classes are up to date
[INFO] 
[INFO] --- maven-surefire-plugin:2.14.1:test (default-test) @ tez-mapreduce-examples ---
[INFO] Skipping execution of surefire because it has already been run for this configuration
[INFO] 
[INFO] --- maven-jar-plugin:2.3.1:jar (default-jar) @ tez-mapreduce-examples ---
[INFO] Building jar: <https://builds.apache.org/job/Tez-Build/ws/tez-mapreduce-examples/target/tez-mapreduce-examples-0.2.0-SNAPSHOT.jar>
[INFO] 
[INFO] --- maven-jar-plugin:2.3.1:test-jar (default) @ tez-mapreduce-examples ---
[INFO] Building jar: <https://builds.apache.org/job/Tez-Build/ws/tez-mapreduce-examples/target/tez-mapreduce-examples-0.2.0-SNAPSHOT-tests.jar>
[INFO] 
[INFO] --- maven-install-plugin:2.3.1:install (default-install) @ tez-mapreduce-examples ---
[INFO] Installing <https://builds.apache.org/job/Tez-Build/ws/tez-mapreduce-examples/target/tez-mapreduce-examples-0.2.0-SNAPSHOT.jar>
to /home/jenkins/.m2/repository/org/apache/tez/tez-mapreduce-examples/0.2.0-SNAPSHOT/tez-mapreduce-examples-0.2.0-SNAPSHOT.jar
[INFO] Installing <https://builds.apache.org/job/Tez-Build/ws/tez-mapreduce-examples/pom.xml>
to /home/jenkins/.m2/repository/org/apache/tez/tez-mapreduce-examples/0.2.0-SNAPSHOT/tez-mapreduce-examples-0.2.0-SNAPSHOT.pom
[INFO] Installing <https://builds.apache.org/job/Tez-Build/ws/tez-mapreduce-examples/target/tez-mapreduce-examples-0.2.0-SNAPSHOT-tests.jar>
to /home/jenkins/.m2/repository/org/apache/tez/tez-mapreduce-examples/0.2.0-SNAPSHOT/tez-mapreduce-examples-0.2.0-SNAPSHOT-tests.jar
[INFO] 
[INFO] --- maven-deploy-plugin:2.7:deploy (default-deploy) @ tez-mapreduce-examples ---
Downloading: https://repository.apache.org/content/repositories/snapshots/org/apache/tez/tez-mapreduce-examples/0.2.0-SNAPSHOT/maven-metadata.xml
1002 B      
         
Downloaded: https://repository.apache.org/content/repositories/snapshots/org/apache/tez/tez-mapreduce-examples/0.2.0-SNAPSHOT/maven-metadata.xml
(1002 B at 0.4 KB/sec)
Uploading: https://repository.apache.org/content/repositories/snapshots/org/apache/tez/tez-mapreduce-examples/0.2.0-SNAPSHOT/tez-mapreduce-examples-0.2.0-20130724.195234-15.jar
2/143 KB   
4/143 KB   
6/143 KB   
8/143 KB   
10/143 KB   
12/143 KB   
14/143 KB   
16/143 KB   
18/143 KB   
20/143 KB   
22/143 KB   
24/143 KB   
26/143 KB   
28/143 KB   
30/143 KB   
32/143 KB   
34/143 KB   
36/143 KB   
38/143 KB   
40/143 KB   
42/143 KB   
44/143 KB   
46/143 KB   
48/143 KB   
50/143 KB   
52/143 KB   
54/143 KB   
56/143 KB   
58/143 KB   
60/143 KB   
62/143 KB   
64/143 KB   
66/143 KB   
68/143 KB   
70/143 KB   
72/143 KB   
74/143 KB   
76/143 KB   
78/143 KB   
80/143 KB   
82/143 KB   
84/143 KB   
86/143 KB   
88/143 KB   
90/143 KB   
92/143 KB   
94/143 KB   
96/143 KB   
98/143 KB   
100/143 KB   
102/143 KB   
104/143 KB   
106/143 KB   
108/143 KB   
110/143 KB   
112/143 KB   
114/143 KB   
116/143 KB   
118/143 KB   
120/143 KB   
122/143 KB   
124/143 KB   
126/143 KB   
128/143 KB   
130/143 KB   
132/143 KB   
134/143 KB   
136/143 KB   
138/143 KB   
140/143 KB   
142/143 KB   
143/143 KB   
             
Uploaded: https://repository.apache.org/content/repositories/snapshots/org/apache/tez/tez-mapreduce-examples/0.2.0-SNAPSHOT/tez-mapreduce-examples-0.2.0-20130724.195234-15.jar
(143 KB at 268.3 KB/sec)
Uploading: https://repository.apache.org/content/repositories/snapshots/org/apache/tez/tez-mapreduce-examples/0.2.0-SNAPSHOT/tez-mapreduce-examples-0.2.0-20130724.195234-15.pom
2/4 KB       
4/4 KB   
         
Uploaded: https://repository.apache.org/content/repositories/snapshots/org/apache/tez/tez-mapreduce-examples/0.2.0-SNAPSHOT/tez-mapreduce-examples-0.2.0-20130724.195234-15.pom
(4 KB at 10.0 KB/sec)
Downloading: https://repository.apache.org/content/repositories/snapshots/org/apache/tez/tez-mapreduce-examples/maven-metadata.xml
296 B    
        
Downloaded: https://repository.apache.org/content/repositories/snapshots/org/apache/tez/tez-mapreduce-examples/maven-metadata.xml
(296 B at 0.2 KB/sec)
Uploading: https://repository.apache.org/content/repositories/snapshots/org/apache/tez/tez-mapreduce-examples/0.2.0-SNAPSHOT/maven-metadata.xml
1002/1002 B   
              
Uploaded: https://repository.apache.org/content/repositories/snapshots/org/apache/tez/tez-mapreduce-examples/0.2.0-SNAPSHOT/maven-metadata.xml
(1002 B at 3.4 KB/sec)
Uploading: https://repository.apache.org/content/repositories/snapshots/org/apache/tez/tez-mapreduce-examples/maven-metadata.xml
296/296 B     
            
Uploaded: https://repository.apache.org/content/repositories/snapshots/org/apache/tez/tez-mapreduce-examples/maven-metadata.xml
(296 B at 0.1 KB/sec)
Uploading: https://repository.apache.org/content/repositories/snapshots/org/apache/tez/tez-mapreduce-examples/0.2.0-SNAPSHOT/tez-mapreduce-examples-0.2.0-20130724.195234-15-tests.jar
2/5 KB      
4/5 KB   
5/5 KB   
         
Uploaded: https://repository.apache.org/content/repositories/snapshots/org/apache/tez/tez-mapreduce-examples/0.2.0-SNAPSHOT/tez-mapreduce-examples-0.2.0-20130724.195234-15-tests.jar
(5 KB at 12.3 KB/sec)
Uploading: https://repository.apache.org/content/repositories/snapshots/org/apache/tez/tez-mapreduce-examples/0.2.0-SNAPSHOT/maven-metadata.xml
1002/1002 B   
              
Uploaded: https://repository.apache.org/content/repositories/snapshots/org/apache/tez/tez-mapreduce-examples/0.2.0-SNAPSHOT/maven-metadata.xml
(1002 B at 2.8 KB/sec)
[INFO] 
[INFO] --- maven-resources-plugin:2.5:resources (default-resources) @ tez-mapreduce-examples
---
[debug] execute contextualize
[WARNING] Using platform encoding (ISO-8859-1 actually) to copy filtered resources, i.e. build
is platform dependent!
[INFO] skip non existing resourceDirectory <https://builds.apache.org/job/Tez-Build/ws/tez-mapreduce-examples/src/main/resources>
[INFO] 
[INFO] --- maven-compiler-plugin:2.3.2:compile (default-compile) @ tez-mapreduce-examples
---
[INFO] Nothing to compile - all classes are up to date
[INFO] 
[INFO] --- maven-resources-plugin:2.5:testResources (default-testResources) @ tez-mapreduce-examples
---
[debug] execute contextualize
[WARNING] Using platform encoding (ISO-8859-1 actually) to copy filtered resources, i.e. build
is platform dependent!
[INFO] skip non existing resourceDirectory <https://builds.apache.org/job/Tez-Build/ws/tez-mapreduce-examples/src/test/resources>
[INFO] 
[INFO] --- maven-compiler-plugin:2.3.2:testCompile (default-testCompile) @ tez-mapreduce-examples
---
[INFO] Nothing to compile - all classes are up to date
[INFO] 
[INFO] --- maven-surefire-plugin:2.14.1:test (default-test) @ tez-mapreduce-examples ---
[INFO] Skipping execution of surefire because it has already been run for this configuration
[INFO] 
[INFO] --- maven-jar-plugin:2.3.1:jar (default-jar) @ tez-mapreduce-examples ---
[INFO] Building jar: <https://builds.apache.org/job/Tez-Build/ws/tez-mapreduce-examples/target/tez-mapreduce-examples-0.2.0-SNAPSHOT.jar>
[INFO] 
[INFO] --- maven-jar-plugin:2.3.1:test-jar (default) @ tez-mapreduce-examples ---
[INFO] Building jar: <https://builds.apache.org/job/Tez-Build/ws/tez-mapreduce-examples/target/tez-mapreduce-examples-0.2.0-SNAPSHOT-tests.jar>
[INFO]                                                                         
[INFO] ------------------------------------------------------------------------
[INFO] Building tez-mapreduce-tests 0.2.0-SNAPSHOT
[INFO] ------------------------------------------------------------------------
[INFO] 
[INFO] --- maven-clean-plugin:2.4.1:clean (default-clean) @ tez-mapreduce-tests ---
[INFO] Deleting <https://builds.apache.org/job/Tez-Build/ws/tez-mapreduce-tests/target>
[INFO] 
[INFO] --- maven-resources-plugin:2.5:resources (default-resources) @ tez-mapreduce-tests
---
[debug] execute contextualize
[WARNING] Using platform encoding (ISO-8859-1 actually) to copy filtered resources, i.e. build
is platform dependent!
[INFO] skip non existing resourceDirectory <https://builds.apache.org/job/Tez-Build/ws/tez-mapreduce-tests/src/main/resources>
[INFO] 
[INFO] --- maven-compiler-plugin:2.3.2:compile (default-compile) @ tez-mapreduce-tests ---
[INFO] No sources to compile
[INFO] 
[INFO] --- maven-resources-plugin:2.5:testResources (default-testResources) @ tez-mapreduce-tests
---
[debug] execute contextualize
[WARNING] Using platform encoding (ISO-8859-1 actually) to copy filtered resources, i.e. build
is platform dependent!
[INFO] skip non existing resourceDirectory <https://builds.apache.org/job/Tez-Build/ws/tez-mapreduce-tests/src/test/resources>
[INFO] 
[INFO] --- maven-compiler-plugin:2.3.2:testCompile (default-testCompile) @ tez-mapreduce-tests
---
[WARNING] File encoding has not been set, using platform encoding ISO-8859-1, i.e. build is
platform dependent!
[INFO] Compiling 3 source files to <https://builds.apache.org/job/Tez-Build/ws/tez-mapreduce-tests/target/test-classes>
[INFO] 
[INFO] --- maven-surefire-plugin:2.14.1:test (default-test) @ tez-mapreduce-tests ---
[INFO] Surefire report directory: <https://builds.apache.org/job/Tez-Build/ws/tez-mapreduce-tests/target/surefire-reports>

-------------------------------------------------------
 T E S T S
-------------------------------------------------------

-------------------------------------------------------
 T E S T S
-------------------------------------------------------
Running org.apache.tez.mapreduce.TestMRRJobs
Tests run: 5, Failures: 1, Errors: 0, Skipped: 0, Time elapsed: 109.468 sec <<< FAILURE!
testMRRSleepJob(org.apache.tez.mapreduce.TestMRRJobs)  Time elapsed: 5.109 sec  <<<
FAILURE!
java.lang.AssertionError: null
	at org.junit.Assert.fail(Assert.java:86)
	at org.junit.Assert.assertTrue(Assert.java:41)
	at org.junit.Assert.assertTrue(Assert.java:52)
	at org.apache.tez.mapreduce.TestMRRJobs.testMRRSleepJob(TestMRRJobs.java:160)

Running org.apache.tez.mapreduce.TestMRRJobsDAGApi
Tests run: 2, Failures: 0, Errors: 0, Skipped: 0, Time elapsed: 48.396 sec

Results :

Failed tests: 
  TestMRRJobs.testMRRSleepJob:160 null

Tests run: 7, Failures: 1, Errors: 0, Skipped: 0

[INFO] ------------------------------------------------------------------------
[INFO] Reactor Summary:
[INFO] 
[INFO] tez ............................................... SUCCESS [5.621s]
[INFO] tez-dag-api ....................................... SUCCESS [30.972s]
[INFO] tez-common ........................................ SUCCESS [13.234s]
[INFO] tez-engine-api .................................... SUCCESS [9.203s]
[INFO] tez-engine ........................................ SUCCESS [9.188s]
[INFO] tez-mapreduce ..................................... SUCCESS [44.559s]
[INFO] tez-yarn-client ................................... SUCCESS [5.208s]
[INFO] tez-dag ........................................... SUCCESS [31.399s]
[INFO] tez-mapreduce-examples ............................ SUCCESS [11.706s]
[INFO] tez-mapreduce-tests ............................... FAILURE [2:40.208s]
[INFO] tez-dist .......................................... SKIPPED
[INFO] ------------------------------------------------------------------------
[INFO] BUILD FAILURE
[INFO] ------------------------------------------------------------------------
[INFO] Total time: 5:21.632s
[INFO] Finished at: Wed Jul 24 19:55:20 UTC 2013
[INFO] Final Memory: 121M/604M
[INFO] ------------------------------------------------------------------------
[ERROR] Failed to execute goal org.apache.maven.plugins:maven-surefire-plugin:2.14.1:test
(default-test) on project tez-mapreduce-tests: There are test failures.
[ERROR] 
[ERROR] Please refer to <https://builds.apache.org/job/Tez-Build/ws/tez-mapreduce-tests/target/surefire-reports>
for the individual test results.
[ERROR] -> [Help 1]
[ERROR] 
[ERROR] To see the full stack trace of the errors, re-run Maven with the -e switch.
[ERROR] Re-run Maven using the -X switch to enable full debug logging.
[ERROR] 
[ERROR] For more information about the errors and possible solutions, please read the following
articles:
[ERROR] [Help 1] http://cwiki.apache.org/confluence/display/MAVEN/MojoFailureException
[ERROR] 
[ERROR] After correcting the problems, you can resume the build with the command
[ERROR]   mvn <goals> -rf :tez-mapreduce-tests
Build step 'Execute shell' marked build as failure
Archiving artifacts
Recording test results

Mime
View raw message