tez-dev mailing list archives

Site index · List index
Message view « Date » · « Thread »
Top « Date » · « Thread »
From Apache Jenkins Server <jenk...@builds.apache.org>
Subject Build failed in Jenkins: Tez-Build #77
Date Mon, 22 Jul 2013 21:03:35 GMT
See <https://builds.apache.org/job/Tez-Build/77/changes>

Changes:

[hitesh] TEZ-312. AppMasterUGI should take tokens from currentUser UGI when starting AM. (hitesh)

------------------------------------------
[...truncated 2363 lines...]
[INFO] Skipping execution of surefire because it has already been run for this configuration
[INFO] 
[INFO] --- maven-jar-plugin:2.3.1:jar (default-jar) @ tez-mapreduce ---
[INFO] Building jar: <https://builds.apache.org/job/Tez-Build/ws/tez-mapreduce/target/tez-mapreduce-0.2.0-SNAPSHOT.jar>
[INFO] 
[INFO] --- maven-jar-plugin:2.3.1:test-jar (default) @ tez-mapreduce ---
[INFO] Building jar: <https://builds.apache.org/job/Tez-Build/ws/tez-mapreduce/target/tez-mapreduce-0.2.0-SNAPSHOT-tests.jar>
[INFO]                                                                         
[INFO] ------------------------------------------------------------------------
[INFO] Building tez-yarn-client 0.2.0-SNAPSHOT
[INFO] ------------------------------------------------------------------------
[INFO] 
[INFO] --- maven-clean-plugin:2.4.1:clean (default-clean) @ tez-yarn-client ---
[INFO] Deleting <https://builds.apache.org/job/Tez-Build/ws/tez-yarn-client/target>
[INFO] 
[INFO] --- maven-resources-plugin:2.5:resources (default-resources) @ tez-yarn-client ---
[debug] execute contextualize
[WARNING] Using platform encoding (ISO-8859-1 actually) to copy filtered resources, i.e. build
is platform dependent!
[INFO] Copying 1 resource
[INFO] 
[INFO] --- maven-compiler-plugin:2.3.2:compile (default-compile) @ tez-yarn-client ---
[WARNING] File encoding has not been set, using platform encoding ISO-8859-1, i.e. build is
platform dependent!
[INFO] Compiling 7 source files to <https://builds.apache.org/job/Tez-Build/ws/tez-yarn-client/target/classes>
[INFO] 
[INFO] --- maven-resources-plugin:2.5:testResources (default-testResources) @ tez-yarn-client
---
[debug] execute contextualize
[WARNING] Using platform encoding (ISO-8859-1 actually) to copy filtered resources, i.e. build
is platform dependent!
[INFO] skip non existing resourceDirectory <https://builds.apache.org/job/Tez-Build/ws/tez-yarn-client/src/test/resources>
[INFO] 
[INFO] --- maven-compiler-plugin:2.3.2:testCompile (default-testCompile) @ tez-yarn-client
---
[INFO] No sources to compile
[INFO] 
[INFO] --- maven-surefire-plugin:2.14.1:test (default-test) @ tez-yarn-client ---
[INFO] No tests to run.
[INFO] 
[INFO] --- maven-resources-plugin:2.5:resources (default-resources) @ tez-yarn-client ---
[debug] execute contextualize
[WARNING] Using platform encoding (ISO-8859-1 actually) to copy filtered resources, i.e. build
is platform dependent!
[INFO] Copying 1 resource
[INFO] 
[INFO] --- maven-compiler-plugin:2.3.2:compile (default-compile) @ tez-yarn-client ---
[INFO] Nothing to compile - all classes are up to date
[INFO] 
[INFO] --- maven-resources-plugin:2.5:testResources (default-testResources) @ tez-yarn-client
---
[debug] execute contextualize
[WARNING] Using platform encoding (ISO-8859-1 actually) to copy filtered resources, i.e. build
is platform dependent!
[INFO] skip non existing resourceDirectory <https://builds.apache.org/job/Tez-Build/ws/tez-yarn-client/src/test/resources>
[INFO] 
[INFO] --- maven-compiler-plugin:2.3.2:testCompile (default-testCompile) @ tez-yarn-client
---
[INFO] No sources to compile
[INFO] 
[INFO] --- maven-surefire-plugin:2.14.1:test (default-test) @ tez-yarn-client ---
[INFO] No tests to run.
[INFO] Skipping execution of surefire because it has already been run for this configuration
[INFO] 
[INFO] --- maven-jar-plugin:2.3.1:jar (default-jar) @ tez-yarn-client ---
[INFO] Building jar: <https://builds.apache.org/job/Tez-Build/ws/tez-yarn-client/target/tez-yarn-client-0.2.0-SNAPSHOT.jar>
[INFO] 
[INFO] --- maven-jar-plugin:2.3.1:test-jar (default) @ tez-yarn-client ---
[WARNING] JAR will be empty - no content was marked for inclusion!
[INFO] Building jar: <https://builds.apache.org/job/Tez-Build/ws/tez-yarn-client/target/tez-yarn-client-0.2.0-SNAPSHOT-tests.jar>
[INFO] 
[INFO] --- maven-install-plugin:2.3.1:install (default-install) @ tez-yarn-client ---
[INFO] Installing <https://builds.apache.org/job/Tez-Build/ws/tez-yarn-client/target/tez-yarn-client-0.2.0-SNAPSHOT.jar>
to /home/jenkins/.m2/repository/org/apache/tez/tez-yarn-client/0.2.0-SNAPSHOT/tez-yarn-client-0.2.0-SNAPSHOT.jar
[INFO] Installing <https://builds.apache.org/job/Tez-Build/ws/tez-yarn-client/pom.xml>
to /home/jenkins/.m2/repository/org/apache/tez/tez-yarn-client/0.2.0-SNAPSHOT/tez-yarn-client-0.2.0-SNAPSHOT.pom
[INFO] Installing <https://builds.apache.org/job/Tez-Build/ws/tez-yarn-client/target/tez-yarn-client-0.2.0-SNAPSHOT-tests.jar>
to /home/jenkins/.m2/repository/org/apache/tez/tez-yarn-client/0.2.0-SNAPSHOT/tez-yarn-client-0.2.0-SNAPSHOT-tests.jar
[INFO] 
[INFO] --- maven-deploy-plugin:2.7:deploy (default-deploy) @ tez-yarn-client ---
Downloading: https://repository.apache.org/content/repositories/snapshots/org/apache/tez/tez-yarn-client/0.2.0-SNAPSHOT/maven-metadata.xml
995 B       
        
Downloaded: https://repository.apache.org/content/repositories/snapshots/org/apache/tez/tez-yarn-client/0.2.0-SNAPSHOT/maven-metadata.xml
(995 B at 1.0 KB/sec)
Uploading: https://repository.apache.org/content/repositories/snapshots/org/apache/tez/tez-yarn-client/0.2.0-SNAPSHOT/tez-yarn-client-0.2.0-20130722.210304-36.jar
2/27 KB   
4/27 KB   
6/27 KB   
8/27 KB   
10/27 KB   
12/27 KB   
14/27 KB   
16/27 KB   
18/27 KB   
20/27 KB   
22/27 KB   
24/27 KB   
26/27 KB   
27/27 KB   
           
Uploaded: https://repository.apache.org/content/repositories/snapshots/org/apache/tez/tez-yarn-client/0.2.0-SNAPSHOT/tez-yarn-client-0.2.0-20130722.210304-36.jar
(27 KB at 70.7 KB/sec)
Uploading: https://repository.apache.org/content/repositories/snapshots/org/apache/tez/tez-yarn-client/0.2.0-SNAPSHOT/tez-yarn-client-0.2.0-20130722.210304-36.pom
2/3 KB     
3/3 KB   
         
Uploaded: https://repository.apache.org/content/repositories/snapshots/org/apache/tez/tez-yarn-client/0.2.0-SNAPSHOT/tez-yarn-client-0.2.0-20130722.210304-36.pom
(3 KB at 1.9 KB/sec)
Downloading: https://repository.apache.org/content/repositories/snapshots/org/apache/tez/tez-yarn-client/maven-metadata.xml
289 B    
        
Downloaded: https://repository.apache.org/content/repositories/snapshots/org/apache/tez/tez-yarn-client/maven-metadata.xml
(289 B at 0.5 KB/sec)
Uploading: https://repository.apache.org/content/repositories/snapshots/org/apache/tez/tez-yarn-client/0.2.0-SNAPSHOT/maven-metadata.xml
995/995 B   
            
Uploaded: https://repository.apache.org/content/repositories/snapshots/org/apache/tez/tez-yarn-client/0.2.0-SNAPSHOT/maven-metadata.xml
(995 B at 3.2 KB/sec)
Uploading: https://repository.apache.org/content/repositories/snapshots/org/apache/tez/tez-yarn-client/maven-metadata.xml
289/289 B   
            
Uploaded: https://repository.apache.org/content/repositories/snapshots/org/apache/tez/tez-yarn-client/maven-metadata.xml
(289 B at 0.8 KB/sec)
Uploading: https://repository.apache.org/content/repositories/snapshots/org/apache/tez/tez-yarn-client/0.2.0-SNAPSHOT/tez-yarn-client-0.2.0-20130722.210304-36-tests.jar
2/3 KB      
3/3 KB   
         
Uploaded: https://repository.apache.org/content/repositories/snapshots/org/apache/tez/tez-yarn-client/0.2.0-SNAPSHOT/tez-yarn-client-0.2.0-20130722.210304-36-tests.jar
(3 KB at 6.4 KB/sec)
Uploading: https://repository.apache.org/content/repositories/snapshots/org/apache/tez/tez-yarn-client/0.2.0-SNAPSHOT/maven-metadata.xml
995/995 B   
            
Uploaded: https://repository.apache.org/content/repositories/snapshots/org/apache/tez/tez-yarn-client/0.2.0-SNAPSHOT/maven-metadata.xml
(995 B at 3.1 KB/sec)
[INFO] 
[INFO] --- maven-resources-plugin:2.5:resources (default-resources) @ tez-yarn-client ---
[debug] execute contextualize
[WARNING] Using platform encoding (ISO-8859-1 actually) to copy filtered resources, i.e. build
is platform dependent!
[INFO] Copying 1 resource
[INFO] 
[INFO] --- maven-compiler-plugin:2.3.2:compile (default-compile) @ tez-yarn-client ---
[INFO] Nothing to compile - all classes are up to date
[INFO] 
[INFO] --- maven-resources-plugin:2.5:testResources (default-testResources) @ tez-yarn-client
---
[debug] execute contextualize
[WARNING] Using platform encoding (ISO-8859-1 actually) to copy filtered resources, i.e. build
is platform dependent!
[INFO] skip non existing resourceDirectory <https://builds.apache.org/job/Tez-Build/ws/tez-yarn-client/src/test/resources>
[INFO] 
[INFO] --- maven-compiler-plugin:2.3.2:testCompile (default-testCompile) @ tez-yarn-client
---
[INFO] No sources to compile
[INFO] 
[INFO] --- maven-surefire-plugin:2.14.1:test (default-test) @ tez-yarn-client ---
[INFO] No tests to run.
[INFO] Skipping execution of surefire because it has already been run for this configuration
[INFO] 
[INFO] --- maven-jar-plugin:2.3.1:jar (default-jar) @ tez-yarn-client ---
[INFO] Building jar: <https://builds.apache.org/job/Tez-Build/ws/tez-yarn-client/target/tez-yarn-client-0.2.0-SNAPSHOT.jar>
[INFO] 
[INFO] --- maven-jar-plugin:2.3.1:test-jar (default) @ tez-yarn-client ---
[WARNING] JAR will be empty - no content was marked for inclusion!
[INFO] Building jar: <https://builds.apache.org/job/Tez-Build/ws/tez-yarn-client/target/tez-yarn-client-0.2.0-SNAPSHOT-tests.jar>
[INFO]                                                                         
[INFO] ------------------------------------------------------------------------
[INFO] Building tez-dag 0.2.0-SNAPSHOT
[INFO] ------------------------------------------------------------------------
[INFO] 
[INFO] --- maven-clean-plugin:2.4.1:clean (default-clean) @ tez-dag ---
[INFO] Deleting <https://builds.apache.org/job/Tez-Build/ws/tez-dag/target>
[INFO] 
[INFO] --- avro-maven-plugin:1.5.3:protocol (default) @ tez-dag ---
[INFO] 
[INFO] --- maven-resources-plugin:2.5:resources (default-resources) @ tez-dag ---
[debug] execute contextualize
[WARNING] Using platform encoding (ISO-8859-1 actually) to copy filtered resources, i.e. build
is platform dependent!
[INFO] Copying 1 resource
[INFO] 
[INFO] --- maven-compiler-plugin:2.3.2:compile (default-compile) @ tez-dag ---
[WARNING] File encoding has not been set, using platform encoding ISO-8859-1, i.e. build is
platform dependent!
[INFO] Compiling 196 source files to <https://builds.apache.org/job/Tez-Build/ws/tez-dag/target/classes>
[INFO] 
[INFO] --- maven-resources-plugin:2.5:testResources (default-testResources) @ tez-dag ---
[debug] execute contextualize
[WARNING] Using platform encoding (ISO-8859-1 actually) to copy filtered resources, i.e. build
is platform dependent!
[INFO] Copying 1 resource
[INFO] 
[INFO] --- maven-compiler-plugin:2.3.2:testCompile (default-testCompile) @ tez-dag ---
[WARNING] File encoding has not been set, using platform encoding ISO-8859-1, i.e. build is
platform dependent!
[INFO] Compiling 8 source files to <https://builds.apache.org/job/Tez-Build/ws/tez-dag/target/test-classes>
[INFO] 
[INFO] --- maven-surefire-plugin:2.14.1:test (default-test) @ tez-dag ---
[INFO] Surefire report directory: <https://builds.apache.org/job/Tez-Build/ws/tez-dag/target/surefire-reports>

-------------------------------------------------------
 T E S T S
-------------------------------------------------------

-------------------------------------------------------
 T E S T S
-------------------------------------------------------
Running org.apache.tez.dag.app.rm.container.TestAMContainer
Tests run: 20, Failures: 0, Errors: 0, Skipped: 0, Time elapsed: 1.22 sec
Running org.apache.tez.dag.app.rm.TestTaskScheduler
Tests run: 2, Failures: 0, Errors: 0, Skipped: 0, Time elapsed: 0.883 sec
Running org.apache.tez.dag.app.dag.impl.TestTaskAttempt
Tests run: 8, Failures: 0, Errors: 0, Skipped: 0, Time elapsed: 1.203 sec
Running org.apache.tez.dag.app.dag.impl.TestTaskImpl
Tests run: 9, Failures: 0, Errors: 0, Skipped: 0, Time elapsed: 0.968 sec
Running org.apache.tez.dag.app.dag.impl.TestVertexImpl
Tests run: 26, Failures: 0, Errors: 0, Skipped: 1, Time elapsed: 2.234 sec
Running org.apache.tez.dag.app.dag.impl.TestDAGScheduler
Tests run: 2, Failures: 0, Errors: 0, Skipped: 1, Time elapsed: 0.511 sec
Running org.apache.tez.dag.app.dag.impl.TestVertexScheduler
Tests run: 1, Failures: 0, Errors: 0, Skipped: 0, Time elapsed: 0.481 sec
Running org.apache.tez.dag.app.dag.impl.TestDAGImpl
Tests run: 12, Failures: 1, Errors: 0, Skipped: 1, Time elapsed: 2.016 sec <<< FAILURE!
testInvalidEvent(org.apache.tez.dag.app.dag.impl.TestDAGImpl)  Time elapsed: 0.021 sec  <<<
FAILURE!
java.lang.AssertionError: expected:<ERROR> but was:<NEW>
	at org.junit.Assert.fail(Assert.java:88)
	at org.junit.Assert.failNotEquals(Assert.java:743)
	at org.junit.Assert.assertEquals(Assert.java:118)
	at org.junit.Assert.assertEquals(Assert.java:144)
	at org.apache.tez.dag.app.dag.impl.TestDAGImpl.testInvalidEvent(TestDAGImpl.java:651)


Results :

Failed tests: 
  TestDAGImpl.testInvalidEvent:651 expected:<ERROR> but was:<NEW>

Tests run: 80, Failures: 1, Errors: 0, Skipped: 3

[INFO] ------------------------------------------------------------------------
[INFO] Reactor Summary:
[INFO] 
[INFO] tez ............................................... SUCCESS [2.889s]
[INFO] tez-dag-api ....................................... SUCCESS [24.967s]
[INFO] tez-common ........................................ SUCCESS [5.965s]
[INFO] tez-engine-api .................................... SUCCESS [3.829s]
[INFO] tez-engine ........................................ SUCCESS [6.487s]
[INFO] tez-mapreduce ..................................... SUCCESS [19.221s]
[INFO] tez-yarn-client ................................... SUCCESS [5.677s]
[INFO] tez-dag ........................................... FAILURE [17.886s]
[INFO] tez-mapreduce-examples ............................ SKIPPED
[INFO] tez-mapreduce-tests ............................... SKIPPED
[INFO] tez-dist .......................................... SKIPPED
[INFO] ------------------------------------------------------------------------
[INFO] BUILD FAILURE
[INFO] ------------------------------------------------------------------------
[INFO] Total time: 1:27.280s
[INFO] Finished at: Mon Jul 22 21:03:25 UTC 2013
[INFO] Final Memory: 99M/313M
[INFO] ------------------------------------------------------------------------
[ERROR] Failed to execute goal org.apache.maven.plugins:maven-surefire-plugin:2.14.1:test
(default-test) on project tez-dag: There are test failures.
[ERROR] 
[ERROR] Please refer to <https://builds.apache.org/job/Tez-Build/ws/tez-dag/target/surefire-reports>
for the individual test results.
[ERROR] -> [Help 1]
[ERROR] 
[ERROR] To see the full stack trace of the errors, re-run Maven with the -e switch.
[ERROR] Re-run Maven using the -X switch to enable full debug logging.
[ERROR] 
[ERROR] For more information about the errors and possible solutions, please read the following
articles:
[ERROR] [Help 1] http://cwiki.apache.org/confluence/display/MAVEN/MojoFailureException
[ERROR] 
[ERROR] After correcting the problems, you can resume the build with the command
[ERROR]   mvn <goals> -rf :tez-dag
Build step 'Execute shell' marked build as failure
Archiving artifacts
Recording test results

Mime
View raw message