tez-dev mailing list archives

Site index · List index
Message view « Date » · « Thread »
Top « Date » · « Thread »
From Apache Jenkins Server <jenk...@builds.apache.org>
Subject Build failed in Jenkins: Tez-Build #78
Date Tue, 23 Jul 2013 00:49:53 GMT
See <https://builds.apache.org/job/Tez-Build/78/changes>

Changes:

[bikas] TEZ-310. Speedup startup by starting services in parallel (bikas)

[bikas] TEZ-313. Change TezEntityDescriptor to not use ByteBuffer as its not thread safe (bikas)

------------------------------------------
[...truncated 3634 lines...]
[debug] execute contextualize
[WARNING] Using platform encoding (ISO-8859-1 actually) to copy filtered resources, i.e. build
is platform dependent!
[INFO] skip non existing resourceDirectory <https://builds.apache.org/job/Tez-Build/ws/tez-yarn-client/src/test/resources>
[INFO] 
[INFO] --- maven-compiler-plugin:2.3.2:testCompile (default-testCompile) @ tez-yarn-client
---
[INFO] No sources to compile
[INFO] 
[INFO] --- maven-surefire-plugin:2.14.1:test (default-test) @ tez-yarn-client ---
[INFO] No tests to run.
[INFO] 
[INFO] --- maven-resources-plugin:2.5:resources (default-resources) @ tez-yarn-client ---
[debug] execute contextualize
[WARNING] Using platform encoding (ISO-8859-1 actually) to copy filtered resources, i.e. build
is platform dependent!
[INFO] Copying 1 resource
[INFO] 
[INFO] --- maven-compiler-plugin:2.3.2:compile (default-compile) @ tez-yarn-client ---
[INFO] Nothing to compile - all classes are up to date
[INFO] 
[INFO] --- maven-resources-plugin:2.5:testResources (default-testResources) @ tez-yarn-client
---
[debug] execute contextualize
[WARNING] Using platform encoding (ISO-8859-1 actually) to copy filtered resources, i.e. build
is platform dependent!
[INFO] skip non existing resourceDirectory <https://builds.apache.org/job/Tez-Build/ws/tez-yarn-client/src/test/resources>
[INFO] 
[INFO] --- maven-compiler-plugin:2.3.2:testCompile (default-testCompile) @ tez-yarn-client
---
[INFO] No sources to compile
[INFO] 
[INFO] --- maven-surefire-plugin:2.14.1:test (default-test) @ tez-yarn-client ---
[INFO] No tests to run.
[INFO] Skipping execution of surefire because it has already been run for this configuration
[INFO] 
[INFO] --- maven-jar-plugin:2.3.1:jar (default-jar) @ tez-yarn-client ---
[INFO] Building jar: <https://builds.apache.org/job/Tez-Build/ws/tez-yarn-client/target/tez-yarn-client-0.2.0-SNAPSHOT.jar>
[INFO] 
[INFO] --- maven-jar-plugin:2.3.1:test-jar (default) @ tez-yarn-client ---
[WARNING] JAR will be empty - no content was marked for inclusion!
[INFO] Building jar: <https://builds.apache.org/job/Tez-Build/ws/tez-yarn-client/target/tez-yarn-client-0.2.0-SNAPSHOT-tests.jar>
[INFO] 
[INFO] --- maven-install-plugin:2.3.1:install (default-install) @ tez-yarn-client ---
[INFO] Installing <https://builds.apache.org/job/Tez-Build/ws/tez-yarn-client/target/tez-yarn-client-0.2.0-SNAPSHOT.jar>
to /home/jenkins/.m2/repository/org/apache/tez/tez-yarn-client/0.2.0-SNAPSHOT/tez-yarn-client-0.2.0-SNAPSHOT.jar
[INFO] Installing <https://builds.apache.org/job/Tez-Build/ws/tez-yarn-client/pom.xml>
to /home/jenkins/.m2/repository/org/apache/tez/tez-yarn-client/0.2.0-SNAPSHOT/tez-yarn-client-0.2.0-SNAPSHOT.pom
[INFO] Installing <https://builds.apache.org/job/Tez-Build/ws/tez-yarn-client/target/tez-yarn-client-0.2.0-SNAPSHOT-tests.jar>
to /home/jenkins/.m2/repository/org/apache/tez/tez-yarn-client/0.2.0-SNAPSHOT/tez-yarn-client-0.2.0-SNAPSHOT-tests.jar
[INFO] 
[INFO] --- maven-deploy-plugin:2.7:deploy (default-deploy) @ tez-yarn-client ---
Downloading: https://repository.apache.org/content/repositories/snapshots/org/apache/tez/tez-yarn-client/0.2.0-SNAPSHOT/maven-metadata.xml
995 B       
        
Downloaded: https://repository.apache.org/content/repositories/snapshots/org/apache/tez/tez-yarn-client/0.2.0-SNAPSHOT/maven-metadata.xml
(995 B at 4.7 KB/sec)
Uploading: https://repository.apache.org/content/repositories/snapshots/org/apache/tez/tez-yarn-client/0.2.0-SNAPSHOT/tez-yarn-client-0.2.0-20130723.003425-37.jar
2/27 KB   
4/27 KB   
6/27 KB   
8/27 KB   
10/27 KB   
12/27 KB   
14/27 KB   
16/27 KB   
18/27 KB   
20/27 KB   
22/27 KB   
24/27 KB   
26/27 KB   
27/27 KB   
           
Uploaded: https://repository.apache.org/content/repositories/snapshots/org/apache/tez/tez-yarn-client/0.2.0-SNAPSHOT/tez-yarn-client-0.2.0-20130723.003425-37.jar
(27 KB at 81.6 KB/sec)
Uploading: https://repository.apache.org/content/repositories/snapshots/org/apache/tez/tez-yarn-client/0.2.0-SNAPSHOT/tez-yarn-client-0.2.0-20130723.003425-37.pom
2/3 KB     
3/3 KB   
         
Uploaded: https://repository.apache.org/content/repositories/snapshots/org/apache/tez/tez-yarn-client/0.2.0-SNAPSHOT/tez-yarn-client-0.2.0-20130723.003425-37.pom
(3 KB at 6.6 KB/sec)
Downloading: https://repository.apache.org/content/repositories/snapshots/org/apache/tez/tez-yarn-client/maven-metadata.xml
289 B    
        
Downloaded: https://repository.apache.org/content/repositories/snapshots/org/apache/tez/tez-yarn-client/maven-metadata.xml
(289 B at 0.8 KB/sec)
Uploading: https://repository.apache.org/content/repositories/snapshots/org/apache/tez/tez-yarn-client/0.2.0-SNAPSHOT/maven-metadata.xml
995/995 B   
            
Uploaded: https://repository.apache.org/content/repositories/snapshots/org/apache/tez/tez-yarn-client/0.2.0-SNAPSHOT/maven-metadata.xml
(995 B at 1.9 KB/sec)
Uploading: https://repository.apache.org/content/repositories/snapshots/org/apache/tez/tez-yarn-client/maven-metadata.xml
289/289 B   
            
Uploaded: https://repository.apache.org/content/repositories/snapshots/org/apache/tez/tez-yarn-client/maven-metadata.xml
(289 B at 0.6 KB/sec)
Uploading: https://repository.apache.org/content/repositories/snapshots/org/apache/tez/tez-yarn-client/0.2.0-SNAPSHOT/tez-yarn-client-0.2.0-20130723.003425-37-tests.jar
2/3 KB      
3/3 KB   
         
Uploaded: https://repository.apache.org/content/repositories/snapshots/org/apache/tez/tez-yarn-client/0.2.0-SNAPSHOT/tez-yarn-client-0.2.0-20130723.003425-37-tests.jar
(3 KB at 6.3 KB/sec)
Uploading: https://repository.apache.org/content/repositories/snapshots/org/apache/tez/tez-yarn-client/0.2.0-SNAPSHOT/maven-metadata.xml
995/995 B   
            
Uploaded: https://repository.apache.org/content/repositories/snapshots/org/apache/tez/tez-yarn-client/0.2.0-SNAPSHOT/maven-metadata.xml
(995 B at 3.0 KB/sec)
[INFO] 
[INFO] --- maven-resources-plugin:2.5:resources (default-resources) @ tez-yarn-client ---
[debug] execute contextualize
[WARNING] Using platform encoding (ISO-8859-1 actually) to copy filtered resources, i.e. build
is platform dependent!
[INFO] Copying 1 resource
[INFO] 
[INFO] --- maven-compiler-plugin:2.3.2:compile (default-compile) @ tez-yarn-client ---
[INFO] Nothing to compile - all classes are up to date
[INFO] 
[INFO] --- maven-resources-plugin:2.5:testResources (default-testResources) @ tez-yarn-client
---
[debug] execute contextualize
[WARNING] Using platform encoding (ISO-8859-1 actually) to copy filtered resources, i.e. build
is platform dependent!
[INFO] skip non existing resourceDirectory <https://builds.apache.org/job/Tez-Build/ws/tez-yarn-client/src/test/resources>
[INFO] 
[INFO] --- maven-compiler-plugin:2.3.2:testCompile (default-testCompile) @ tez-yarn-client
---
[INFO] No sources to compile
[INFO] 
[INFO] --- maven-surefire-plugin:2.14.1:test (default-test) @ tez-yarn-client ---
[INFO] No tests to run.
[INFO] Skipping execution of surefire because it has already been run for this configuration
[INFO] 
[INFO] --- maven-jar-plugin:2.3.1:jar (default-jar) @ tez-yarn-client ---
[INFO] Building jar: <https://builds.apache.org/job/Tez-Build/ws/tez-yarn-client/target/tez-yarn-client-0.2.0-SNAPSHOT.jar>
[INFO] 
[INFO] --- maven-jar-plugin:2.3.1:test-jar (default) @ tez-yarn-client ---
[WARNING] JAR will be empty - no content was marked for inclusion!
[INFO] Building jar: <https://builds.apache.org/job/Tez-Build/ws/tez-yarn-client/target/tez-yarn-client-0.2.0-SNAPSHOT-tests.jar>
[INFO]                                                                         
[INFO] ------------------------------------------------------------------------
[INFO] Building tez-dag 0.2.0-SNAPSHOT
[INFO] ------------------------------------------------------------------------
Downloading: https://repository.apache.org/content/repositories/snapshots/org/apache/hadoop/hadoop-yarn-common/3.0.0-SNAPSHOT/hadoop-yarn-common-3.0.0-20130723.003152-2610-tests.jar
4/143 KB    
8/143 KB   
12/143 KB   
14/143 KB   
18/143 KB   
22/143 KB   
26/143 KB   
30/143 KB   
34/143 KB   
38/143 KB   
42/143 KB   
45/143 KB   
49/143 KB   
53/143 KB   
57/143 KB   
61/143 KB   
65/143 KB   
69/143 KB   
73/143 KB   
77/143 KB   
81/143 KB   
84/143 KB   
88/143 KB   
92/143 KB   
96/143 KB   
100/143 KB   
104/143 KB   
108/143 KB   
112/143 KB   
116/143 KB   
120/143 KB   
124/143 KB   
128/143 KB   
131/143 KB   
135/143 KB   
139/143 KB   
143/143 KB   
             
Downloaded: https://repository.apache.org/content/repositories/snapshots/org/apache/hadoop/hadoop-yarn-common/3.0.0-SNAPSHOT/hadoop-yarn-common-3.0.0-20130723.003152-2610-tests.jar
(143 KB at 410.6 KB/sec)
[INFO] 
[INFO] --- maven-clean-plugin:2.4.1:clean (default-clean) @ tez-dag ---
[INFO] Deleting <https://builds.apache.org/job/Tez-Build/ws/tez-dag/target>
[INFO] 
[INFO] --- avro-maven-plugin:1.5.3:protocol (default) @ tez-dag ---
[INFO] 
[INFO] --- maven-resources-plugin:2.5:resources (default-resources) @ tez-dag ---
[debug] execute contextualize
[WARNING] Using platform encoding (ISO-8859-1 actually) to copy filtered resources, i.e. build
is platform dependent!
[INFO] Copying 1 resource
[INFO] 
[INFO] --- maven-compiler-plugin:2.3.2:compile (default-compile) @ tez-dag ---
[WARNING] File encoding has not been set, using platform encoding ISO-8859-1, i.e. build is
platform dependent!
[INFO] Compiling 196 source files to <https://builds.apache.org/job/Tez-Build/ws/tez-dag/target/classes>
[INFO] 
[INFO] --- maven-resources-plugin:2.5:testResources (default-testResources) @ tez-dag ---
[debug] execute contextualize
[WARNING] Using platform encoding (ISO-8859-1 actually) to copy filtered resources, i.e. build
is platform dependent!
[INFO] Copying 1 resource
[INFO] 
[INFO] --- maven-compiler-plugin:2.3.2:testCompile (default-testCompile) @ tez-dag ---
[WARNING] File encoding has not been set, using platform encoding ISO-8859-1, i.e. build is
platform dependent!
[INFO] Compiling 8 source files to <https://builds.apache.org/job/Tez-Build/ws/tez-dag/target/test-classes>
[INFO] 
[INFO] --- maven-surefire-plugin:2.14.1:test (default-test) @ tez-dag ---
[INFO] Surefire report directory: <https://builds.apache.org/job/Tez-Build/ws/tez-dag/target/surefire-reports>

-------------------------------------------------------
 T E S T S
-------------------------------------------------------

-------------------------------------------------------
 T E S T S
-------------------------------------------------------
Running org.apache.tez.dag.app.rm.container.TestAMContainer
Tests run: 20, Failures: 0, Errors: 0, Skipped: 0, Time elapsed: 1.202 sec
Running org.apache.tez.dag.app.rm.TestTaskScheduler
Tests run: 2, Failures: 0, Errors: 0, Skipped: 0, Time elapsed: 0.899 sec
Running org.apache.tez.dag.app.dag.impl.TestTaskAttempt
Tests run: 8, Failures: 0, Errors: 0, Skipped: 0, Time elapsed: 1.194 sec
Running org.apache.tez.dag.app.dag.impl.TestTaskImpl
Tests run: 9, Failures: 0, Errors: 0, Skipped: 0, Time elapsed: 0.962 sec
Running org.apache.tez.dag.app.dag.impl.TestVertexImpl
Tests run: 26, Failures: 0, Errors: 0, Skipped: 1, Time elapsed: 2.207 sec
Running org.apache.tez.dag.app.dag.impl.TestDAGScheduler
Tests run: 2, Failures: 0, Errors: 0, Skipped: 1, Time elapsed: 0.503 sec
Running org.apache.tez.dag.app.dag.impl.TestVertexScheduler
Tests run: 1, Failures: 0, Errors: 0, Skipped: 0, Time elapsed: 0.487 sec
Running org.apache.tez.dag.app.dag.impl.TestDAGImpl

Results :

Tests run: 68, Failures: 0, Errors: 0, Skipped: 2

[INFO] ------------------------------------------------------------------------
[INFO] Reactor Summary:
[INFO] 
[INFO] tez ............................................... SUCCESS [3.490s]
[INFO] tez-dag-api ....................................... SUCCESS [17.237s]
[INFO] tez-common ........................................ SUCCESS [6.208s]
[INFO] tez-engine-api .................................... SUCCESS [4.115s]
[INFO] tez-engine ........................................ SUCCESS [5.929s]
[INFO] tez-mapreduce ..................................... SUCCESS [19.746s]
[INFO] tez-yarn-client ................................... SUCCESS [4.440s]
[INFO] tez-dag ........................................... FAILURE [15:15.160s]
[INFO] tez-mapreduce-examples ............................ SKIPPED
[INFO] tez-mapreduce-tests ............................... SKIPPED
[INFO] tez-dist .......................................... SKIPPED
[INFO] ------------------------------------------------------------------------
[INFO] BUILD FAILURE
[INFO] ------------------------------------------------------------------------
[INFO] Total time: 16:16.637s
[INFO] Finished at: Tue Jul 23 00:49:43 UTC 2013
[INFO] Final Memory: 106M/532M
[INFO] ------------------------------------------------------------------------
[ERROR] Failed to execute goal org.apache.maven.plugins:maven-surefire-plugin:2.14.1:test
(default-test) on project tez-dag: There was a timeout or other error in the fork -> [Help
1]
[ERROR] 
[ERROR] To see the full stack trace of the errors, re-run Maven with the -e switch.
[ERROR] Re-run Maven using the -X switch to enable full debug logging.
[ERROR] 
[ERROR] For more information about the errors and possible solutions, please read the following
articles:
[ERROR] [Help 1] http://cwiki.apache.org/confluence/display/MAVEN/MojoFailureException
[ERROR] 
[ERROR] After correcting the problems, you can resume the build with the command
[ERROR]   mvn <goals> -rf :tez-dag
Build step 'Execute shell' marked build as failure
Archiving artifacts
Recording test results

Mime
View raw message