tez-dev mailing list archives

Site index · List index
Message view « Date » · « Thread »
Top « Date » · « Thread »
From Apache Jenkins Server <jenk...@builds.apache.org>
Subject Build failed in Jenkins: Tez-Build #376
Date Fri, 28 Mar 2014 19:09:54 GMT
See <https://builds.apache.org/job/Tez-Build/376/changes>

Changes:

[hitesh] TEZ-983. Support a helper function to extract required additional tokens from a file.
(hitesh)

------------------------------------------
[...truncated 5074 lines...]
2 KB    
       
Uploaded: https://repository.apache.org/content/repositories/snapshots/org/apache/tez/tez-dag/0.4.0-incubating-SNAPSHOT/maven-metadata.xml
(2 KB at 4.0 KB/sec)
Uploading: https://repository.apache.org/content/repositories/snapshots/org/apache/tez/tez-dag/maven-metadata.xml
403 B   
        
Uploaded: https://repository.apache.org/content/repositories/snapshots/org/apache/tez/tez-dag/maven-metadata.xml
(403 B at 1.2 KB/sec)
Uploading: https://repository.apache.org/content/repositories/snapshots/org/apache/tez/tez-dag/0.4.0-incubating-SNAPSHOT/tez-dag-0.4.0-incubating-20140328.185457-34-tests.jar
4 KB    
8 KB   
12 KB   
16 KB   
20 KB   
24 KB   
28 KB   
32 KB   
36 KB   
40 KB   
44 KB   
48 KB   
52 KB   
56 KB   
60 KB   
64 KB   
68 KB   
72 KB   
76 KB   
80 KB   
84 KB   
88 KB   
92 KB   
96 KB   
100 KB   
104 KB   
108 KB   
112 KB   
116 KB   
120 KB   
124 KB   
128 KB   
132 KB   
136 KB   
140 KB   
144 KB   
148 KB   
152 KB   
156 KB   
160 KB   
164 KB   
168 KB   
172 KB   
175 KB   
         
Uploaded: https://repository.apache.org/content/repositories/snapshots/org/apache/tez/tez-dag/0.4.0-incubating-SNAPSHOT/tez-dag-0.4.0-incubating-20140328.185457-34-tests.jar
(175 KB at 1178.4 KB/sec)
Uploading: https://repository.apache.org/content/repositories/snapshots/org/apache/tez/tez-dag/0.4.0-incubating-SNAPSHOT/maven-metadata.xml
2 KB     
       
Uploaded: https://repository.apache.org/content/repositories/snapshots/org/apache/tez/tez-dag/0.4.0-incubating-SNAPSHOT/maven-metadata.xml
(2 KB at 8.3 KB/sec)
[INFO] 
[INFO] --- buildnumber-maven-plugin:1.1:create (default) @ tez-dag ---
[INFO] Checking for local modifications: skipped.
[INFO] Updating project files from SCM: skipped.
[INFO] Executing: /bin/sh -c cd <https://builds.apache.org/job/Tez-Build/ws/tez-dag>
&& git rev-parse --verify HEAD
[INFO] Working directory: <https://builds.apache.org/job/Tez-Build/ws/tez-dag>
[INFO] Storing buildNumber: e32252cdcf6e52c1f361c780a7373168242e7c6c at timestamp: 1396032899582
[INFO] Executing: /bin/sh -c cd <https://builds.apache.org/job/Tez-Build/ws/tez-dag>
&& git rev-parse --verify HEAD
[INFO] Working directory: <https://builds.apache.org/job/Tez-Build/ws/tez-dag>
[INFO] Storing buildScmBranch: UNKNOWN
[INFO] 
[INFO] --- build-helper-maven-plugin:1.8:maven-version (maven-version) @ tez-dag ---
[INFO] 
[INFO] --- hadoop-maven-plugins:2.2.0:protoc (compile-protoc) @ tez-dag ---
[INFO] 
[INFO] --- maven-resources-plugin:2.6:resources (default-resources) @ tez-dag ---
[INFO] Using 'UTF-8' encoding to copy filtered resources.
[INFO] Copying 2 resources
[INFO] 
[INFO] --- maven-compiler-plugin:3.1:compile (default-compile) @ tez-dag ---
[INFO] Changes detected - recompiling the module!
[INFO] Compiling 196 source files to <https://builds.apache.org/job/Tez-Build/ws/tez-dag/target/classes>
[INFO] 
[INFO] --- maven-resources-plugin:2.6:testResources (default-testResources) @ tez-dag ---
[INFO] Using 'UTF-8' encoding to copy filtered resources.
[INFO] Copying 1 resource
[INFO] 
[INFO] --- maven-compiler-plugin:3.1:testCompile (default-testCompile) @ tez-dag ---
[INFO] Nothing to compile - all classes are up to date
[INFO] 
[INFO] --- maven-surefire-plugin:2.14.1:test (default-test) @ tez-dag ---
[INFO] Skipping execution of surefire because it has already been run for this configuration
[INFO] 
[INFO] --- maven-jar-plugin:2.4:jar (default-jar) @ tez-dag ---
[INFO] Building jar: <https://builds.apache.org/job/Tez-Build/ws/tez-dag/target/tez-dag-0.4.0-incubating-SNAPSHOT.jar>
[INFO] 
[INFO] --- maven-jar-plugin:2.4:test-jar (default) @ tez-dag ---
[INFO] Building jar: <https://builds.apache.org/job/Tez-Build/ws/tez-dag/target/tez-dag-0.4.0-incubating-SNAPSHOT-tests.jar>
[INFO]                                                                         
[INFO] ------------------------------------------------------------------------
[INFO] Building tez-tests 0.4.0-incubating-SNAPSHOT
[INFO] ------------------------------------------------------------------------
[INFO] 
[INFO] --- maven-clean-plugin:2.4.1:clean (default-clean) @ tez-tests ---
[INFO] Deleting <https://builds.apache.org/job/Tez-Build/ws/tez-tests/target>
[INFO] 
[INFO] --- buildnumber-maven-plugin:1.1:create (default) @ tez-tests ---
[INFO] Checking for local modifications: skipped.
[INFO] Updating project files from SCM: skipped.
[INFO] Executing: /bin/sh -c cd <https://builds.apache.org/job/Tez-Build/ws/tez-tests>
&& git rev-parse --verify HEAD
[INFO] Working directory: <https://builds.apache.org/job/Tez-Build/ws/tez-tests>
[INFO] Storing buildNumber: e32252cdcf6e52c1f361c780a7373168242e7c6c at timestamp: 1396032906548
[INFO] Executing: /bin/sh -c cd <https://builds.apache.org/job/Tez-Build/ws/tez-tests>
&& git rev-parse --verify HEAD
[INFO] Working directory: <https://builds.apache.org/job/Tez-Build/ws/tez-tests>
[INFO] Storing buildScmBranch: UNKNOWN
[INFO] 
[INFO] --- build-helper-maven-plugin:1.8:maven-version (maven-version) @ tez-tests ---
[INFO] 
[INFO] --- maven-resources-plugin:2.6:resources (default-resources) @ tez-tests ---
[INFO] Using 'UTF-8' encoding to copy filtered resources.
[INFO] skip non existing resourceDirectory <https://builds.apache.org/job/Tez-Build/ws/tez-tests/src/main/resources>
[INFO] 
[INFO] --- maven-compiler-plugin:3.1:compile (default-compile) @ tez-tests ---
[INFO] No sources to compile
[INFO] 
[INFO] --- maven-resources-plugin:2.6:testResources (default-testResources) @ tez-tests ---
[INFO] Using 'UTF-8' encoding to copy filtered resources.
[INFO] skip non existing resourceDirectory <https://builds.apache.org/job/Tez-Build/ws/tez-tests/src/test/resources>
[INFO] 
[INFO] --- maven-compiler-plugin:3.1:testCompile (default-testCompile) @ tez-tests ---
[INFO] Changes detected - recompiling the module!
[INFO] Compiling 20 source files to <https://builds.apache.org/job/Tez-Build/ws/tez-tests/target/test-classes>
[INFO] 
[INFO] --- maven-surefire-plugin:2.14.1:test (default-test) @ tez-tests ---
[INFO] Surefire report directory: <https://builds.apache.org/job/Tez-Build/ws/tez-tests/target/surefire-reports>

-------------------------------------------------------
 T E S T S
-------------------------------------------------------

-------------------------------------------------------
 T E S T S
-------------------------------------------------------
Running org.apache.tez.test.TestDAGRecovery
Tests run: 1, Failures: 0, Errors: 0, Skipped: 0, Time elapsed: 39.734 sec
Running org.apache.tez.test.TestFaultTolerance
Tests run: 20, Failures: 0, Errors: 0, Skipped: 0, Time elapsed: 172.171 sec
Running org.apache.tez.test.TestDAGRecovery2
Tests run: 1, Failures: 0, Errors: 0, Skipped: 0, Time elapsed: 29.053 sec
Running org.apache.tez.test.TestTezJobs
Tests run: 1, Failures: 0, Errors: 0, Skipped: 0, Time elapsed: 30.29 sec
Running org.apache.tez.mapreduce.TestMRRJobs
Tests run: 5, Failures: 0, Errors: 0, Skipped: 0, Time elapsed: 138.997 sec
Running org.apache.tez.mapreduce.TestMRRJobsDAGApi
Tests run: 8, Failures: 0, Errors: 6, Skipped: 0, Time elapsed: 463.017 sec <<< FAILURE!
testVertexGroups(org.apache.tez.mapreduce.TestMRRJobsDAGApi)  Time elapsed: 60.011 sec  <<<
ERROR!
java.lang.Exception: test timed out after 60000 milliseconds
	at java.lang.Thread.sleep(Native Method)
	at org.apache.tez.mapreduce.examples.UnionExample.run(UnionExample.java:482)
	at org.apache.tez.mapreduce.TestMRRJobsDAGApi.testVertexGroups(TestMRRJobsDAGApi.java:553)

testMRRSleepJobViaSession(org.apache.tez.mapreduce.TestMRRJobsDAGApi)  Time elapsed: 59.999
sec  <<< ERROR!
java.lang.Exception: test timed out after 60000 milliseconds
	at java.lang.Thread.sleep(Native Method)
	at org.apache.tez.client.TezSession.waitForProxy(TezSession.java:345)
	at org.apache.tez.client.TezSession.submitDAG(TezSession.java:170)
	at org.apache.tez.mapreduce.TestMRRJobsDAGApi.testMRRSleepJobDagSubmitCore(TestMRRJobsDAGApi.java:499)
	at org.apache.tez.mapreduce.TestMRRJobsDAGApi.testMRRSleepJobDagSubmitCore(TestMRRJobsDAGApi.java:271)
	at org.apache.tez.mapreduce.TestMRRJobsDAGApi.testMRRSleepJobViaSession(TestMRRJobsDAGApi.java:170)

testMultipleMRRSleepJobViaSession(org.apache.tez.mapreduce.TestMRRJobsDAGApi)  Time elapsed:
120.002 sec  <<< ERROR!
java.lang.Exception: test timed out after 120000 milliseconds
	at java.lang.Thread.sleep(Native Method)
	at org.apache.tez.client.TezSession.waitForProxy(TezSession.java:345)
	at org.apache.tez.client.TezSession.submitDAG(TezSession.java:170)
	at org.apache.tez.mapreduce.TestMRRJobsDAGApi.testMRRSleepJobDagSubmitCore(TestMRRJobsDAGApi.java:499)
	at org.apache.tez.mapreduce.TestMRRJobsDAGApi.testMultipleMRRSleepJobViaSession(TestMRRJobsDAGApi.java:201)

testMRRSleepJobDagSubmit(org.apache.tez.mapreduce.TestMRRJobsDAGApi)  Time elapsed: 60 sec
 <<< ERROR!
java.lang.Exception: test timed out after 60000 milliseconds
	at java.lang.Thread.sleep(Native Method)
	at org.apache.tez.mapreduce.TestMRRJobsDAGApi.testMRRSleepJobDagSubmitCore(TestMRRJobsDAGApi.java:507)
	at org.apache.tez.mapreduce.TestMRRJobsDAGApi.testMRRSleepJobDagSubmitCore(TestMRRJobsDAGApi.java:271)
	at org.apache.tez.mapreduce.TestMRRJobsDAGApi.testMRRSleepJobDagSubmit(TestMRRJobsDAGApi.java:148)

testMRRSleepJobDagSubmitAndKillViaRPC(org.apache.tez.mapreduce.TestMRRJobsDAGApi)  Time elapsed:
60.001 sec  <<< ERROR!
java.lang.Exception: test timed out after 60000 milliseconds
	at java.lang.Thread.sleep(Native Method)
	at org.apache.tez.client.TezSession.waitForProxy(TezSession.java:345)
	at org.apache.tez.client.TezSession.submitDAG(TezSession.java:170)
	at org.apache.tez.mapreduce.TestMRRJobsDAGApi.testMRRSleepJobDagSubmitCore(TestMRRJobsDAGApi.java:499)
	at org.apache.tez.mapreduce.TestMRRJobsDAGApi.testMRRSleepJobDagSubmitCore(TestMRRJobsDAGApi.java:271)
	at org.apache.tez.mapreduce.TestMRRJobsDAGApi.testMRRSleepJobDagSubmitAndKillViaRPC(TestMRRJobsDAGApi.java:244)

testMRRSleepJobDagSubmitAndKill(org.apache.tez.mapreduce.TestMRRJobsDAGApi)  Time elapsed:
60.002 sec  <<< ERROR!
java.lang.Exception: test timed out after 60000 milliseconds
	at java.lang.Thread.sleep(Native Method)
	at org.apache.tez.mapreduce.TestMRRJobsDAGApi.testMRRSleepJobDagSubmitCore(TestMRRJobsDAGApi.java:507)
	at org.apache.tez.mapreduce.TestMRRJobsDAGApi.testMRRSleepJobDagSubmitCore(TestMRRJobsDAGApi.java:271)
	at org.apache.tez.mapreduce.TestMRRJobsDAGApi.testMRRSleepJobDagSubmitAndKill(TestMRRJobsDAGApi.java:159)


Results :

Tests in error: 
  TestMRRJobsDAGApi.testVertexGroups:553 »  test timed out after 60000 milliseco...
  TestMRRJobsDAGApi.testMRRSleepJobViaSession:170->testMRRSleepJobDagSubmitCore:271->testMRRSleepJobDagSubmitCore:499
» 
  TestMRRJobsDAGApi.testMultipleMRRSleepJobViaSession:201->testMRRSleepJobDagSubmitCore:499
» 
  TestMRRJobsDAGApi.testMRRSleepJobDagSubmit:148->testMRRSleepJobDagSubmitCore:271->testMRRSleepJobDagSubmitCore:507
» 
  TestMRRJobsDAGApi.testMRRSleepJobDagSubmitAndKillViaRPC:244->testMRRSleepJobDagSubmitCore:271->testMRRSleepJobDagSubmitCore:499
» 
  TestMRRJobsDAGApi.testMRRSleepJobDagSubmitAndKill:159->testMRRSleepJobDagSubmitCore:271->testMRRSleepJobDagSubmitCore:507
» 

Tests run: 36, Failures: 0, Errors: 6, Skipped: 0

[INFO] ------------------------------------------------------------------------
[INFO] Reactor Summary:
[INFO] 
[INFO] tez ............................................... SUCCESS [15.481s]
[INFO] tez-api ........................................... SUCCESS [31.548s]
[INFO] tez-common ........................................ SUCCESS [3.551s]
[INFO] tez-runtime-internals ............................. SUCCESS [10.524s]
[INFO] tez-runtime-library ............................... SUCCESS [9.683s]
[INFO] tez-mapreduce ..................................... SUCCESS [21.993s]
[INFO] tez-mapreduce-examples ............................ SUCCESS [4.785s]
[INFO] tez-dag ........................................... SUCCESS [53.445s]
[INFO] tez-tests ......................................... FAILURE [14:40.185s]
[INFO] tez-dist .......................................... SKIPPED
[INFO] Tez ............................................... SKIPPED
[INFO] ------------------------------------------------------------------------
[INFO] BUILD FAILURE
[INFO] ------------------------------------------------------------------------
[INFO] Total time: 17:11.705s
[INFO] Finished at: Fri Mar 28 19:09:42 UTC 2014
[INFO] Final Memory: 25M/474M
[INFO] ------------------------------------------------------------------------
[ERROR] Failed to execute goal org.apache.maven.plugins:maven-surefire-plugin:2.14.1:test
(default-test) on project tez-tests: There are test failures.
[ERROR] 
[ERROR] Please refer to <https://builds.apache.org/job/Tez-Build/ws/tez-tests/target/surefire-reports>
for the individual test results.
[ERROR] -> [Help 1]
[ERROR] 
[ERROR] To see the full stack trace of the errors, re-run Maven with the -e switch.
[ERROR] Re-run Maven using the -X switch to enable full debug logging.
[ERROR] 
[ERROR] For more information about the errors and possible solutions, please read the following
articles:
[ERROR] [Help 1] http://cwiki.apache.org/confluence/display/MAVEN/MojoFailureException
[ERROR] 
[ERROR] After correcting the problems, you can resume the build with the command
[ERROR]   mvn <goals> -rf :tez-tests
Build step 'Execute shell' marked build as failure
Archiving artifacts
Recording test results

Mime
View raw message