tez-dev mailing list archives

Site index · List index
Message view « Date » · « Thread »
Top « Date » · « Thread »
From Apache Jenkins Server <jenk...@builds.apache.org>
Subject Build failed in Jenkins: Tez-Build #377
Date Fri, 28 Mar 2014 20:07:49 GMT
See <https://builds.apache.org/job/Tez-Build/377/changes>

Changes:

[sseth] TEZ-990. Add support for a credentials file read by TezClient. (sseth)

------------------------------------------
[...truncated 1973 lines...]
60/192 KB   
62/192 KB   
64/192 KB   
66/192 KB   
68/192 KB   
70/192 KB   
72/192 KB   
74/192 KB   
76/192 KB   
78/192 KB   
80/192 KB   
82/192 KB   
84/192 KB   
86/192 KB   
88/192 KB   
90/192 KB   
92/192 KB   
94/192 KB   
96/192 KB   
98/192 KB   
100/192 KB   
102/192 KB   
104/192 KB   
106/192 KB   
108/192 KB   
110/192 KB   
112/192 KB   
114/192 KB   
116/192 KB   
118/192 KB   
120/192 KB   
122/192 KB   
124/192 KB   
126/192 KB   
128/192 KB   
130/192 KB   
132/192 KB   
134/192 KB   
136/192 KB   
138/192 KB   
140/192 KB   
142/192 KB   
144/192 KB   
146/192 KB   
148/192 KB   
150/192 KB   
152/192 KB   
154/192 KB   
156/192 KB   
158/192 KB   
160/192 KB   
162/192 KB   
164/192 KB   
166/192 KB   
168/192 KB   
170/192 KB   
172/192 KB   
174/192 KB   
176/192 KB   
178/192 KB   
180/192 KB   
182/192 KB   
184/192 KB   
186/192 KB   
188/192 KB   
190/192 KB   
192/192 KB   
             
Uploaded: https://repository.apache.org/content/repositories/snapshots/org/apache/tez/tez-mapreduce-examples/0.4.0-incubating-SNAPSHOT/tez-mapreduce-examples-0.4.0-incubating-20140328.195159-52.jar
(192 KB at 401.3 KB/sec)
Uploading: https://repository.apache.org/content/repositories/snapshots/org/apache/tez/tez-mapreduce-examples/0.4.0-incubating-SNAPSHOT/tez-mapreduce-examples-0.4.0-incubating-20140328.195159-52.pom
2/3 KB       
3/3 KB   
         
Uploaded: https://repository.apache.org/content/repositories/snapshots/org/apache/tez/tez-mapreduce-examples/0.4.0-incubating-SNAPSHOT/tez-mapreduce-examples-0.4.0-incubating-20140328.195159-52.pom
(3 KB at 9.2 KB/sec)
Downloading: https://repository.apache.org/content/repositories/snapshots/org/apache/tez/tez-mapreduce-examples/maven-metadata.xml
418/418 B   
            
Downloaded: https://repository.apache.org/content/repositories/snapshots/org/apache/tez/tez-mapreduce-examples/maven-metadata.xml
(418 B at 2.5 KB/sec)
Uploading: https://repository.apache.org/content/repositories/snapshots/org/apache/tez/tez-mapreduce-examples/0.4.0-incubating-SNAPSHOT/maven-metadata.xml
2/2 KB      
         
Uploaded: https://repository.apache.org/content/repositories/snapshots/org/apache/tez/tez-mapreduce-examples/0.4.0-incubating-SNAPSHOT/maven-metadata.xml
(2 KB at 4.2 KB/sec)
Uploading: https://repository.apache.org/content/repositories/snapshots/org/apache/tez/tez-mapreduce-examples/maven-metadata.xml
418/418 B   
            
Uploaded: https://repository.apache.org/content/repositories/snapshots/org/apache/tez/tez-mapreduce-examples/maven-metadata.xml
(418 B at 1.4 KB/sec)
Uploading: https://repository.apache.org/content/repositories/snapshots/org/apache/tez/tez-mapreduce-examples/0.4.0-incubating-SNAPSHOT/tez-mapreduce-examples-0.4.0-incubating-20140328.195159-52-tests.jar
2/5 KB      
4/5 KB   
5/5 KB   
         
Uploaded: https://repository.apache.org/content/repositories/snapshots/org/apache/tez/tez-mapreduce-examples/0.4.0-incubating-SNAPSHOT/tez-mapreduce-examples-0.4.0-incubating-20140328.195159-52-tests.jar
(5 KB at 14.7 KB/sec)
Uploading: https://repository.apache.org/content/repositories/snapshots/org/apache/tez/tez-mapreduce-examples/0.4.0-incubating-SNAPSHOT/maven-metadata.xml
2/2 KB   
         
Uploaded: https://repository.apache.org/content/repositories/snapshots/org/apache/tez/tez-mapreduce-examples/0.4.0-incubating-SNAPSHOT/maven-metadata.xml
(2 KB at 3.4 KB/sec)
[INFO] 
[INFO] --- buildnumber-maven-plugin:1.1:create (default) @ tez-mapreduce-examples ---
[INFO] Checking for local modifications: skipped.
[INFO] Updating project files from SCM: skipped.
[INFO] Executing: /bin/sh -c cd <https://builds.apache.org/job/Tez-Build/ws/tez-mapreduce-examples>
&& git rev-parse --verify HEAD
[INFO] Working directory: <https://builds.apache.org/job/Tez-Build/ws/tez-mapreduce-examples>
[INFO] Storing buildNumber: 6416102f4ffbcde66e3bf4595d268d2539019c2e at timestamp: 1396036321191
[INFO] Executing: /bin/sh -c cd <https://builds.apache.org/job/Tez-Build/ws/tez-mapreduce-examples>
&& git rev-parse --verify HEAD
[INFO] Working directory: <https://builds.apache.org/job/Tez-Build/ws/tez-mapreduce-examples>
[INFO] Storing buildScmBranch: UNKNOWN
[INFO] 
[INFO] --- build-helper-maven-plugin:1.8:maven-version (maven-version) @ tez-mapreduce-examples
---
[INFO] 
[INFO] --- maven-resources-plugin:2.6:resources (default-resources) @ tez-mapreduce-examples
---
[INFO] Using 'UTF-8' encoding to copy filtered resources.
[INFO] skip non existing resourceDirectory <https://builds.apache.org/job/Tez-Build/ws/tez-mapreduce-examples/src/main/resources>
[INFO] 
[INFO] --- maven-compiler-plugin:3.1:compile (default-compile) @ tez-mapreduce-examples ---
[INFO] Nothing to compile - all classes are up to date
[INFO] 
[INFO] --- maven-resources-plugin:2.6:testResources (default-testResources) @ tez-mapreduce-examples
---
[INFO] Using 'UTF-8' encoding to copy filtered resources.
[INFO] skip non existing resourceDirectory <https://builds.apache.org/job/Tez-Build/ws/tez-mapreduce-examples/src/test/resources>
[INFO] 
[INFO] --- maven-compiler-plugin:3.1:testCompile (default-testCompile) @ tez-mapreduce-examples
---
[INFO] Nothing to compile - all classes are up to date
[INFO] 
[INFO] --- maven-surefire-plugin:2.14.1:test (default-test) @ tez-mapreduce-examples ---
[INFO] Skipping execution of surefire because it has already been run for this configuration
[INFO] 
[INFO] --- maven-jar-plugin:2.4:jar (default-jar) @ tez-mapreduce-examples ---
[INFO] Building jar: <https://builds.apache.org/job/Tez-Build/ws/tez-mapreduce-examples/target/tez-mapreduce-examples-0.4.0-incubating-SNAPSHOT.jar>
[INFO] 
[INFO] --- maven-jar-plugin:2.4:test-jar (default) @ tez-mapreduce-examples ---
[INFO] Building jar: <https://builds.apache.org/job/Tez-Build/ws/tez-mapreduce-examples/target/tez-mapreduce-examples-0.4.0-incubating-SNAPSHOT-tests.jar>
[INFO]                                                                         
[INFO] ------------------------------------------------------------------------
[INFO] Building tez-dag 0.4.0-incubating-SNAPSHOT
[INFO] ------------------------------------------------------------------------
[INFO] 
[INFO] --- maven-clean-plugin:2.4.1:clean (default-clean) @ tez-dag ---
[INFO] Deleting <https://builds.apache.org/job/Tez-Build/ws/tez-dag/target>
[INFO] 
[INFO] --- buildnumber-maven-plugin:1.1:create (default) @ tez-dag ---
[INFO] Checking for local modifications: skipped.
[INFO] Updating project files from SCM: skipped.
[INFO] Executing: /bin/sh -c cd <https://builds.apache.org/job/Tez-Build/ws/tez-dag>
&& git rev-parse --verify HEAD
[INFO] Working directory: <https://builds.apache.org/job/Tez-Build/ws/tez-dag>
[INFO] Storing buildNumber: 6416102f4ffbcde66e3bf4595d268d2539019c2e at timestamp: 1396036321712
[INFO] Executing: /bin/sh -c cd <https://builds.apache.org/job/Tez-Build/ws/tez-dag>
&& git rev-parse --verify HEAD
[INFO] Working directory: <https://builds.apache.org/job/Tez-Build/ws/tez-dag>
[INFO] Storing buildScmBranch: UNKNOWN
[INFO] 
[INFO] --- build-helper-maven-plugin:1.8:maven-version (maven-version) @ tez-dag ---
[INFO] 
[INFO] --- hadoop-maven-plugins:2.2.0:protoc (compile-protoc) @ tez-dag ---
[INFO] 
[INFO] --- maven-resources-plugin:2.6:resources (default-resources) @ tez-dag ---
[INFO] Using 'UTF-8' encoding to copy filtered resources.
[INFO] Copying 2 resources
[INFO] 
[INFO] --- maven-compiler-plugin:3.1:compile (default-compile) @ tez-dag ---
[INFO] Changes detected - recompiling the module!
[INFO] Compiling 196 source files to <https://builds.apache.org/job/Tez-Build/ws/tez-dag/target/classes>
[INFO] 
[INFO] --- maven-resources-plugin:2.6:testResources (default-testResources) @ tez-dag ---
[INFO] Using 'UTF-8' encoding to copy filtered resources.
[INFO] Copying 1 resource
[INFO] 
[INFO] --- maven-compiler-plugin:3.1:testCompile (default-testCompile) @ tez-dag ---
[INFO] Changes detected - recompiling the module!
[INFO] Compiling 17 source files to <https://builds.apache.org/job/Tez-Build/ws/tez-dag/target/test-classes>
[WARNING] Note: <https://builds.apache.org/job/Tez-Build/ws/tez-dag/src/test/java/org/apache/tez/dag/app/rm/TestTezAMRMClient.java>
uses unchecked or unsafe operations.
[WARNING] Note: Recompile with -Xlint:unchecked for details.
[INFO] 
[INFO] --- maven-surefire-plugin:2.14.1:test (default-test) @ tez-dag ---
[INFO] Surefire report directory: <https://builds.apache.org/job/Tez-Build/ws/tez-dag/target/surefire-reports>

-------------------------------------------------------
 T E S T S
-------------------------------------------------------

-------------------------------------------------------
 T E S T S
-------------------------------------------------------
Running org.apache.tez.dag.history.events.TestHistoryEventsProtoConversion
Tests run: 1, Failures: 0, Errors: 0, Skipped: 0, Time elapsed: 0.642 sec
Running org.apache.tez.dag.api.client.TestVertexStatusBuilder
Tests run: 1, Failures: 0, Errors: 0, Skipped: 0, Time elapsed: 0.069 sec
Running org.apache.tez.dag.app.rm.container.TestAMContainerMap
Tests run: 1, Failures: 0, Errors: 0, Skipped: 0, Time elapsed: 0.598 sec
Running org.apache.tez.dag.app.rm.container.TestAMContainer
Tests run: 24, Failures: 0, Errors: 0, Skipped: 0, Time elapsed: 0.848 sec
Running org.apache.tez.dag.app.rm.TestContainerReuse
Tests run: 6, Failures: 0, Errors: 0, Skipped: 0, Time elapsed: 19.645 sec
Running org.apache.tez.dag.app.rm.TestTaskScheduler
Tests run: 4, Failures: 0, Errors: 0, Skipped: 0, Time elapsed: 1.396 sec
Running org.apache.tez.dag.app.rm.node.TestAMNodeMap
Tests run: 3, Failures: 0, Errors: 0, Skipped: 0, Time elapsed: 2.226 sec
Running org.apache.tez.dag.app.rm.TestTezAMRMClient
Tests run: 1, Failures: 0, Errors: 0, Skipped: 0, Time elapsed: 0.606 sec
Running org.apache.tez.dag.app.dag.impl.TestTaskAttempt
Tests run: 10, Failures: 0, Errors: 0, Skipped: 0, Time elapsed: 1.338 sec
Running org.apache.tez.dag.app.dag.impl.TestTaskImpl
Tests run: 14, Failures: 0, Errors: 0, Skipped: 0, Time elapsed: 1.271 sec
Running org.apache.tez.dag.app.dag.impl.TestVertexStats
Tests run: 1, Failures: 0, Errors: 0, Skipped: 0, Time elapsed: 0.335 sec
Running org.apache.tez.dag.app.dag.impl.TestVertexImpl
Running org.apache.tez.dag.app.dag.impl.TestDAGScheduler
Tests run: 2, Failures: 0, Errors: 0, Skipped: 1, Time elapsed: 0.518 sec
Running org.apache.tez.dag.app.dag.impl.TestEdge
Tests run: 1, Failures: 0, Errors: 0, Skipped: 0, Time elapsed: 0.587 sec
Running org.apache.tez.dag.app.dag.impl.TestDAGImpl
Tests run: 18, Failures: 0, Errors: 0, Skipped: 2, Time elapsed: 2.281 sec

Results :

Tests run: 87, Failures: 0, Errors: 0, Skipped: 3

[INFO] ------------------------------------------------------------------------
[INFO] Reactor Summary:
[INFO] 
[INFO] tez ............................................... SUCCESS [5.409s]
[INFO] tez-api ........................................... SUCCESS [22.745s]
[INFO] tez-common ........................................ SUCCESS [4.474s]
[INFO] tez-runtime-internals ............................. SUCCESS [10.023s]
[INFO] tez-runtime-library ............................... SUCCESS [9.532s]
[INFO] tez-mapreduce ..................................... SUCCESS [19.202s]
[INFO] tez-mapreduce-examples ............................ SUCCESS [3.832s]
[INFO] tez-dag ........................................... FAILURE [15:38.649s]
[INFO] tez-tests ......................................... SKIPPED
[INFO] tez-dist .......................................... SKIPPED
[INFO] Tez ............................................... SKIPPED
[INFO] ------------------------------------------------------------------------
[INFO] BUILD FAILURE
[INFO] ------------------------------------------------------------------------
[INFO] Total time: 16:54.381s
[INFO] Finished at: Fri Mar 28 20:07:40 UTC 2014
[INFO] Final Memory: 28M/719M
[INFO] ------------------------------------------------------------------------
[ERROR] Failed to execute goal org.apache.maven.plugins:maven-surefire-plugin:2.14.1:test
(default-test) on project tez-dag: There was a timeout or other error in the fork -> [Help
1]
[ERROR] 
[ERROR] To see the full stack trace of the errors, re-run Maven with the -e switch.
[ERROR] Re-run Maven using the -X switch to enable full debug logging.
[ERROR] 
[ERROR] For more information about the errors and possible solutions, please read the following
articles:
[ERROR] [Help 1] http://cwiki.apache.org/confluence/display/MAVEN/MojoFailureException
[ERROR] 
[ERROR] After correcting the problems, you can resume the build with the command
[ERROR]   mvn <goals> -rf :tez-dag
Build step 'Execute shell' marked build as failure
Archiving artifacts
Recording test results

Mime
View raw message