tez-dev mailing list archives

Site index · List index
Message view « Date » · « Thread »
Top « Date » · « Thread »
From Apache Jenkins Server <jenk...@builds.apache.org>
Subject Build failed in Jenkins: Tez-Build #341
Date Wed, 05 Mar 2014 23:06:45 GMT
See <https://builds.apache.org/job/Tez-Build/341/changes>

Changes:

[bikas] TEZ-915. TaskScheduler can get hung when all headroom is used and it cannot utilize
existing new containers (bikas)

------------------------------------------
[...truncated 4133 lines...]
4/6 KB   
6/6 KB   
         
Uploaded: https://repository.apache.org/content/repositories/snapshots/org/apache/tez/tez-dag/0.4.0-incubating-SNAPSHOT/tez-dag-0.4.0-incubating-20140305.225746-13.pom
(6 KB at 13.6 KB/sec)
Downloading: https://repository.apache.org/content/repositories/snapshots/org/apache/tez/tez-dag/maven-metadata.xml
403/403 B   
            
Downloaded: https://repository.apache.org/content/repositories/snapshots/org/apache/tez/tez-dag/maven-metadata.xml
(403 B at 1.5 KB/sec)
Uploading: https://repository.apache.org/content/repositories/snapshots/org/apache/tez/tez-dag/0.4.0-incubating-SNAPSHOT/maven-metadata.xml
2/2 KB      
         
Uploaded: https://repository.apache.org/content/repositories/snapshots/org/apache/tez/tez-dag/0.4.0-incubating-SNAPSHOT/maven-metadata.xml
(2 KB at 3.5 KB/sec)
Uploading: https://repository.apache.org/content/repositories/snapshots/org/apache/tez/tez-dag/maven-metadata.xml
403/403 B   
            
Uploaded: https://repository.apache.org/content/repositories/snapshots/org/apache/tez/tez-dag/maven-metadata.xml
(403 B at 1.1 KB/sec)
Uploading: https://repository.apache.org/content/repositories/snapshots/org/apache/tez/tez-dag/0.4.0-incubating-SNAPSHOT/tez-dag-0.4.0-incubating-20140305.225746-13-tests.jar
2/161 KB    
4/161 KB   
6/161 KB   
8/161 KB   
10/161 KB   
12/161 KB   
14/161 KB   
16/161 KB   
18/161 KB   
20/161 KB   
22/161 KB   
24/161 KB   
26/161 KB   
28/161 KB   
30/161 KB   
32/161 KB   
34/161 KB   
36/161 KB   
38/161 KB   
40/161 KB   
42/161 KB   
44/161 KB   
46/161 KB   
48/161 KB   
50/161 KB   
52/161 KB   
54/161 KB   
56/161 KB   
58/161 KB   
60/161 KB   
62/161 KB   
64/161 KB   
66/161 KB   
68/161 KB   
70/161 KB   
72/161 KB   
74/161 KB   
76/161 KB   
78/161 KB   
80/161 KB   
82/161 KB   
84/161 KB   
86/161 KB   
88/161 KB   
90/161 KB   
92/161 KB   
94/161 KB   
96/161 KB   
98/161 KB   
100/161 KB   
102/161 KB   
104/161 KB   
106/161 KB   
108/161 KB   
110/161 KB   
112/161 KB   
114/161 KB   
116/161 KB   
118/161 KB   
120/161 KB   
122/161 KB   
124/161 KB   
126/161 KB   
128/161 KB   
130/161 KB   
132/161 KB   
134/161 KB   
136/161 KB   
138/161 KB   
140/161 KB   
142/161 KB   
144/161 KB   
146/161 KB   
148/161 KB   
150/161 KB   
152/161 KB   
154/161 KB   
156/161 KB   
158/161 KB   
160/161 KB   
161/161 KB   
             
Uploaded: https://repository.apache.org/content/repositories/snapshots/org/apache/tez/tez-dag/0.4.0-incubating-SNAPSHOT/tez-dag-0.4.0-incubating-20140305.225746-13-tests.jar
(161 KB at 264.3 KB/sec)
Uploading: https://repository.apache.org/content/repositories/snapshots/org/apache/tez/tez-dag/0.4.0-incubating-SNAPSHOT/maven-metadata.xml
2/2 KB       
         
Uploaded: https://repository.apache.org/content/repositories/snapshots/org/apache/tez/tez-dag/0.4.0-incubating-SNAPSHOT/maven-metadata.xml
(2 KB at 2.9 KB/sec)
[INFO] 
[INFO] --- buildnumber-maven-plugin:1.1:create (default) @ tez-dag ---
[INFO] Checking for local modifications: skipped.
[INFO] Updating project files from SCM: skipped.
[INFO] Executing: /bin/sh -c cd <https://builds.apache.org/job/Tez-Build/ws/tez-dag>
&& git rev-parse --verify HEAD
[INFO] Working directory: <https://builds.apache.org/job/Tez-Build/ws/tez-dag>
[INFO] Storing buildNumber: 18290c8489df01f814087673ecdc6b140fbffc44 at timestamp: 1394060269838
[INFO] Executing: /bin/sh -c cd <https://builds.apache.org/job/Tez-Build/ws/tez-dag>
&& git rev-parse --verify HEAD
[INFO] Working directory: <https://builds.apache.org/job/Tez-Build/ws/tez-dag>
[INFO] Storing buildScmBranch: UNKNOWN
[INFO] 
[INFO] --- build-helper-maven-plugin:1.8:maven-version (maven-version) @ tez-dag ---
[INFO] 
[INFO] --- hadoop-maven-plugins:2.2.0:protoc (compile-protoc) @ tez-dag ---
[INFO] 
[INFO] --- maven-resources-plugin:2.6:resources (default-resources) @ tez-dag ---
[INFO] Using 'UTF-8' encoding to copy filtered resources.
[INFO] Copying 2 resources
[INFO] 
[INFO] --- maven-compiler-plugin:3.1:compile (default-compile) @ tez-dag ---
[INFO] Changes detected - recompiling the module!
[INFO] Compiling 187 source files to <https://builds.apache.org/job/Tez-Build/ws/tez-dag/target/classes>
[INFO] 
[INFO] --- maven-resources-plugin:2.6:testResources (default-testResources) @ tez-dag ---
[INFO] Using 'UTF-8' encoding to copy filtered resources.
[INFO] Copying 1 resource
[INFO] 
[INFO] --- maven-compiler-plugin:3.1:testCompile (default-testCompile) @ tez-dag ---
[INFO] Nothing to compile - all classes are up to date
[INFO] 
[INFO] --- maven-surefire-plugin:2.14.1:test (default-test) @ tez-dag ---
[INFO] Skipping execution of surefire because it has already been run for this configuration
[INFO] 
[INFO] --- maven-jar-plugin:2.4:jar (default-jar) @ tez-dag ---
[INFO] Building jar: <https://builds.apache.org/job/Tez-Build/ws/tez-dag/target/tez-dag-0.4.0-incubating-SNAPSHOT.jar>
[INFO] 
[INFO] --- maven-jar-plugin:2.4:test-jar (default) @ tez-dag ---
[INFO] Building jar: <https://builds.apache.org/job/Tez-Build/ws/tez-dag/target/tez-dag-0.4.0-incubating-SNAPSHOT-tests.jar>
[INFO]                                                                         
[INFO] ------------------------------------------------------------------------
[INFO] Building tez-tests 0.4.0-incubating-SNAPSHOT
[INFO] ------------------------------------------------------------------------
[INFO] 
[INFO] --- maven-clean-plugin:2.4.1:clean (default-clean) @ tez-tests ---
[INFO] Deleting <https://builds.apache.org/job/Tez-Build/ws/tez-tests/target>
[INFO] 
[INFO] --- buildnumber-maven-plugin:1.1:create (default) @ tez-tests ---
[INFO] Checking for local modifications: skipped.
[INFO] Updating project files from SCM: skipped.
[INFO] Executing: /bin/sh -c cd <https://builds.apache.org/job/Tez-Build/ws/tez-tests>
&& git rev-parse --verify HEAD
[INFO] Working directory: <https://builds.apache.org/job/Tez-Build/ws/tez-tests>
[INFO] Storing buildNumber: 18290c8489df01f814087673ecdc6b140fbffc44 at timestamp: 1394060273249
[INFO] Executing: /bin/sh -c cd <https://builds.apache.org/job/Tez-Build/ws/tez-tests>
&& git rev-parse --verify HEAD
[INFO] Working directory: <https://builds.apache.org/job/Tez-Build/ws/tez-tests>
[INFO] Storing buildScmBranch: UNKNOWN
[INFO] 
[INFO] --- build-helper-maven-plugin:1.8:maven-version (maven-version) @ tez-tests ---
[INFO] 
[INFO] --- maven-resources-plugin:2.6:resources (default-resources) @ tez-tests ---
[INFO] Using 'UTF-8' encoding to copy filtered resources.
[INFO] skip non existing resourceDirectory <https://builds.apache.org/job/Tez-Build/ws/tez-tests/src/main/resources>
[INFO] 
[INFO] --- maven-compiler-plugin:3.1:compile (default-compile) @ tez-tests ---
[INFO] No sources to compile
[INFO] 
[INFO] --- maven-resources-plugin:2.6:testResources (default-testResources) @ tez-tests ---
[INFO] Using 'UTF-8' encoding to copy filtered resources.
[INFO] skip non existing resourceDirectory <https://builds.apache.org/job/Tez-Build/ws/tez-tests/src/test/resources>
[INFO] 
[INFO] --- maven-compiler-plugin:3.1:testCompile (default-testCompile) @ tez-tests ---
[INFO] Changes detected - recompiling the module!
[INFO] Compiling 17 source files to <https://builds.apache.org/job/Tez-Build/ws/tez-tests/target/test-classes>
[INFO] 
[INFO] --- maven-surefire-plugin:2.14.1:test (default-test) @ tez-tests ---
[INFO] Surefire report directory: <https://builds.apache.org/job/Tez-Build/ws/tez-tests/target/surefire-reports>

-------------------------------------------------------
 T E S T S
-------------------------------------------------------

-------------------------------------------------------
 T E S T S
-------------------------------------------------------
Running org.apache.tez.mapreduce.TestMRRJobsDAGApi
Tests run: 8, Failures: 0, Errors: 0, Skipped: 0, Time elapsed: 148.158 sec
Running org.apache.tez.mapreduce.TestMRRJobs
Tests run: 5, Failures: 0, Errors: 0, Skipped: 0, Time elapsed: 137.882 sec
Running org.apache.tez.test.TestFaultTolerance
Tests run: 20, Failures: 1, Errors: 0, Skipped: 0, Time elapsed: 179.326 sec <<<
FAILURE!
testInputFailureCausesRerunAttemptWithinMaxAttemptSuccess(org.apache.tez.test.TestFaultTolerance)
 Time elapsed: 12.013 sec  <<< FAILURE!
java.lang.AssertionError: expected:<SUCCEEDED> but was:<FAILED>
	at org.junit.Assert.fail(Assert.java:88)
	at org.junit.Assert.failNotEquals(Assert.java:743)
	at org.junit.Assert.assertEquals(Assert.java:118)
	at org.junit.Assert.assertEquals(Assert.java:144)
	at org.apache.tez.test.TestFaultTolerance.runDAGAndVerify(TestFaultTolerance.java:145)
	at org.apache.tez.test.TestFaultTolerance.testInputFailureCausesRerunAttemptWithinMaxAttemptSuccess(TestFaultTolerance.java:452)

Running org.apache.tez.test.TestTezJobs
Tests run: 1, Failures: 0, Errors: 0, Skipped: 0, Time elapsed: 30.523 sec

Results :

Failed tests: 
  TestFaultTolerance.testInputFailureCausesRerunAttemptWithinMaxAttemptSuccess:452->runDAGAndVerify:145
expected:<SUCCEEDED> but was:<FAILED>

Tests run: 34, Failures: 1, Errors: 0, Skipped: 0

[INFO] ------------------------------------------------------------------------
[INFO] Reactor Summary:
[INFO] 
[INFO] tez ............................................... SUCCESS [18.666s]
[INFO] tez-api ........................................... SUCCESS [24.049s]
[INFO] tez-common ........................................ SUCCESS [6.233s]
[INFO] tez-runtime-internals ............................. SUCCESS [11.140s]
[INFO] tez-runtime-library ............................... SUCCESS [10.449s]
[INFO] tez-mapreduce ..................................... SUCCESS [21.828s]
[INFO] tez-mapreduce-examples ............................ SUCCESS [4.663s]
[INFO] tez-dag ........................................... SUCCESS [40.342s]
[INFO] tez-tests ......................................... FAILURE [8:18.454s]
[INFO] tez-dist .......................................... SKIPPED
[INFO] Tez ............................................... SKIPPED
[INFO] ------------------------------------------------------------------------
[INFO] BUILD FAILURE
[INFO] ------------------------------------------------------------------------
[INFO] Total time: 10:36.323s
[INFO] Finished at: Wed Mar 05 23:06:10 UTC 2014
[INFO] Final Memory: 26M/427M
[INFO] ------------------------------------------------------------------------
[ERROR] Failed to execute goal org.apache.maven.plugins:maven-surefire-plugin:2.14.1:test
(default-test) on project tez-tests: There are test failures.
[ERROR] 
[ERROR] Please refer to <https://builds.apache.org/job/Tez-Build/ws/tez-tests/target/surefire-reports>
for the individual test results.
[ERROR] -> [Help 1]
[ERROR] 
[ERROR] To see the full stack trace of the errors, re-run Maven with the -e switch.
[ERROR] Re-run Maven using the -X switch to enable full debug logging.
[ERROR] 
[ERROR] For more information about the errors and possible solutions, please read the following
articles:
[ERROR] [Help 1] http://cwiki.apache.org/confluence/display/MAVEN/MojoFailureException
[ERROR] 
[ERROR] After correcting the problems, you can resume the build with the command
[ERROR]   mvn <goals> -rf :tez-tests
Build step 'Execute shell' marked build as failure
Archiving artifacts
Recording test results

Mime
View raw message