tez-dev mailing list archives

Site index · List index
Message view « Date » · « Thread »
Top « Date » · « Thread »
From Apache Jenkins Server <jenk...@builds.apache.org>
Subject Build failed in Jenkins: Tez-Build #423
Date Fri, 02 May 2014 04:55:22 GMT
See <https://builds.apache.org/job/Tez-Build/423/changes>

Changes:

[sseth] TEZ-1002. Generate Container Stop history events. Contributed by Gopal

[sseth] TEZ-661. Add an implementation for a non sorted, partitioned, key-value

------------------------------------------
[...truncated 1651 lines...]
       
Uploaded: https://repository.apache.org/content/repositories/snapshots/org/apache/tez/tez-mapreduce-examples/0.5.0-incubating-SNAPSHOT/tez-mapreduce-examples-0.5.0-incubating-20140502.045339-29.pom
(3 KB at 23.2 KB/sec)
Downloading: https://repository.apache.org/content/repositories/snapshots/org/apache/tez/tez-mapreduce-examples/maven-metadata.xml
418 B   
        
Downloaded: https://repository.apache.org/content/repositories/snapshots/org/apache/tez/tez-mapreduce-examples/maven-metadata.xml
(418 B at 3.6 KB/sec)
Uploading: https://repository.apache.org/content/repositories/snapshots/org/apache/tez/tez-mapreduce-examples/0.5.0-incubating-SNAPSHOT/maven-metadata.xml
2 KB    
       
Uploaded: https://repository.apache.org/content/repositories/snapshots/org/apache/tez/tez-mapreduce-examples/0.5.0-incubating-SNAPSHOT/maven-metadata.xml
(2 KB at 8.3 KB/sec)
Uploading: https://repository.apache.org/content/repositories/snapshots/org/apache/tez/tez-mapreduce-examples/maven-metadata.xml
418 B   
        
Uploaded: https://repository.apache.org/content/repositories/snapshots/org/apache/tez/tez-mapreduce-examples/maven-metadata.xml
(418 B at 3.4 KB/sec)
Uploading: https://repository.apache.org/content/repositories/snapshots/org/apache/tez/tez-mapreduce-examples/0.5.0-incubating-SNAPSHOT/tez-mapreduce-examples-0.5.0-incubating-20140502.045339-29-tests.jar
4 KB    
5 KB   
       
Uploaded: https://repository.apache.org/content/repositories/snapshots/org/apache/tez/tez-mapreduce-examples/0.5.0-incubating-SNAPSHOT/tez-mapreduce-examples-0.5.0-incubating-20140502.045339-29-tests.jar
(5 KB at 38.2 KB/sec)
Uploading: https://repository.apache.org/content/repositories/snapshots/org/apache/tez/tez-mapreduce-examples/0.5.0-incubating-SNAPSHOT/maven-metadata.xml
2 KB   
       
Uploaded: https://repository.apache.org/content/repositories/snapshots/org/apache/tez/tez-mapreduce-examples/0.5.0-incubating-SNAPSHOT/maven-metadata.xml
(2 KB at 8.4 KB/sec)
[INFO] 
[INFO] --- buildnumber-maven-plugin:1.1:create (default) @ tez-mapreduce-examples ---
[INFO] Checking for local modifications: skipped.
[INFO] Updating project files from SCM: skipped.
[INFO] Executing: /bin/sh -c cd <https://builds.apache.org/job/Tez-Build/ws/tez-mapreduce-examples>
&& git rev-parse --verify HEAD
[INFO] Working directory: <https://builds.apache.org/job/Tez-Build/ws/tez-mapreduce-examples>
[INFO] Storing buildNumber: 26ad7037c3c01347be63ad33810faee0a3922a94 at timestamp: 1399006420497
[INFO] Executing: /bin/sh -c cd <https://builds.apache.org/job/Tez-Build/ws/tez-mapreduce-examples>
&& git rev-parse --verify HEAD
[INFO] Working directory: <https://builds.apache.org/job/Tez-Build/ws/tez-mapreduce-examples>
[INFO] Storing buildScmBranch: UNKNOWN
[INFO] 
[INFO] --- build-helper-maven-plugin:1.8:maven-version (maven-version) @ tez-mapreduce-examples
---
[INFO] 
[INFO] --- maven-resources-plugin:2.6:resources (default-resources) @ tez-mapreduce-examples
---
[INFO] Using 'UTF-8' encoding to copy filtered resources.
[INFO] skip non existing resourceDirectory <https://builds.apache.org/job/Tez-Build/ws/tez-mapreduce-examples/src/main/resources>
[INFO] 
[INFO] --- maven-compiler-plugin:3.1:compile (default-compile) @ tez-mapreduce-examples ---
[INFO] Nothing to compile - all classes are up to date
[INFO] 
[INFO] --- maven-resources-plugin:2.6:testResources (default-testResources) @ tez-mapreduce-examples
---
[INFO] Using 'UTF-8' encoding to copy filtered resources.
[INFO] skip non existing resourceDirectory <https://builds.apache.org/job/Tez-Build/ws/tez-mapreduce-examples/src/test/resources>
[INFO] 
[INFO] --- maven-compiler-plugin:3.1:testCompile (default-testCompile) @ tez-mapreduce-examples
---
[INFO] Nothing to compile - all classes are up to date
[INFO] 
[INFO] --- maven-surefire-plugin:2.14.1:test (default-test) @ tez-mapreduce-examples ---
[INFO] Skipping execution of surefire because it has already been run for this configuration
[INFO] 
[INFO] --- maven-jar-plugin:2.4:jar (default-jar) @ tez-mapreduce-examples ---
[INFO] Building jar: <https://builds.apache.org/job/Tez-Build/ws/tez-mapreduce-examples/target/tez-mapreduce-examples-0.5.0-incubating-SNAPSHOT.jar>
[INFO] 
[INFO] --- maven-jar-plugin:2.4:test-jar (default) @ tez-mapreduce-examples ---
[INFO] Building jar: <https://builds.apache.org/job/Tez-Build/ws/tez-mapreduce-examples/target/tez-mapreduce-examples-0.5.0-incubating-SNAPSHOT-tests.jar>
[INFO]                                                                         
[INFO] ------------------------------------------------------------------------
[INFO] Building tez-dag 0.5.0-incubating-SNAPSHOT
[INFO] ------------------------------------------------------------------------
[INFO] 
[INFO] --- maven-clean-plugin:2.4.1:clean (default-clean) @ tez-dag ---
[INFO] Deleting <https://builds.apache.org/job/Tez-Build/ws/tez-dag/target>
[INFO] 
[INFO] --- buildnumber-maven-plugin:1.1:create (default) @ tez-dag ---
[INFO] Checking for local modifications: skipped.
[INFO] Updating project files from SCM: skipped.
[INFO] Executing: /bin/sh -c cd <https://builds.apache.org/job/Tez-Build/ws/tez-dag>
&& git rev-parse --verify HEAD
[INFO] Working directory: <https://builds.apache.org/job/Tez-Build/ws/tez-dag>
[INFO] Storing buildNumber: 26ad7037c3c01347be63ad33810faee0a3922a94 at timestamp: 1399006421994
[INFO] Executing: /bin/sh -c cd <https://builds.apache.org/job/Tez-Build/ws/tez-dag>
&& git rev-parse --verify HEAD
[INFO] Working directory: <https://builds.apache.org/job/Tez-Build/ws/tez-dag>
[INFO] Storing buildScmBranch: UNKNOWN
[INFO] 
[INFO] --- build-helper-maven-plugin:1.8:maven-version (maven-version) @ tez-dag ---
[INFO] 
[INFO] --- hadoop-maven-plugins:2.2.0:protoc (compile-protoc) @ tez-dag ---
[INFO] 
[INFO] --- maven-resources-plugin:2.6:resources (default-resources) @ tez-dag ---
[INFO] Using 'UTF-8' encoding to copy filtered resources.
[INFO] Copying 1 resource
[INFO] 
[INFO] --- maven-compiler-plugin:3.1:compile (default-compile) @ tez-dag ---
[INFO] Changes detected - recompiling the module!
[INFO] Compiling 200 source files to <https://builds.apache.org/job/Tez-Build/ws/tez-dag/target/classes>
[INFO] 
[INFO] --- maven-resources-plugin:2.6:testResources (default-testResources) @ tez-dag ---
[INFO] Using 'UTF-8' encoding to copy filtered resources.
[INFO] Copying 1 resource
[INFO] 
[INFO] --- maven-compiler-plugin:3.1:testCompile (default-testCompile) @ tez-dag ---
[INFO] Changes detected - recompiling the module!
[INFO] Compiling 18 source files to <https://builds.apache.org/job/Tez-Build/ws/tez-dag/target/test-classes>
[WARNING] Note: <https://builds.apache.org/job/Tez-Build/ws/tez-dag/src/test/java/org/apache/tez/dag/app/rm/TestTezAMRMClient.java>
uses unchecked or unsafe operations.
[WARNING] Note: Recompile with -Xlint:unchecked for details.
[INFO] 
[INFO] --- maven-surefire-plugin:2.14.1:test (default-test) @ tez-dag ---
[INFO] Surefire report directory: <https://builds.apache.org/job/Tez-Build/ws/tez-dag/target/surefire-reports>

-------------------------------------------------------
 T E S T S
-------------------------------------------------------

-------------------------------------------------------
 T E S T S
-------------------------------------------------------
Running org.apache.tez.dag.api.client.TestVertexStatusBuilder
Tests run: 1, Failures: 0, Errors: 0, Skipped: 0, Time elapsed: 0.1 sec
Running org.apache.tez.dag.app.rm.TestContainerReuse
Tests run: 6, Failures: 1, Errors: 0, Skipped: 0, Time elapsed: 20.976 sec <<< FAILURE!
testReuseAcrossVertices(org.apache.tez.dag.app.rm.TestContainerReuse)  Time elapsed: 6.084
sec  <<< FAILURE!
org.mockito.exceptions.verification.WantedButNotInvoked: 
Wanted but not invoked:
aMRMClientAsyncForTest.releaseAssignedContainer(
    container_1_0001_01_000001
);
-> at org.apache.tez.dag.app.rm.TestContainerReuse.testReuseAcrossVertices(TestContainerReuse.java:727)

However, there were other interactions with this mock:
-> at org.apache.tez.dag.app.rm.TestContainerReuse.testReuseAcrossVertices(TestContainerReuse.java:655)
-> at org.apache.tez.dag.app.rm.TestContainerReuse.testReuseAcrossVertices(TestContainerReuse.java:655)
-> at org.apache.tez.dag.app.rm.TestContainerReuse.testReuseAcrossVertices(TestContainerReuse.java:655)
-> at org.apache.tez.dag.app.rm.TestContainerReuse.testReuseAcrossVertices(TestContainerReuse.java:655)
-> at org.apache.tez.dag.app.rm.TestContainerReuse.testReuseAcrossVertices(TestContainerReuse.java:655)
-> at org.apache.tez.dag.app.rm.TestContainerReuse.testReuseAcrossVertices(TestContainerReuse.java:655)
-> at org.apache.tez.dag.app.rm.TestContainerReuse.testReuseAcrossVertices(TestContainerReuse.java:655)
-> at org.apache.tez.dag.app.rm.TestContainerReuse.testReuseAcrossVertices(TestContainerReuse.java:693)
-> at org.apache.tez.dag.app.rm.TaskScheduler.assignReUsedContainerWithLocation(TaskScheduler.java:1298)
-> at org.apache.tez.dag.app.rm.TaskScheduler.getMatchingRequestWithoutPriority(TaskScheduler.java:1089)
-> at org.apache.tez.dag.app.rm.TaskScheduler.getMatchingRequestWithoutPriority(TaskScheduler.java:1089)
-> at org.apache.tez.dag.app.rm.TaskScheduler.removeTaskRequest(TaskScheduler.java:1215)
-> at org.apache.tez.dag.app.rm.TestContainerReuse.testReuseAcrossVertices(TestContainerReuse.java:706)
-> at org.apache.tez.dag.app.rm.TestContainerReuse.testReuseAcrossVertices(TestContainerReuse.java:710)
-> at org.apache.tez.dag.app.rm.TestContainerReuse.testReuseAcrossVertices(TestContainerReuse.java:710)
-> at org.apache.tez.dag.app.rm.TestContainerReuse.testReuseAcrossVertices(TestContainerReuse.java:710)
-> at org.apache.tez.dag.app.rm.TestContainerReuse.testReuseAcrossVertices(TestContainerReuse.java:710)

	at org.apache.tez.dag.app.rm.TestContainerReuse.testReuseAcrossVertices(TestContainerReuse.java:727)

Running org.apache.tez.dag.app.rm.container.TestAMContainer
Tests run: 24, Failures: 0, Errors: 0, Skipped: 0, Time elapsed: 2.27 sec
Running org.apache.tez.dag.app.rm.container.TestAMContainerMap
Tests run: 1, Failures: 0, Errors: 0, Skipped: 0, Time elapsed: 1.476 sec
Running org.apache.tez.dag.app.rm.node.TestAMNodeMap
Tests run: 3, Failures: 0, Errors: 0, Skipped: 0, Time elapsed: 2.839 sec
Running org.apache.tez.dag.app.rm.TestTezAMRMClient
Tests run: 1, Failures: 0, Errors: 0, Skipped: 0, Time elapsed: 0.986 sec
Running org.apache.tez.dag.app.rm.TestTaskScheduler
Tests run: 4, Failures: 0, Errors: 1, Skipped: 0, Time elapsed: 11.916 sec <<< FAILURE!
testTaskSchedulerWithReuse(org.apache.tez.dag.app.rm.TestTaskScheduler)  Time elapsed: 10.009
sec  <<< ERROR!
java.lang.Exception: test timed out after 10000 milliseconds
	at java.lang.Object.wait(Native Method)
	at java.lang.Object.wait(Object.java:485)
	at org.apache.tez.dag.app.rm.TestTaskSchedulerHelpers.waitForDelayedDrainNotify(TestTaskSchedulerHelpers.java:376)
	at org.apache.tez.dag.app.rm.TestTaskScheduler.testTaskSchedulerWithReuse(TestTaskScheduler.java:812)

Running org.apache.tez.dag.app.rm.TestLocalTaskScheduler
Tests run: 1, Failures: 0, Errors: 0, Skipped: 0, Time elapsed: 0.754 sec
Running org.apache.tez.dag.app.dag.impl.TestDAGImpl
Tests run: 19, Failures: 0, Errors: 0, Skipped: 2, Time elapsed: 4.222 sec
Running org.apache.tez.dag.app.dag.impl.TestVertexStats
Tests run: 1, Failures: 0, Errors: 0, Skipped: 0, Time elapsed: 0.562 sec
Running org.apache.tez.dag.app.dag.impl.TestTaskAttempt
Tests run: 10, Failures: 0, Errors: 0, Skipped: 0, Time elapsed: 2.676 sec
Running org.apache.tez.dag.app.dag.impl.TestEdge
Tests run: 1, Failures: 0, Errors: 0, Skipped: 0, Time elapsed: 1.058 sec
Running org.apache.tez.dag.app.dag.impl.TestVertexImpl
Tests run: 39, Failures: 0, Errors: 0, Skipped: 1, Time elapsed: 5.733 sec
Running org.apache.tez.dag.app.dag.impl.TestTaskImpl
Tests run: 14, Failures: 0, Errors: 0, Skipped: 0, Time elapsed: 2.036 sec
Running org.apache.tez.dag.app.dag.impl.TestDAGScheduler
Tests run: 2, Failures: 0, Errors: 0, Skipped: 1, Time elapsed: 0.896 sec
Running org.apache.tez.dag.history.events.TestHistoryEventsProtoConversion
Tests run: 1, Failures: 0, Errors: 0, Skipped: 0, Time elapsed: 1.236 sec

Results :

Failed tests: 
  TestContainerReuse.testReuseAcrossVertices:727 
Wanted but not invoked:
aMRMClientAsyncForTest.releaseAssignedContainer(
    container_1_0001_01_000001
);
-> at org.apache.tez.dag.app.rm.TestContainerReuse.testReuseAcrossVertices(TestContainerReuse.java:727)

However, there were other interactions with this mock:
-> at org.apache.tez.dag.app.rm.TestContainerReuse.testReuseAcrossVertices(TestContainerReuse.java:655)
-> at org.apache.tez.dag.app.rm.TestContainerReuse.testReuseAcrossVertices(TestContainerReuse.java:655)
-> at org.apache.tez.dag.app.rm.TestContainerReuse.testReuseAcrossVertices(TestContainerReuse.java:655)
-> at org.apache.tez.dag.app.rm.TestContainerReuse.testReuseAcrossVertices(TestContainerReuse.java:655)
-> at org.apache.tez.dag.app.rm.TestContainerReuse.testReuseAcrossVertices(TestContainerReuse.java:655)
-> at org.apache.tez.dag.app.rm.TestContainerReuse.testReuseAcrossVertices(TestContainerReuse.java:655)
-> at org.apache.tez.dag.app.rm.TestContainerReuse.testReuseAcrossVertices(TestContainerReuse.java:655)
-> at org.apache.tez.dag.app.rm.TestContainerReuse.testReuseAcrossVertices(TestContainerReuse.java:693)
-> at org.apache.tez.dag.app.rm.TaskScheduler.assignReUsedContainerWithLocation(TaskScheduler.java:1298)
-> at org.apache.tez.dag.app.rm.TaskScheduler.getMatchingRequestWithoutPriority(TaskScheduler.java:1089)
-> at org.apache.tez.dag.app.rm.TaskScheduler.getMatchingRequestWithoutPriority(TaskScheduler.java:1089)
-> at org.apache.tez.dag.app.rm.TaskScheduler.removeTaskRequest(TaskScheduler.java:1215)
-> at org.apache.tez.dag.app.rm.TestContainerReuse.testReuseAcrossVertices(TestContainerReuse.java:706)
-> at org.apache.tez.dag.app.rm.TestContainerReuse.testReuseAcrossVertices(TestContainerReuse.java:710)
-> at org.apache.tez.dag.app.rm.TestContainerReuse.testReuseAcrossVertices(TestContainerReuse.java:710)
-> at org.apache.tez.dag.app.rm.TestContainerReuse.testReuseAcrossVertices(TestContainerReuse.java:710)
-> at org.apache.tez.dag.app.rm.TestContainerReuse.testReuseAcrossVertices(TestContainerReuse.java:710)


Tests in error: 
  TestTaskScheduler.testTaskSchedulerWithReuse:812->Object.wait:485->Object.wait:-2
ยป 

Tests run: 128, Failures: 1, Errors: 1, Skipped: 4

[INFO] ------------------------------------------------------------------------
[INFO] Reactor Summary:
[INFO] 
[INFO] tez ............................................... SUCCESS [13.136s]
[INFO] tez-api ........................................... SUCCESS [52.858s]
[INFO] tez-common ........................................ SUCCESS [9.564s]
[INFO] tez-runtime-internals ............................. SUCCESS [16.092s]
[INFO] tez-runtime-library ............................... SUCCESS [28.538s]
[INFO] tez-mapreduce ..................................... SUCCESS [36.019s]
[INFO] tez-mapreduce-examples ............................ SUCCESS [4.042s]
[INFO] tez-dag ........................................... FAILURE [1:14.895s]
[INFO] tez-tests ......................................... SKIPPED
[INFO] tez-dist .......................................... SKIPPED
[INFO] Tez ............................................... SKIPPED
[INFO] ------------------------------------------------------------------------
[INFO] BUILD FAILURE
[INFO] ------------------------------------------------------------------------
[INFO] Total time: 3:55.986s
[INFO] Finished at: Fri May 02 04:54:55 UTC 2014
[INFO] Final Memory: 25M/767M
[INFO] ------------------------------------------------------------------------
[ERROR] Failed to execute goal org.apache.maven.plugins:maven-surefire-plugin:2.14.1:test
(default-test) on project tez-dag: There are test failures.
[ERROR] 
[ERROR] Please refer to <https://builds.apache.org/job/Tez-Build/ws/tez-dag/target/surefire-reports>
for the individual test results.
[ERROR] -> [Help 1]
[ERROR] 
[ERROR] To see the full stack trace of the errors, re-run Maven with the -e switch.
[ERROR] Re-run Maven using the -X switch to enable full debug logging.
[ERROR] 
[ERROR] For more information about the errors and possible solutions, please read the following
articles:
[ERROR] [Help 1] http://cwiki.apache.org/confluence/display/MAVEN/MojoFailureException
[ERROR] 
[ERROR] After correcting the problems, you can resume the build with the command
[ERROR]   mvn <goals> -rf :tez-dag
Build step 'Execute shell' marked build as failure
Archiving artifacts
Recording test results

Mime
View raw message