tez-dev mailing list archives

Site index · List index
Message view « Date » · « Thread »
Top « Date » · « Thread »
From Apache Jenkins Server <jenk...@builds.apache.org>
Subject Build failed in Jenkins: Tez-Build #538
Date Fri, 01 Aug 2014 21:54:01 GMT
See <https://builds.apache.org/job/Tez-Build/538/changes>

Changes:

[sseth] TEZ-1342. Fix a bug which caused tez.am.client.am.port-range to not take

[sseth] TEZ-1355. Read host and shuffle meta-information for events only if data is

------------------------------------------
[...truncated 1359 lines...]
[INFO] Executing: /bin/sh -c cd <https://builds.apache.org/job/Tez-Build/ws/tez-plugins>
&& git rev-parse --verify HEAD
[INFO] Working directory: <https://builds.apache.org/job/Tez-Build/ws/tez-plugins>
[INFO] Storing buildNumber: c38d3127ac3c2335fa7961e7a2395e4c5aba72d8 at timestamp: 1406929936008
[INFO] Executing: /bin/sh -c cd <https://builds.apache.org/job/Tez-Build/ws/tez-plugins>
&& git rev-parse --verify HEAD
[INFO] Working directory: <https://builds.apache.org/job/Tez-Build/ws/tez-plugins>
[INFO] Storing buildScmBranch: UNKNOWN
[INFO] 
[INFO] --- build-helper-maven-plugin:1.8:maven-version (maven-version) @ tez-plugins ---
[INFO] 
[INFO] --- maven-jar-plugin:2.4:test-jar (default) @ tez-plugins ---
[WARNING] JAR will be empty - no content was marked for inclusion!
[INFO]                                                                         
[INFO] ------------------------------------------------------------------------
[INFO] Building tez-yarn-timeline-history 0.5.0-SNAPSHOT
[INFO] ------------------------------------------------------------------------
[INFO] 
[INFO] --- maven-clean-plugin:2.5:clean (default-clean) @ tez-yarn-timeline-history ---
[INFO] Deleting <https://builds.apache.org/job/Tez-Build/ws/tez-plugins/tez-yarn-timeline-history/target>
[INFO] 
[INFO] --- buildnumber-maven-plugin:1.1:create (default) @ tez-yarn-timeline-history ---
[INFO] Checking for local modifications: skipped.
[INFO] Updating project files from SCM: skipped.
[INFO] Executing: /bin/sh -c cd <https://builds.apache.org/job/Tez-Build/ws/tez-plugins/tez-yarn-timeline-history>
&& git rev-parse --verify HEAD
[INFO] Working directory: <https://builds.apache.org/job/Tez-Build/ws/tez-plugins/tez-yarn-timeline-history>
[INFO] Storing buildNumber: c38d3127ac3c2335fa7961e7a2395e4c5aba72d8 at timestamp: 1406929936082
[INFO] Executing: /bin/sh -c cd <https://builds.apache.org/job/Tez-Build/ws/tez-plugins/tez-yarn-timeline-history>
&& git rev-parse --verify HEAD
[INFO] Working directory: <https://builds.apache.org/job/Tez-Build/ws/tez-plugins/tez-yarn-timeline-history>
[INFO] Storing buildScmBranch: UNKNOWN
[INFO] 
[INFO] --- build-helper-maven-plugin:1.8:maven-version (maven-version) @ tez-yarn-timeline-history
---
[INFO] 
[INFO] --- maven-resources-plugin:2.6:resources (default-resources) @ tez-yarn-timeline-history
---
[INFO] Using 'UTF-8' encoding to copy filtered resources.
[INFO] skip non existing resourceDirectory <https://builds.apache.org/job/Tez-Build/ws/tez-plugins/tez-yarn-timeline-history/src/main/resources>
[INFO] 
[INFO] --- maven-compiler-plugin:3.1:compile (default-compile) @ tez-yarn-timeline-history
---
[INFO] Changes detected - recompiling the module!
[INFO] Compiling 2 source files to <https://builds.apache.org/job/Tez-Build/ws/tez-plugins/tez-yarn-timeline-history/target/classes>
[INFO] 
[INFO] --- maven-resources-plugin:2.6:testResources (default-testResources) @ tez-yarn-timeline-history
---
[INFO] Using 'UTF-8' encoding to copy filtered resources.
[INFO] skip non existing resourceDirectory <https://builds.apache.org/job/Tez-Build/ws/tez-plugins/tez-yarn-timeline-history/src/test/resources>
[INFO] 
[INFO] --- maven-compiler-plugin:3.1:testCompile (default-testCompile) @ tez-yarn-timeline-history
---
[INFO] Changes detected - recompiling the module!
[INFO] Compiling 2 source files to <https://builds.apache.org/job/Tez-Build/ws/tez-plugins/tez-yarn-timeline-history/target/test-classes>
[INFO] 
[INFO] --- maven-surefire-plugin:2.14.1:test (default-test) @ tez-yarn-timeline-history ---
[INFO] Surefire report directory: <https://builds.apache.org/job/Tez-Build/ws/tez-plugins/tez-yarn-timeline-history/target/surefire-reports>

-------------------------------------------------------
 T E S T S
-------------------------------------------------------

-------------------------------------------------------
 T E S T S
-------------------------------------------------------
Running org.apache.tez.dag.history.logging.ats.TestHistoryEventTimelineConversion
Tests run: 1, Failures: 0, Errors: 0, Skipped: 0, Time elapsed: 0.378 sec
Running org.apache.tez.dag.history.logging.ats.TestATSHistoryLoggingService
Tests run: 1, Failures: 0, Errors: 0, Skipped: 0, Time elapsed: 4.515 sec

Results :

Tests run: 2, Failures: 0, Errors: 0, Skipped: 0

[INFO] 
[INFO] --- buildnumber-maven-plugin:1.1:create (default) @ tez-yarn-timeline-history ---
[INFO] Checking for local modifications: skipped.
[INFO] Updating project files from SCM: skipped.
[INFO] Executing: /bin/sh -c cd <https://builds.apache.org/job/Tez-Build/ws/tez-plugins/tez-yarn-timeline-history>
&& git rev-parse --verify HEAD
[INFO] Working directory: <https://builds.apache.org/job/Tez-Build/ws/tez-plugins/tez-yarn-timeline-history>
[INFO] Storing buildNumber: c38d3127ac3c2335fa7961e7a2395e4c5aba72d8 at timestamp: 1406929941530
[INFO] Executing: /bin/sh -c cd <https://builds.apache.org/job/Tez-Build/ws/tez-plugins/tez-yarn-timeline-history>
&& git rev-parse --verify HEAD
[INFO] Working directory: <https://builds.apache.org/job/Tez-Build/ws/tez-plugins/tez-yarn-timeline-history>
[INFO] Storing buildScmBranch: UNKNOWN
[INFO] 
[INFO] --- build-helper-maven-plugin:1.8:maven-version (maven-version) @ tez-yarn-timeline-history
---
[INFO] 
[INFO] --- maven-resources-plugin:2.6:resources (default-resources) @ tez-yarn-timeline-history
---
[INFO] Using 'UTF-8' encoding to copy filtered resources.
[INFO] skip non existing resourceDirectory <https://builds.apache.org/job/Tez-Build/ws/tez-plugins/tez-yarn-timeline-history/src/main/resources>
[INFO] 
[INFO] --- maven-compiler-plugin:3.1:compile (default-compile) @ tez-yarn-timeline-history
---
[INFO] Nothing to compile - all classes are up to date
[INFO] 
[INFO] --- maven-resources-plugin:2.6:testResources (default-testResources) @ tez-yarn-timeline-history
---
[INFO] Using 'UTF-8' encoding to copy filtered resources.
[INFO] skip non existing resourceDirectory <https://builds.apache.org/job/Tez-Build/ws/tez-plugins/tez-yarn-timeline-history/src/test/resources>
[INFO] 
[INFO] --- maven-compiler-plugin:3.1:testCompile (default-testCompile) @ tez-yarn-timeline-history
---
[INFO] Nothing to compile - all classes are up to date
[INFO] 
[INFO] --- maven-surefire-plugin:2.14.1:test (default-test) @ tez-yarn-timeline-history ---
[INFO] Skipping execution of surefire because it has already been run for this configuration
[INFO] 
[INFO] --- maven-jar-plugin:2.4:jar (default-jar) @ tez-yarn-timeline-history ---
[INFO] Building jar: <https://builds.apache.org/job/Tez-Build/ws/tez-plugins/tez-yarn-timeline-history/target/tez-yarn-timeline-history-0.5.0-SNAPSHOT.jar>
[INFO] 
[INFO] --- maven-jar-plugin:2.4:test-jar (default) @ tez-yarn-timeline-history ---
[INFO] Building jar: <https://builds.apache.org/job/Tez-Build/ws/tez-plugins/tez-yarn-timeline-history/target/tez-yarn-timeline-history-0.5.0-SNAPSHOT-tests.jar>
[INFO] 
[INFO] --- maven-install-plugin:2.4:install (default-install) @ tez-yarn-timeline-history
---
[INFO] Installing <https://builds.apache.org/job/Tez-Build/ws/tez-plugins/tez-yarn-timeline-history/target/tez-yarn-timeline-history-0.5.0-SNAPSHOT.jar>
to /home/jenkins/.m2/repository/org/apache/tez/tez-yarn-timeline-history/0.5.0-SNAPSHOT/tez-yarn-timeline-history-0.5.0-SNAPSHOT.jar
[INFO] Installing <https://builds.apache.org/job/Tez-Build/ws/tez-plugins/tez-yarn-timeline-history/pom.xml>
to /home/jenkins/.m2/repository/org/apache/tez/tez-yarn-timeline-history/0.5.0-SNAPSHOT/tez-yarn-timeline-history-0.5.0-SNAPSHOT.pom
[INFO] Installing <https://builds.apache.org/job/Tez-Build/ws/tez-plugins/tez-yarn-timeline-history/target/tez-yarn-timeline-history-0.5.0-SNAPSHOT-tests.jar>
to /home/jenkins/.m2/repository/org/apache/tez/tez-yarn-timeline-history/0.5.0-SNAPSHOT/tez-yarn-timeline-history-0.5.0-SNAPSHOT-tests.jar
[INFO] 
[INFO] --- maven-deploy-plugin:2.8.1:deploy (default-deploy) @ tez-yarn-timeline-history ---
[INFO] Deploying org.apache.tez:tez-yarn-timeline-history:0.5.0-SNAPSHOT at end
[INFO] 
[INFO] --- buildnumber-maven-plugin:1.1:create (default) @ tez-yarn-timeline-history ---
[INFO] Checking for local modifications: skipped.
[INFO] Updating project files from SCM: skipped.
[INFO] Executing: /bin/sh -c cd <https://builds.apache.org/job/Tez-Build/ws/tez-plugins/tez-yarn-timeline-history>
&& git rev-parse --verify HEAD
[INFO] Working directory: <https://builds.apache.org/job/Tez-Build/ws/tez-plugins/tez-yarn-timeline-history>
[INFO] Storing buildNumber: c38d3127ac3c2335fa7961e7a2395e4c5aba72d8 at timestamp: 1406929941630
[INFO] Executing: /bin/sh -c cd <https://builds.apache.org/job/Tez-Build/ws/tez-plugins/tez-yarn-timeline-history>
&& git rev-parse --verify HEAD
[INFO] Working directory: <https://builds.apache.org/job/Tez-Build/ws/tez-plugins/tez-yarn-timeline-history>
[INFO] Storing buildScmBranch: UNKNOWN
[INFO] 
[INFO] --- build-helper-maven-plugin:1.8:maven-version (maven-version) @ tez-yarn-timeline-history
---
[INFO] 
[INFO] --- maven-resources-plugin:2.6:resources (default-resources) @ tez-yarn-timeline-history
---
[INFO] Using 'UTF-8' encoding to copy filtered resources.
[INFO] skip non existing resourceDirectory <https://builds.apache.org/job/Tez-Build/ws/tez-plugins/tez-yarn-timeline-history/src/main/resources>
[INFO] 
[INFO] --- maven-compiler-plugin:3.1:compile (default-compile) @ tez-yarn-timeline-history
---
[INFO] Nothing to compile - all classes are up to date
[INFO] 
[INFO] --- maven-resources-plugin:2.6:testResources (default-testResources) @ tez-yarn-timeline-history
---
[INFO] Using 'UTF-8' encoding to copy filtered resources.
[INFO] skip non existing resourceDirectory <https://builds.apache.org/job/Tez-Build/ws/tez-plugins/tez-yarn-timeline-history/src/test/resources>
[INFO] 
[INFO] --- maven-compiler-plugin:3.1:testCompile (default-testCompile) @ tez-yarn-timeline-history
---
[INFO] Nothing to compile - all classes are up to date
[INFO] 
[INFO] --- maven-surefire-plugin:2.14.1:test (default-test) @ tez-yarn-timeline-history ---
[INFO] Skipping execution of surefire because it has already been run for this configuration
[INFO] 
[INFO] --- maven-jar-plugin:2.4:jar (default-jar) @ tez-yarn-timeline-history ---
[INFO] 
[INFO] --- maven-jar-plugin:2.4:test-jar (default) @ tez-yarn-timeline-history ---
[INFO]                                                                         
[INFO] ------------------------------------------------------------------------
[INFO] Skipping tez-dist
[INFO] This project has been banned from the build due to previous failures.
[INFO] ------------------------------------------------------------------------
[INFO]                                                                         
[INFO] ------------------------------------------------------------------------
[INFO] Building Tez 0.5.0-SNAPSHOT
[INFO] ------------------------------------------------------------------------
[INFO] 
[INFO] --- maven-clean-plugin:2.5:clean (default-clean) @ tez-docs ---
[INFO] Deleting <https://builds.apache.org/job/Tez-Build/ws/docs/target>
[INFO] 
[INFO] --- buildnumber-maven-plugin:1.1:create (default) @ tez-docs ---
[INFO] Checking for local modifications: skipped.
[INFO] Updating project files from SCM: skipped.
[INFO] Executing: /bin/sh -c cd <https://builds.apache.org/job/Tez-Build/ws/docs> &&
git rev-parse --verify HEAD
[INFO] Working directory: <https://builds.apache.org/job/Tez-Build/ws/docs>
[INFO] Storing buildNumber: c38d3127ac3c2335fa7961e7a2395e4c5aba72d8 at timestamp: 1406929941715
[INFO] Executing: /bin/sh -c cd <https://builds.apache.org/job/Tez-Build/ws/docs> &&
git rev-parse --verify HEAD
[INFO] Working directory: <https://builds.apache.org/job/Tez-Build/ws/docs>
[INFO] Storing buildScmBranch: UNKNOWN
[INFO] 
[INFO] --- build-helper-maven-plugin:1.8:maven-version (maven-version) @ tez-docs ---
[INFO] 
[INFO] --- buildnumber-maven-plugin:1.1:create (default) @ tez-docs ---
[INFO] Checking for local modifications: skipped.
[INFO] Updating project files from SCM: skipped.
[INFO] Executing: /bin/sh -c cd <https://builds.apache.org/job/Tez-Build/ws/docs> &&
git rev-parse --verify HEAD
[INFO] Working directory: <https://builds.apache.org/job/Tez-Build/ws/docs>
[INFO] Storing buildNumber: c38d3127ac3c2335fa7961e7a2395e4c5aba72d8 at timestamp: 1406929941726
[INFO] Executing: /bin/sh -c cd <https://builds.apache.org/job/Tez-Build/ws/docs> &&
git rev-parse --verify HEAD
[INFO] Working directory: <https://builds.apache.org/job/Tez-Build/ws/docs>
[INFO] Storing buildScmBranch: UNKNOWN
[INFO] 
[INFO] --- build-helper-maven-plugin:1.8:maven-version (maven-version) @ tez-docs ---
[INFO] 
[INFO] --- maven-jar-plugin:2.4:test-jar (default) @ tez-docs ---
[WARNING] JAR will be empty - no content was marked for inclusion!
[INFO] Building jar: <https://builds.apache.org/job/Tez-Build/ws/docs/target/tez-docs-0.5.0-SNAPSHOT-tests.jar>
[INFO] 
[INFO] --- maven-install-plugin:2.4:install (default-install) @ tez-docs ---
[INFO] Installing <https://builds.apache.org/job/Tez-Build/ws/docs/pom.xml> to /home/jenkins/.m2/repository/org/apache/tez/tez-docs/0.5.0-SNAPSHOT/tez-docs-0.5.0-SNAPSHOT.pom
[INFO] Installing <https://builds.apache.org/job/Tez-Build/ws/docs/target/tez-docs-0.5.0-SNAPSHOT-tests.jar>
to /home/jenkins/.m2/repository/org/apache/tez/tez-docs/0.5.0-SNAPSHOT/tez-docs-0.5.0-SNAPSHOT-tests.jar
[INFO] 
[INFO] --- maven-deploy-plugin:2.8.1:deploy (default-deploy) @ tez-docs ---
[INFO] Skipping artifact deployment
[INFO] 
[INFO] --- buildnumber-maven-plugin:1.1:create (default) @ tez-docs ---
[INFO] Checking for local modifications: skipped.
[INFO] Updating project files from SCM: skipped.
[INFO] Executing: /bin/sh -c cd <https://builds.apache.org/job/Tez-Build/ws/docs> &&
git rev-parse --verify HEAD
[INFO] Working directory: <https://builds.apache.org/job/Tez-Build/ws/docs>
[INFO] Storing buildNumber: c38d3127ac3c2335fa7961e7a2395e4c5aba72d8 at timestamp: 1406929941765
[INFO] Executing: /bin/sh -c cd <https://builds.apache.org/job/Tez-Build/ws/docs> &&
git rev-parse --verify HEAD
[INFO] Working directory: <https://builds.apache.org/job/Tez-Build/ws/docs>
[INFO] Storing buildScmBranch: UNKNOWN
[INFO] 
[INFO] --- build-helper-maven-plugin:1.8:maven-version (maven-version) @ tez-docs ---
[INFO] 
[INFO] --- maven-jar-plugin:2.4:test-jar (default) @ tez-docs ---
[WARNING] JAR will be empty - no content was marked for inclusion!
[INFO] ------------------------------------------------------------------------
[INFO] Reactor Summary:
[INFO] 
[INFO] tez ............................................... SUCCESS [  1.233 s]
[INFO] tez-api ........................................... SUCCESS [ 29.641 s]
[INFO] tez-common ........................................ SUCCESS [  1.669 s]
[INFO] tez-runtime-internals ............................. SUCCESS [  5.822 s]
[INFO] tez-runtime-library ............................... SUCCESS [ 22.216 s]
[INFO] tez-mapreduce ..................................... SUCCESS [ 15.241 s]
[INFO] tez-mapreduce-examples ............................ SUCCESS [  0.987 s]
[INFO] tez-dag ........................................... SUCCESS [ 53.622 s]
[INFO] tez-tests ......................................... FAILURE [14:32 min]
[INFO] tez-plugins ....................................... SUCCESS [  0.094 s]
[INFO] tez-yarn-timeline-history ......................... SUCCESS [  5.672 s]
[INFO] tez-dist .......................................... SKIPPED
[INFO] Tez ............................................... SUCCESS [  0.083 s]
[INFO] ------------------------------------------------------------------------
[INFO] BUILD FAILURE
[INFO] ------------------------------------------------------------------------
[INFO] Total time: 16:49 min
[INFO] Finished at: 2014-08-01T21:52:21+00:00
[INFO] Final Memory: 56M/883M
[INFO] ------------------------------------------------------------------------
[ERROR] Failed to execute goal org.apache.maven.plugins:maven-surefire-plugin:2.14.1:test
(default-test) on project tez-tests: There are test failures.
[ERROR] 
[ERROR] Please refer to <https://builds.apache.org/job/Tez-Build/ws/tez-tests/target/surefire-reports>
for the individual test results.
[ERROR] -> [Help 1]
[ERROR] 
[ERROR] To see the full stack trace of the errors, re-run Maven with the -e switch.
[ERROR] Re-run Maven using the -X switch to enable full debug logging.
[ERROR] 
[ERROR] For more information about the errors and possible solutions, please read the following
articles:
[ERROR] [Help 1] http://cwiki.apache.org/confluence/display/MAVEN/MojoFailureException
[ERROR] 
[ERROR] After correcting the problems, you can resume the build with the command
[ERROR]   mvn <goals> -rf :tez-tests
Build step 'Execute shell' marked build as failure
Archiving artifacts
Sending artifact delta relative to Tez-Build #534
Archived 2 artifacts
Archive block size is 32768
Received 1263 blocks and 2390 bytes
Compression is 100.0%
Took 3.2 sec
Recording test results

Mime
View raw message