tez-dev mailing list archives

Site index · List index
Message view « Date » · « Thread »
Top « Date » · « Thread »
From Apache Jenkins Server <jenk...@builds.apache.org>
Subject Build failed in Jenkins: Tez-Build #591
Date Sat, 23 Aug 2014 03:12:22 GMT
See <https://builds.apache.org/job/Tez-Build/591/changes>

Changes:

[rbalamohan] TEZ-1448. Make WeightedScalingMemoryDistributor as the default memory distributor
(Rajesh Balamohan)

[jeagles] TEZ-1463. Remove dependency on private class org.apache.hadoop.util.StringUtils
(Alexander Pivovarov via jeagles)

------------------------------------------
[...truncated 1525 lines...]
[INFO] --- maven-jar-plugin:2.4:test-jar (default) @ tez-yarn-timeline-history ---
[INFO] Building jar: <https://builds.apache.org/job/Tez-Build/ws/tez-plugins/tez-yarn-timeline-history/target/tez-yarn-timeline-history-0.6.0-SNAPSHOT-tests.jar>
[INFO] 
[INFO] --- maven-install-plugin:2.4:install (default-install) @ tez-yarn-timeline-history
---
[INFO] Installing <https://builds.apache.org/job/Tez-Build/ws/tez-plugins/tez-yarn-timeline-history/target/tez-yarn-timeline-history-0.6.0-SNAPSHOT.jar>
to /home/jenkins/.m2/repository/org/apache/tez/tez-yarn-timeline-history/0.6.0-SNAPSHOT/tez-yarn-timeline-history-0.6.0-SNAPSHOT.jar
[INFO] Installing <https://builds.apache.org/job/Tez-Build/ws/tez-plugins/tez-yarn-timeline-history/pom.xml>
to /home/jenkins/.m2/repository/org/apache/tez/tez-yarn-timeline-history/0.6.0-SNAPSHOT/tez-yarn-timeline-history-0.6.0-SNAPSHOT.pom
[INFO] Installing <https://builds.apache.org/job/Tez-Build/ws/tez-plugins/tez-yarn-timeline-history/target/tez-yarn-timeline-history-0.6.0-SNAPSHOT-tests.jar>
to /home/jenkins/.m2/repository/org/apache/tez/tez-yarn-timeline-history/0.6.0-SNAPSHOT/tez-yarn-timeline-history-0.6.0-SNAPSHOT-tests.jar
[INFO] 
[INFO] --- maven-deploy-plugin:2.8.1:deploy (default-deploy) @ tez-yarn-timeline-history ---
[INFO] Deploying org.apache.tez:tez-yarn-timeline-history:0.6.0-SNAPSHOT at end
[INFO] 
[INFO] --- buildnumber-maven-plugin:1.1:create (default) @ tez-yarn-timeline-history ---
[INFO] Checking for local modifications: skipped.
[INFO] Updating project files from SCM: skipped.
[INFO] Executing: /bin/sh -c cd <https://builds.apache.org/job/Tez-Build/ws/tez-plugins/tez-yarn-timeline-history>
&& git rev-parse --verify HEAD
[INFO] Working directory: <https://builds.apache.org/job/Tez-Build/ws/tez-plugins/tez-yarn-timeline-history>
[INFO] Storing buildNumber: d489dcfc34454c4a487ce13a3c91140d712fdba1 at timestamp: 1408763370145
[INFO] Executing: /bin/sh -c cd <https://builds.apache.org/job/Tez-Build/ws/tez-plugins/tez-yarn-timeline-history>
&& git rev-parse --verify HEAD
[INFO] Working directory: <https://builds.apache.org/job/Tez-Build/ws/tez-plugins/tez-yarn-timeline-history>
[INFO] Storing buildScmBranch: UNKNOWN
[INFO] 
[INFO] --- build-helper-maven-plugin:1.8:maven-version (maven-version) @ tez-yarn-timeline-history
---
[INFO] 
[INFO] --- maven-resources-plugin:2.6:resources (default-resources) @ tez-yarn-timeline-history
---
[INFO] Using 'UTF-8' encoding to copy filtered resources.
[INFO] Copying 2 resources
[INFO] 
[INFO] --- maven-compiler-plugin:3.1:compile (default-compile) @ tez-yarn-timeline-history
---
[INFO] Nothing to compile - all classes are up to date
[INFO] 
[INFO] --- maven-resources-plugin:2.6:testResources (default-testResources) @ tez-yarn-timeline-history
---
[INFO] Using 'UTF-8' encoding to copy filtered resources.
[INFO] Copying 2 resources
[INFO] 
[INFO] --- maven-compiler-plugin:3.1:testCompile (default-testCompile) @ tez-yarn-timeline-history
---
[INFO] Nothing to compile - all classes are up to date
[INFO] 
[INFO] --- maven-surefire-plugin:2.14.1:test (default-test) @ tez-yarn-timeline-history ---
[INFO] Skipping execution of surefire because it has already been run for this configuration
[INFO] 
[INFO] --- maven-jar-plugin:2.4:jar (default-jar) @ tez-yarn-timeline-history ---
[INFO] 
[INFO] --- maven-jar-plugin:2.4:test-jar (default) @ tez-yarn-timeline-history ---
[INFO]                                                                         
[INFO] ------------------------------------------------------------------------
[INFO] Building tez-dist 0.6.0-SNAPSHOT
[INFO] ------------------------------------------------------------------------
[INFO] 
[INFO] --- maven-clean-plugin:2.5:clean (default-clean) @ tez-dist ---
[INFO] Deleting <https://builds.apache.org/job/Tez-Build/ws/tez-dist/target>
[INFO] 
[INFO] --- buildnumber-maven-plugin:1.1:create (default) @ tez-dist ---
[INFO] Checking for local modifications: skipped.
[INFO] Updating project files from SCM: skipped.
[INFO] Executing: /bin/sh -c cd <https://builds.apache.org/job/Tez-Build/ws/tez-dist>
&& git rev-parse --verify HEAD
[INFO] Working directory: <https://builds.apache.org/job/Tez-Build/ws/tez-dist>
[INFO] Storing buildNumber: d489dcfc34454c4a487ce13a3c91140d712fdba1 at timestamp: 1408763370315
[INFO] Executing: /bin/sh -c cd <https://builds.apache.org/job/Tez-Build/ws/tez-dist>
&& git rev-parse --verify HEAD
[INFO] Working directory: <https://builds.apache.org/job/Tez-Build/ws/tez-dist>
[INFO] Storing buildScmBranch: UNKNOWN
[INFO] 
[INFO] --- build-helper-maven-plugin:1.8:maven-version (maven-version) @ tez-dist ---
[INFO] 
[INFO] --- buildnumber-maven-plugin:1.1:create (default) @ tez-dist ---
[INFO] Checking for local modifications: skipped.
[INFO] Updating project files from SCM: skipped.
[INFO] Executing: /bin/sh -c cd <https://builds.apache.org/job/Tez-Build/ws/tez-dist>
&& git rev-parse --verify HEAD
[INFO] Working directory: <https://builds.apache.org/job/Tez-Build/ws/tez-dist>
[INFO] Storing buildNumber: d489dcfc34454c4a487ce13a3c91140d712fdba1 at timestamp: 1408763370327
[INFO] Executing: /bin/sh -c cd <https://builds.apache.org/job/Tez-Build/ws/tez-dist>
&& git rev-parse --verify HEAD
[INFO] Working directory: <https://builds.apache.org/job/Tez-Build/ws/tez-dist>
[INFO] Storing buildScmBranch: UNKNOWN
[INFO] 
[INFO] --- build-helper-maven-plugin:1.8:maven-version (maven-version) @ tez-dist ---
[INFO] 
[INFO] --- maven-assembly-plugin:2.4:single (package-tez) @ tez-dist ---
[INFO] Reading assembly descriptor: src/main/assembly/tez-dist.xml
[WARNING] NOTE: Currently, inclusion of module dependencies may produce unpredictable results
if a version conflict occurs.
[INFO] Copying files to <https://builds.apache.org/job/Tez-Build/ws/tez-dist/target/tez-0.6.0-SNAPSHOT>
[WARNING] NOTE: Currently, inclusion of module dependencies may produce unpredictable results
if a version conflict occurs.
[INFO] Building tar: <https://builds.apache.org/job/Tez-Build/591/artifact/tez-dist/target/tez-0.6.0-SNAPSHOT.tar.gz>
[INFO] 
[INFO] --- maven-assembly-plugin:2.4:single (package-tez-minimal) @ tez-dist ---
[INFO] Reading assembly descriptor: src/main/assembly/tez-dist-minimal.xml
[WARNING] NOTE: Currently, inclusion of module dependencies may produce unpredictable results
if a version conflict occurs.
[INFO] Building tar: <https://builds.apache.org/job/Tez-Build/591/artifact/tez-dist/target/tez-0.6.0-SNAPSHOT-minimal.tar.gz>
[INFO] 
[INFO] --- maven-jar-plugin:2.4:test-jar (default) @ tez-dist ---
[WARNING] JAR will be empty - no content was marked for inclusion!
[INFO] Building jar: <https://builds.apache.org/job/Tez-Build/ws/tez-dist/target/tez-dist-0.6.0-SNAPSHOT-tests.jar>
[INFO] 
[INFO] --- maven-install-plugin:2.4:install (default-install) @ tez-dist ---
[INFO] Installing <https://builds.apache.org/job/Tez-Build/ws/tez-dist/pom.xml> to /home/jenkins/.m2/repository/org/apache/tez/tez-dist/0.6.0-SNAPSHOT/tez-dist-0.6.0-SNAPSHOT.pom
[INFO] Installing <https://builds.apache.org/job/Tez-Build/ws/tez-dist/target/tez-dist-0.6.0-SNAPSHOT-tests.jar>
to /home/jenkins/.m2/repository/org/apache/tez/tez-dist/0.6.0-SNAPSHOT/tez-dist-0.6.0-SNAPSHOT-tests.jar
[INFO] 
[INFO] --- maven-deploy-plugin:2.8.1:deploy (default-deploy) @ tez-dist ---
[INFO] Skipping artifact deployment
[INFO] 
[INFO] --- buildnumber-maven-plugin:1.1:create (default) @ tez-dist ---
[INFO] Checking for local modifications: skipped.
[INFO] Updating project files from SCM: skipped.
[INFO] Executing: /bin/sh -c cd <https://builds.apache.org/job/Tez-Build/ws/tez-dist>
&& git rev-parse --verify HEAD
[INFO] Working directory: <https://builds.apache.org/job/Tez-Build/ws/tez-dist>
[INFO] Storing buildNumber: d489dcfc34454c4a487ce13a3c91140d712fdba1 at timestamp: 1408763388996
[INFO] Executing: /bin/sh -c cd <https://builds.apache.org/job/Tez-Build/ws/tez-dist>
&& git rev-parse --verify HEAD
[INFO] Working directory: <https://builds.apache.org/job/Tez-Build/ws/tez-dist>
[INFO] Storing buildScmBranch: UNKNOWN
[INFO] 
[INFO] --- build-helper-maven-plugin:1.8:maven-version (maven-version) @ tez-dist ---
[INFO] 
[INFO] --- maven-assembly-plugin:2.4:single (package-tez) @ tez-dist ---
[INFO] Reading assembly descriptor: src/main/assembly/tez-dist.xml
[WARNING] NOTE: Currently, inclusion of module dependencies may produce unpredictable results
if a version conflict occurs.
[INFO] Copying files to <https://builds.apache.org/job/Tez-Build/ws/tez-dist/target/tez-0.6.0-SNAPSHOT>
[WARNING] NOTE: Currently, inclusion of module dependencies may produce unpredictable results
if a version conflict occurs.
[INFO] Building tar: <https://builds.apache.org/job/Tez-Build/591/artifact/tez-dist/target/tez-0.6.0-SNAPSHOT.tar.gz>
[INFO] 
[INFO] --- maven-assembly-plugin:2.4:single (package-tez-minimal) @ tez-dist ---
[INFO] Reading assembly descriptor: src/main/assembly/tez-dist-minimal.xml
[WARNING] NOTE: Currently, inclusion of module dependencies may produce unpredictable results
if a version conflict occurs.
[INFO] Building tar: <https://builds.apache.org/job/Tez-Build/591/artifact/tez-dist/target/tez-0.6.0-SNAPSHOT-minimal.tar.gz>
[INFO] 
[INFO] --- maven-jar-plugin:2.4:test-jar (default) @ tez-dist ---
[WARNING] JAR will be empty - no content was marked for inclusion!
[INFO]                                                                         
[INFO] ------------------------------------------------------------------------
[INFO] Building Tez 0.6.0-SNAPSHOT
[INFO] ------------------------------------------------------------------------
[INFO] 
[INFO] --- maven-clean-plugin:2.5:clean (default-clean) @ tez-docs ---
[INFO] Deleting <https://builds.apache.org/job/Tez-Build/ws/docs/target>
[INFO] 
[INFO] --- buildnumber-maven-plugin:1.1:create (default) @ tez-docs ---
[INFO] Checking for local modifications: skipped.
[INFO] Updating project files from SCM: skipped.
[INFO] Executing: /bin/sh -c cd <https://builds.apache.org/job/Tez-Build/ws/docs> &&
git rev-parse --verify HEAD
[INFO] Working directory: <https://builds.apache.org/job/Tez-Build/ws/docs>
[INFO] Storing buildNumber: d489dcfc34454c4a487ce13a3c91140d712fdba1 at timestamp: 1408763405598
[INFO] Executing: /bin/sh -c cd <https://builds.apache.org/job/Tez-Build/ws/docs> &&
git rev-parse --verify HEAD
[INFO] Working directory: <https://builds.apache.org/job/Tez-Build/ws/docs>
[INFO] Storing buildScmBranch: UNKNOWN
[INFO] 
[INFO] --- build-helper-maven-plugin:1.8:maven-version (maven-version) @ tez-docs ---
[INFO] 
[INFO] --- buildnumber-maven-plugin:1.1:create (default) @ tez-docs ---
[INFO] Checking for local modifications: skipped.
[INFO] Updating project files from SCM: skipped.
[INFO] Executing: /bin/sh -c cd <https://builds.apache.org/job/Tez-Build/ws/docs> &&
git rev-parse --verify HEAD
[INFO] Working directory: <https://builds.apache.org/job/Tez-Build/ws/docs>
[INFO] Storing buildNumber: d489dcfc34454c4a487ce13a3c91140d712fdba1 at timestamp: 1408763405611
[INFO] Executing: /bin/sh -c cd <https://builds.apache.org/job/Tez-Build/ws/docs> &&
git rev-parse --verify HEAD
[INFO] Working directory: <https://builds.apache.org/job/Tez-Build/ws/docs>
[INFO] Storing buildScmBranch: UNKNOWN
[INFO] 
[INFO] --- build-helper-maven-plugin:1.8:maven-version (maven-version) @ tez-docs ---
[INFO] 
[INFO] --- maven-jar-plugin:2.4:test-jar (default) @ tez-docs ---
[WARNING] JAR will be empty - no content was marked for inclusion!
[INFO] Building jar: <https://builds.apache.org/job/Tez-Build/ws/docs/target/tez-docs-0.6.0-SNAPSHOT-tests.jar>
[INFO] 
[INFO] --- maven-install-plugin:2.4:install (default-install) @ tez-docs ---
[INFO] Installing <https://builds.apache.org/job/Tez-Build/ws/docs/pom.xml> to /home/jenkins/.m2/repository/org/apache/tez/tez-docs/0.6.0-SNAPSHOT/tez-docs-0.6.0-SNAPSHOT.pom
[INFO] Installing <https://builds.apache.org/job/Tez-Build/ws/docs/target/tez-docs-0.6.0-SNAPSHOT-tests.jar>
to /home/jenkins/.m2/repository/org/apache/tez/tez-docs/0.6.0-SNAPSHOT/tez-docs-0.6.0-SNAPSHOT-tests.jar
[INFO] 
[INFO] --- maven-deploy-plugin:2.8.1:deploy (default-deploy) @ tez-docs ---
[INFO] Skipping artifact deployment
Downloading: https://repository.apache.org/content/repositories/snapshots/org/apache/tez/tez/0.6.0-SNAPSHOT/maven-metadata.xml
806/806 B   
            
Downloaded: https://repository.apache.org/content/repositories/snapshots/org/apache/tez/tez/0.6.0-SNAPSHOT/maven-metadata.xml
(806 B at 0.2 KB/sec)
Uploading: https://repository.apache.org/content/repositories/snapshots/org/apache/tez/tez/0.6.0-SNAPSHOT/tez-0.6.0-20140823.031009-2.pom
2/33 KB     
4/33 KB   
6/33 KB   
8/33 KB   
10/33 KB   
12/33 KB   
14/33 KB   
16/33 KB   
18/33 KB   
20/33 KB   
22/33 KB   
24/33 KB   
26/33 KB   
28/33 KB   
30/33 KB   
32/33 KB   
33/33 KB   
           
Uploaded: https://repository.apache.org/content/repositories/snapshots/org/apache/tez/tez/0.6.0-SNAPSHOT/tez-0.6.0-20140823.031009-2.pom
(33 KB at 3.6 KB/sec)
Downloading: https://repository.apache.org/content/repositories/snapshots/org/apache/tez/tez/maven-metadata.xml
479/479 B   
            
Downloaded: https://repository.apache.org/content/repositories/snapshots/org/apache/tez/tez/maven-metadata.xml
(479 B at 0.2 KB/sec)
Uploading: https://repository.apache.org/content/repositories/snapshots/org/apache/tez/tez/0.6.0-SNAPSHOT/maven-metadata.xml
806/806 B   
            
Uploaded: https://repository.apache.org/content/repositories/snapshots/org/apache/tez/tez/0.6.0-SNAPSHOT/maven-metadata.xml
(806 B at 0.2 KB/sec)
Uploading: https://repository.apache.org/content/repositories/snapshots/org/apache/tez/tez/maven-metadata.xml
479/479 B   
            
Uploaded: https://repository.apache.org/content/repositories/snapshots/org/apache/tez/tez/maven-metadata.xml
(479 B at 0.0 KB/sec)
Uploading: https://repository.apache.org/content/repositories/snapshots/org/apache/tez/tez/0.6.0-SNAPSHOT/tez-0.6.0-20140823.031009-2-tests.jar
2/6 KB      
4/6 KB   
6/6 KB   
         
[INFO] ------------------------------------------------------------------------
[INFO] Reactor Summary:
[INFO] 
[INFO] tez ............................................... SUCCESS [  1.267 s]
[INFO] tez-api ........................................... SUCCESS [ 30.199 s]
[INFO] tez-common ........................................ SUCCESS [  1.785 s]
[INFO] tez-runtime-internals ............................. SUCCESS [  5.985 s]
[INFO] tez-runtime-library ............................... SUCCESS [ 25.439 s]
[INFO] tez-mapreduce ..................................... SUCCESS [ 15.601 s]
[INFO] tez-examples ...................................... SUCCESS [  0.405 s]
[INFO] tez-dag ........................................... SUCCESS [01:18 min]
[INFO] tez-tests ......................................... SUCCESS [15:59 min]
[INFO] tez-plugins ....................................... SUCCESS [  0.098 s]
[INFO] tez-yarn-timeline-history ......................... SUCCESS [  5.699 s]
[INFO] tez-dist .......................................... SUCCESS [ 35.366 s]
[INFO] Tez ............................................... FAILURE [01:31 min]
[INFO] ------------------------------------------------------------------------
[INFO] BUILD FAILURE
[INFO] ------------------------------------------------------------------------
[INFO] Total time: 20:51 min
[INFO] Finished at: 2014-08-23T03:11:36+00:00
[INFO] Final Memory: 61M/1184M
[INFO] ------------------------------------------------------------------------
[ERROR] Failed to execute goal org.apache.maven.plugins:maven-deploy-plugin:2.8.1:deploy (default-deploy)
on project tez-docs: Failed to deploy artifacts: Could not transfer artifact org.apache.tez:tez:jar:tests:0.6.0-20140823.031009-2
from/to apache.snapshots.https (https://repository.apache.org/content/repositories/snapshots):
Failed to transfer file: https://repository.apache.org/content/repositories/snapshots/org/apache/tez/tez/0.6.0-SNAPSHOT/tez-0.6.0-20140823.031009-2-tests.jar.
Return code is: 502, ReasonPhrase: Proxy Error. -> [Help 1]
[ERROR] 
[ERROR] To see the full stack trace of the errors, re-run Maven with the -e switch.
[ERROR] Re-run Maven using the -X switch to enable full debug logging.
[ERROR] 
[ERROR] For more information about the errors and possible solutions, please read the following
articles:
[ERROR] [Help 1] http://cwiki.apache.org/confluence/display/MAVEN/MojoExecutionException
[ERROR] 
[ERROR] After correcting the problems, you can resume the build with the command
[ERROR]   mvn <goals> -rf :tez-docs
Build step 'Execute shell' marked build as failure
Archiving artifacts
Sending artifact delta relative to Tez-Build #590
Archived 2 artifacts
Archive block size is 32768
Received 0 blocks and 41471624 bytes
Compression is 0.0%
Took 33 sec
Recording test results

Mime
View raw message