tez-dev mailing list archives

Site index · List index
Message view « Date » · « Thread »
Top « Date » · « Thread »
From Apache Jenkins Server <jenk...@builds.apache.org>
Subject Build failed in Jenkins: Tez-Build #680
Date Fri, 17 Oct 2014 00:14:19 GMT
See <https://builds.apache.org/job/Tez-Build/680/changes>

Changes:

[sseth] TEZ-1674. Rename configuration parameters related to counters / memory

[hitesh] TEZ-1176. Set parallelism should end up sending an update to ATS if numTasks are
updated at run-time. (hitesh)

[hitesh] TEZ-1658. Additional data generation to Timeline for UI. (hitesh)

------------------------------------------
[...truncated 1417 lines...]
[INFO] Using 'UTF-8' encoding to copy filtered resources.
[INFO] Copying 2 resources
[INFO] 
[INFO] --- maven-compiler-plugin:3.1:compile (default-compile) @ tez-tests ---
[INFO] Nothing to compile - all classes are up to date
[INFO] 
[INFO] --- maven-resources-plugin:2.6:testResources (default-testResources) @ tez-tests ---
[INFO] Using 'UTF-8' encoding to copy filtered resources.
[INFO] Copying 2 resources
[INFO] 
[INFO] --- maven-compiler-plugin:3.1:testCompile (default-testCompile) @ tez-tests ---
[INFO] Nothing to compile - all classes are up to date
[INFO] 
[INFO] --- maven-surefire-plugin:2.14.1:test (default-test) @ tez-tests ---
[INFO] Skipping execution of surefire because it has already been run for this configuration
[INFO] 
[INFO] --- maven-jar-plugin:2.4:jar (default-jar) @ tez-tests ---
[INFO] 
[INFO] --- maven-jar-plugin:2.4:test-jar (default) @ tez-tests ---
[INFO]                                                                         
[INFO] ------------------------------------------------------------------------
[INFO] Building tez-plugins 0.6.0-SNAPSHOT
[INFO] ------------------------------------------------------------------------
[INFO] 
[INFO] --- maven-clean-plugin:2.5:clean (default-clean) @ tez-plugins ---
[INFO] Deleting <https://builds.apache.org/job/Tez-Build/ws/tez-plugins/target>
[INFO] 
[INFO] --- buildnumber-maven-plugin:1.1:create (default) @ tez-plugins ---
[INFO] Checking for local modifications: skipped.
[INFO] Updating project files from SCM: skipped.
[INFO] Executing: /bin/sh -c cd <https://builds.apache.org/job/Tez-Build/ws/tez-plugins>
&& git rev-parse --verify HEAD
[INFO] Working directory: <https://builds.apache.org/job/Tez-Build/ws/tez-plugins>
[INFO] Storing buildNumber: 190a74fdc28655f8ca1a3946687aad40c8254ad0 at timestamp: 1413504832096
[INFO] Executing: /bin/sh -c cd <https://builds.apache.org/job/Tez-Build/ws/tez-plugins>
&& git rev-parse --verify HEAD
[INFO] Working directory: <https://builds.apache.org/job/Tez-Build/ws/tez-plugins>
[INFO] Storing buildScmBranch: UNKNOWN
[INFO] 
[INFO] --- build-helper-maven-plugin:1.8:maven-version (maven-version) @ tez-plugins ---
[INFO] 
[INFO] --- buildnumber-maven-plugin:1.1:create (default) @ tez-plugins ---
[INFO] Checking for local modifications: skipped.
[INFO] Updating project files from SCM: skipped.
[INFO] Executing: /bin/sh -c cd <https://builds.apache.org/job/Tez-Build/ws/tez-plugins>
&& git rev-parse --verify HEAD
[INFO] Working directory: <https://builds.apache.org/job/Tez-Build/ws/tez-plugins>
[INFO] Storing buildNumber: 190a74fdc28655f8ca1a3946687aad40c8254ad0 at timestamp: 1413504832106
[INFO] Executing: /bin/sh -c cd <https://builds.apache.org/job/Tez-Build/ws/tez-plugins>
&& git rev-parse --verify HEAD
[INFO] Working directory: <https://builds.apache.org/job/Tez-Build/ws/tez-plugins>
[INFO] Storing buildScmBranch: UNKNOWN
[INFO] 
[INFO] --- build-helper-maven-plugin:1.8:maven-version (maven-version) @ tez-plugins ---
[INFO] 
[INFO] --- maven-jar-plugin:2.4:test-jar (default) @ tez-plugins ---
[WARNING] JAR will be empty - no content was marked for inclusion!
[INFO] Building jar: <https://builds.apache.org/job/Tez-Build/ws/tez-plugins/target/tez-plugins-0.6.0-SNAPSHOT-tests.jar>
[INFO] 
[INFO] --- maven-install-plugin:2.4:install (default-install) @ tez-plugins ---
[INFO] Installing <https://builds.apache.org/job/Tez-Build/ws/tez-plugins/pom.xml> to
/home/jenkins/.m2/repository/org/apache/tez/tez-plugins/0.6.0-SNAPSHOT/tez-plugins-0.6.0-SNAPSHOT.pom
[INFO] Installing <https://builds.apache.org/job/Tez-Build/ws/tez-plugins/target/tez-plugins-0.6.0-SNAPSHOT-tests.jar>
to /home/jenkins/.m2/repository/org/apache/tez/tez-plugins/0.6.0-SNAPSHOT/tez-plugins-0.6.0-SNAPSHOT-tests.jar
[INFO] 
[INFO] --- maven-deploy-plugin:2.8.1:deploy (default-deploy) @ tez-plugins ---
[INFO] Deploying org.apache.tez:tez-plugins:0.6.0-SNAPSHOT at end
[INFO] 
[INFO] --- buildnumber-maven-plugin:1.1:create (default) @ tez-plugins ---
[INFO] Checking for local modifications: skipped.
[INFO] Updating project files from SCM: skipped.
[INFO] Executing: /bin/sh -c cd <https://builds.apache.org/job/Tez-Build/ws/tez-plugins>
&& git rev-parse --verify HEAD
[INFO] Working directory: <https://builds.apache.org/job/Tez-Build/ws/tez-plugins>
[INFO] Storing buildNumber: 190a74fdc28655f8ca1a3946687aad40c8254ad0 at timestamp: 1413504832151
[INFO] Executing: /bin/sh -c cd <https://builds.apache.org/job/Tez-Build/ws/tez-plugins>
&& git rev-parse --verify HEAD
[INFO] Working directory: <https://builds.apache.org/job/Tez-Build/ws/tez-plugins>
[INFO] Storing buildScmBranch: UNKNOWN
[INFO] 
[INFO] --- build-helper-maven-plugin:1.8:maven-version (maven-version) @ tez-plugins ---
[INFO] 
[INFO] --- maven-jar-plugin:2.4:test-jar (default) @ tez-plugins ---
[WARNING] JAR will be empty - no content was marked for inclusion!
[INFO]                                                                         
[INFO] ------------------------------------------------------------------------
[INFO] Building tez-yarn-timeline-history 0.6.0-SNAPSHOT
[INFO] ------------------------------------------------------------------------
[INFO] 
[INFO] --- maven-clean-plugin:2.5:clean (default-clean) @ tez-yarn-timeline-history ---
[INFO] Deleting <https://builds.apache.org/job/Tez-Build/ws/tez-plugins/tez-yarn-timeline-history/target>
[INFO] 
[INFO] --- buildnumber-maven-plugin:1.1:create (default) @ tez-yarn-timeline-history ---
[INFO] Checking for local modifications: skipped.
[INFO] Updating project files from SCM: skipped.
[INFO] Executing: /bin/sh -c cd <https://builds.apache.org/job/Tez-Build/ws/tez-plugins/tez-yarn-timeline-history>
&& git rev-parse --verify HEAD
[INFO] Working directory: <https://builds.apache.org/job/Tez-Build/ws/tez-plugins/tez-yarn-timeline-history>
[INFO] Storing buildNumber: 190a74fdc28655f8ca1a3946687aad40c8254ad0 at timestamp: 1413504832226
[INFO] Executing: /bin/sh -c cd <https://builds.apache.org/job/Tez-Build/ws/tez-plugins/tez-yarn-timeline-history>
&& git rev-parse --verify HEAD
[INFO] Working directory: <https://builds.apache.org/job/Tez-Build/ws/tez-plugins/tez-yarn-timeline-history>
[INFO] Storing buildScmBranch: UNKNOWN
[INFO] 
[INFO] --- build-helper-maven-plugin:1.8:maven-version (maven-version) @ tez-yarn-timeline-history
---
[INFO] 
[INFO] --- maven-resources-plugin:2.6:resources (default-resources) @ tez-yarn-timeline-history
---
[INFO] Using 'UTF-8' encoding to copy filtered resources.
[INFO] Copying 2 resources
[INFO] 
[INFO] --- maven-compiler-plugin:3.1:compile (default-compile) @ tez-yarn-timeline-history
---
[INFO] Changes detected - recompiling the module!
[INFO] Compiling 2 source files to <https://builds.apache.org/job/Tez-Build/ws/tez-plugins/tez-yarn-timeline-history/target/classes>
[INFO] 
[INFO] --- maven-resources-plugin:2.6:testResources (default-testResources) @ tez-yarn-timeline-history
---
[INFO] Using 'UTF-8' encoding to copy filtered resources.
[INFO] Copying 2 resources
[INFO] 
[INFO] --- maven-compiler-plugin:3.1:testCompile (default-testCompile) @ tez-yarn-timeline-history
---
[INFO] Changes detected - recompiling the module!
[INFO] Compiling 2 source files to <https://builds.apache.org/job/Tez-Build/ws/tez-plugins/tez-yarn-timeline-history/target/test-classes>
[WARNING] Note: <https://builds.apache.org/job/Tez-Build/ws/tez-plugins/tez-yarn-timeline-history/src/test/java/org/apache/tez/dag/history/logging/ats/TestHistoryEventTimelineConversion.java>
uses unchecked or unsafe operations.
[WARNING] Note: Recompile with -Xlint:unchecked for details.
[INFO] 
[INFO] --- maven-surefire-plugin:2.14.1:test (default-test) @ tez-yarn-timeline-history ---
[INFO] Surefire report directory: <https://builds.apache.org/job/Tez-Build/ws/tez-plugins/tez-yarn-timeline-history/target/surefire-reports>

-------------------------------------------------------
 T E S T S
-------------------------------------------------------

-------------------------------------------------------
 T E S T S
-------------------------------------------------------
Running org.apache.tez.dag.history.logging.ats.TestATSHistoryLoggingService
Tests run: 1, Failures: 0, Errors: 0, Skipped: 0, Time elapsed: 4.554 sec
Running org.apache.tez.dag.history.logging.ats.TestHistoryEventTimelineConversion
Tests run: 2, Failures: 0, Errors: 1, Skipped: 0, Time elapsed: 0.379 sec <<< FAILURE!
testHandlerExists(org.apache.tez.dag.history.logging.ats.TestHistoryEventTimelineConversion)
 Time elapsed: 0.016 sec  <<< ERROR!
java.lang.NullPointerException: null
	at org.apache.tez.dag.history.logging.ats.HistoryEventTimelineConversion.convertVertexParallelismUpdatedEvent(HistoryEventTimelineConversion.java:503)
	at org.apache.tez.dag.history.logging.ats.HistoryEventTimelineConversion.convertToTimelineEntity(HistoryEventTimelineConversion.java:107)
	at org.apache.tez.dag.history.logging.ats.TestHistoryEventTimelineConversion.testHandlerExists(TestHistoryEventTimelineConversion.java:182)


Results :

Tests in error: 
  TestHistoryEventTimelineConversion.testHandlerExists:182 ยป NullPointer

Tests run: 3, Failures: 0, Errors: 1, Skipped: 0

[INFO]                                                                         
[INFO] ------------------------------------------------------------------------
[INFO] Skipping tez-dist
[INFO] This project has been banned from the build due to previous failures.
[INFO] ------------------------------------------------------------------------
[INFO]                                                                         
[INFO] ------------------------------------------------------------------------
[INFO] Building Tez 0.6.0-SNAPSHOT
[INFO] ------------------------------------------------------------------------
[INFO] 
[INFO] --- maven-clean-plugin:2.5:clean (default-clean) @ tez-docs ---
[INFO] Deleting <https://builds.apache.org/job/Tez-Build/ws/docs/target>
[INFO] 
[INFO] --- buildnumber-maven-plugin:1.1:create (default) @ tez-docs ---
[INFO] Checking for local modifications: skipped.
[INFO] Updating project files from SCM: skipped.
[INFO] Executing: /bin/sh -c cd <https://builds.apache.org/job/Tez-Build/ws/docs> &&
git rev-parse --verify HEAD
[INFO] Working directory: <https://builds.apache.org/job/Tez-Build/ws/docs>
[INFO] Storing buildNumber: 190a74fdc28655f8ca1a3946687aad40c8254ad0 at timestamp: 1413504837743
[INFO] Executing: /bin/sh -c cd <https://builds.apache.org/job/Tez-Build/ws/docs> &&
git rev-parse --verify HEAD
[INFO] Working directory: <https://builds.apache.org/job/Tez-Build/ws/docs>
[INFO] Storing buildScmBranch: UNKNOWN
[INFO] 
[INFO] --- build-helper-maven-plugin:1.8:maven-version (maven-version) @ tez-docs ---
[INFO] 
[INFO] --- buildnumber-maven-plugin:1.1:create (default) @ tez-docs ---
[INFO] Checking for local modifications: skipped.
[INFO] Updating project files from SCM: skipped.
[INFO] Executing: /bin/sh -c cd <https://builds.apache.org/job/Tez-Build/ws/docs> &&
git rev-parse --verify HEAD
[INFO] Working directory: <https://builds.apache.org/job/Tez-Build/ws/docs>
[INFO] Storing buildNumber: 190a74fdc28655f8ca1a3946687aad40c8254ad0 at timestamp: 1413504837753
[INFO] Executing: /bin/sh -c cd <https://builds.apache.org/job/Tez-Build/ws/docs> &&
git rev-parse --verify HEAD
[INFO] Working directory: <https://builds.apache.org/job/Tez-Build/ws/docs>
[INFO] Storing buildScmBranch: UNKNOWN
[INFO] 
[INFO] --- build-helper-maven-plugin:1.8:maven-version (maven-version) @ tez-docs ---
[INFO] 
[INFO] --- maven-jar-plugin:2.4:test-jar (default) @ tez-docs ---
[WARNING] JAR will be empty - no content was marked for inclusion!
[INFO] Building jar: <https://builds.apache.org/job/Tez-Build/ws/docs/target/tez-docs-0.6.0-SNAPSHOT-tests.jar>
[INFO] 
[INFO] --- maven-install-plugin:2.4:install (default-install) @ tez-docs ---
[INFO] Installing <https://builds.apache.org/job/Tez-Build/ws/docs/pom.xml> to /home/jenkins/.m2/repository/org/apache/tez/tez-docs/0.6.0-SNAPSHOT/tez-docs-0.6.0-SNAPSHOT.pom
[INFO] Installing <https://builds.apache.org/job/Tez-Build/ws/docs/target/tez-docs-0.6.0-SNAPSHOT-tests.jar>
to /home/jenkins/.m2/repository/org/apache/tez/tez-docs/0.6.0-SNAPSHOT/tez-docs-0.6.0-SNAPSHOT-tests.jar
[INFO] 
[INFO] --- maven-deploy-plugin:2.8.1:deploy (default-deploy) @ tez-docs ---
[INFO] Skipping artifact deployment
[INFO] 
[INFO] --- buildnumber-maven-plugin:1.1:create (default) @ tez-docs ---
[INFO] Checking for local modifications: skipped.
[INFO] Updating project files from SCM: skipped.
[INFO] Executing: /bin/sh -c cd <https://builds.apache.org/job/Tez-Build/ws/docs> &&
git rev-parse --verify HEAD
[INFO] Working directory: <https://builds.apache.org/job/Tez-Build/ws/docs>
[INFO] Storing buildNumber: 190a74fdc28655f8ca1a3946687aad40c8254ad0 at timestamp: 1413504837792
[INFO] Executing: /bin/sh -c cd <https://builds.apache.org/job/Tez-Build/ws/docs> &&
git rev-parse --verify HEAD
[INFO] Working directory: <https://builds.apache.org/job/Tez-Build/ws/docs>
[INFO] Storing buildScmBranch: UNKNOWN
[INFO] 
[INFO] --- build-helper-maven-plugin:1.8:maven-version (maven-version) @ tez-docs ---
[INFO] 
[INFO] --- maven-jar-plugin:2.4:test-jar (default) @ tez-docs ---
[WARNING] JAR will be empty - no content was marked for inclusion!
[INFO] ------------------------------------------------------------------------
[INFO] Reactor Summary:
[INFO] 
[INFO] tez ............................................... SUCCESS [  1.334 s]
[INFO] tez-api ........................................... SUCCESS [ 33.392 s]
[INFO] tez-common ........................................ SUCCESS [  1.762 s]
[INFO] tez-runtime-internals ............................. SUCCESS [  5.695 s]
[INFO] tez-runtime-library ............................... SUCCESS [ 29.858 s]
[INFO] tez-mapreduce ..................................... SUCCESS [ 16.765 s]
[INFO] tez-examples ...................................... SUCCESS [  0.361 s]
[INFO] tez-dag ........................................... SUCCESS [01:41 min]
[INFO] tez-tests ......................................... SUCCESS [20:47 min]
[INFO] tez-plugins ....................................... SUCCESS [  0.085 s]
[INFO] tez-yarn-timeline-history ......................... FAILURE [  5.561 s]
[INFO] tez-dist .......................................... SKIPPED
[INFO] Tez ............................................... SUCCESS [  0.080 s]
[INFO] ------------------------------------------------------------------------
[INFO] BUILD FAILURE
[INFO] ------------------------------------------------------------------------
[INFO] Total time: 24:04 min
[INFO] Finished at: 2014-10-17T00:13:57+00:00
[INFO] Final Memory: 57M/935M
[INFO] ------------------------------------------------------------------------
[ERROR] Failed to execute goal org.apache.maven.plugins:maven-surefire-plugin:2.14.1:test
(default-test) on project tez-yarn-timeline-history: There are test failures.
[ERROR] 
[ERROR] Please refer to <https://builds.apache.org/job/Tez-Build/ws/tez-plugins/tez-yarn-timeline-history/target/surefire-reports>
for the individual test results.
[ERROR] -> [Help 1]
[ERROR] 
[ERROR] To see the full stack trace of the errors, re-run Maven with the -e switch.
[ERROR] Re-run Maven using the -X switch to enable full debug logging.
[ERROR] 
[ERROR] For more information about the errors and possible solutions, please read the following
articles:
[ERROR] [Help 1] http://cwiki.apache.org/confluence/display/MAVEN/MojoFailureException
[ERROR] 
[ERROR] After correcting the problems, you can resume the build with the command
[ERROR]   mvn <goals> -rf :tez-yarn-timeline-history
Build step 'Execute shell' marked build as failure
Archiving artifacts
Sending artifact delta relative to Tez-Build #678
Archived 2 artifacts
Archive block size is 32768
Received 1266 blocks and 27705 bytes
Compression is 99.9%
Took 6.4 sec
Recording test results

Mime
View raw message